{"text_format":"3","workbook":"xlsx","n_sheets":16,"sheets":["Intro","Sheet1","Sheet2 Edit","Stats","Sheet5","Bulls","Phantoms","Gators","Knights","Drillers","Hornets","Wolves","Comets","Schedule 60","Sheet2","Sheet4"],"not_rendered":{"images":14,"macros":1,"external_links":1,"defined_names":1},"read":"whole","date_system":"1900"}

{"sheet":"Intro","index":0,"n_rows":0,"n_cols":0,"rows_kept":0}

{"sheet":"Sheet1","index":1,"n_rows":1818,"n_cols":95,"rows_kept":1818,"merged":[[1,5,1,6],[1,28,1,29],[1,59,1,60],[1,87,20,87],[3,51,3,52],[3,66,3,67],[3,70,3,72],[6,49,6,52],[7,66,7,68],[7,70,7,72],[8,56,8,57],[8,63,8,64],[13,53,13,54],[13,66,13,67],[14,58,14,59],[17,69,26,69],[22,60,22,61],[36,34,36,37],[36,39,36,42],[36,44,36,47],[36,49,36,52],[36,54,36,57],[37,30,37,32],[38,30,38,32],[38,66,38,68],[39,30,39,32],[39,66,39,68],[40,30,40,32],[40,66,40,68],[43,35,43,37],[43,44,43,46],[43,55,43,57],[44,35,44,37],[44,44,44,46],[44,54,44,58],[44,62,44,66],[45,35,45,37],[45,44,45,46],[46,35,46,37],[46,44,46,46],[46,54,46,58],[46,62,46,66],[47,35,47,37],[47,44,47,46],[48,35,48,37],[48,44,48,46],[49,35,49,37],[49,44,49,46],[50,35,50,37],[50,44,50,46],[51,35,51,37],[51,44,51,46],[51,54,51,59],[51,62,51,67],[52,35,52,37],[52,44,52,46]]}
[76,{"$nulls":7},"DH?",{"$nulls":22},"DH?",{"$nulls":61},{"$f":"RAND()","v":0.46656990254668784},10]
[null,"R/L","B+R","L/L",null,{"$f":"'Sheet2 Edit'!F1","v":"Gators"},null,null,{"$f":"IF(COUNTIF(I5:I13,\"DH\"),\"Yes\",\"No\")","v":"Yes"},{"$nulls":19},{"$f":"'Sheet2 Edit'!AE1","v":"Hornets"},null,null,{"$f":"IF(COUNTIF(AF5:AF13,\"DH\"),\"Yes\",\"No\")","v":"Yes"},{"$nulls":26},"CF",{"$f":"IF(BU13=F2,INDEX(F5:F13,MATCH(BG2,I5:I13,0)),IF(BU13=AC2,INDEX(AC5:AC13,MATCH(BG2,AF5:AF13,0))))","v":"Lowery"},{"$nulls":16},"OF",1,2,3,4,5,6,7,8,9,10,"Error Charts",{"$f":"BG27","v":"1B"},{"$f":"IF($CK$2=\"CF\",OFFSET(BG2,1,1),IF($CK$2=\"LF\",OFFSET(AY4,1,1),IF($CK$2=\"RF\",OFFSET(BN4,1,1))))","v":false},{"$nulls":3},0.4514056559239309,6]
[null,"R/R","B+L","L/R",{"$nulls":55},{"$f":"IF($BU$13=$F$2,VLOOKUP($BH$2,$F$5:$P$13,10,FALSE),VLOOKUP($BH$2,$AC$5:$AM$13,10,FALSE))","v":4},{"$f":"IF($BU$13=$F$2,VLOOKUP($BH$2,$F$5:$P$13,11,FALSE),VLOOKUP($BH$2,$AC$5:$AM$13,11,FALSE))","v":2},{"$nulls":15},1,2,2,2,2,1,1,1,1,1,1,{"$nulls":6},0.7921851029304182,3]
[{"$nulls":5},"Last","First",null,"POS","vsL","vsR","B","S","J","F","A","ST","GR","P","P/S",{"$nulls":10},"B","POS","vsL","vsR","Bu","S","J","F","A","ST","GR","P","P/S",{"$nulls":7},"LF",{"$f":"IF(BU13=F2,INDEX(F5:F13,MATCH(AY4,I5:I13,0)),IF(BU13=AC2,INDEX(AC5:AC13,MATCH(AY4,AF5:AF13,0))))","v":"Holley"},{"$nulls":7},"F","A",{"$nulls":4},"RF",{"$f":"IF(BU13=F2,INDEX(F5:F13,MATCH(BN4,I5:I13,0)),IF(BU13=AC2,INDEX(AC5:AC13,MATCH(BN4,AF5:AF13,0))))","v":"Sharkey"},{"$nulls":7},1,"P",2,2,2,1,1,1,1,1,1,1,1,{"$nulls":6},0.16659444780276822,4]
[null,{"$f":"IF(AND($H5=\"R\",$AE$23=\"R\"),$K5+$AG$23,$J5+$AG$23)","v":-2},{"$f":"IF(AND($H5=\"B\",$AE$23=\"R\"),$K5+$AF$23,$J5+$AG$23)","v":-1},{"$f":"IF(AND($H5=\"L\",$AE$23=\"L\"),$J5+$AF$23,$K5+$AF$23)","v":-1},1,{"$f":"VLOOKUP(E5,'Sheet2 Edit'!E5:P19,2,FALSE)","v":"Sharkey"},{"$f":"VLOOKUP($E$5,'Sheet2 Edit'!$E$5:$P$19,3,FALSE)","v":"Bill"},{"$f":"VLOOKUP($E$5,'Sheet2 Edit'!$E$5:$P$19,4,FALSE)","v":"R"},{"$f":"IF(T5=1,VLOOKUP(E5,'Sheet2 Edit'!E5:P19,5,FALSE),IF(T5=2,VLOOKUP(E5,'Sheet2 Edit'!E5:T19,13,FALSE),VLOOKUP(E5,'Sheet2 Edit'!E5:T19,14,FALSE)))","v":"RF"},{"$f":"VLOOKUP(E5,'Sheet2 Edit'!E5:P19,6,FALSE)","v":4},{"$f":"VLOOKUP(E5,'Sheet2 Edit'!E5:P19,7,FALSE)","v":3},{"$f":"VLOOKUP(E5,'Sheet2 Edit'!E5:P19,8,FALSE)","v":4},{"$f":"VLOOKUP(E5,'Sheet2 Edit'!E5:P19,9,FALSE)","v":4},{"$f":"VLOOKUP(E5,'Sheet2 Edit'!E5:P19,10,FALSE)","v":4},{"$f":"IF(T5=1,VLOOKUP(E5,'Sheet2 Edit'!E5:P19,11,FALSE),VLOOKUP(E5,'Sheet2 Edit'!E5:T19,15,FALSE))","v":3},{"$f":"VLOOKUP($E$5,'Sheet2 Edit'!$E$5:$P$19,12,FALSE)","v":5},{"$f":"VLOOKUP($E5,'Sheet2 Edit'!$E$5:$V$19,16,FALSE)","v":0},{"$f":"VLOOKUP($E5,'Sheet2 Edit'!$E$5:$V$19,17,FALSE)","v":0},{"$f":"VLOOKUP($E5,'Sheet2 Edit'!$E$5:$V$19,18,FALSE)","v":1},1,{"$nulls":4},{"$f":"IF(AND(AE5=\"R\",H23=\"R\"),AH5+J23,AG5+J23)","v":0},{"$f":"IF(AND(AE5=\"B\",H23=\"R\"),AH5+I23,AG5+J23)","v":0},{"$f":"IF(AND(AE5=\"L\",H23=\"L\"),AG5+I23,AH5+I23)","v":-1},1,{"$f":"VLOOKUP(AB5,'Sheet2 Edit'!AD5:AO19,2,FALSE)","v":"Monteso"},{"$f":"VLOOKUP(AB5,'Sheet2 Edit'!AD5:AO19,3,FALSE)","v":"Luis"},{"$f":"VLOOKUP(AB5,'Sheet2 Edit'!AD5:AO19,4,FALSE)","v":"R"},{"$f":"IF($AQ5=1,VLOOKUP($AB5,'Sheet2 Edit'!$AD$5:$AR$19,5,FALSE),IF($AQ5=2,VLOOKUP($AB5,'Sheet2 Edit'!$AD$5:$AR$19,13,FALSE),VLOOKUP($AB5,'Sheet2 Edit'!$AD$5:$AR$19,14,FALSE)))","v":"SS"},{"$f":"VLOOKUP(AB5,'Sheet2 Edit'!AD5:AO19,6,FALSE)","v":3},{"$f":"VLOOKUP(AB5,'Sheet2 Edit'!AD5:AO19,7,FALSE)","v":4},{"$f":"VLOOKUP(AB5,'Sheet2 Edit'!AD5:AO19,8,FALSE)","v":3},{"$f":"VLOOKUP(AB5,'Sheet2 Edit'!AD5:AO19,9,FALSE)","v":5},{"$f":"VLOOKUP(AB5,'Sheet2 Edit'!AD5:AO19,10,FALSE)","v":4},{"$f":"IF($AQ5=1,VLOOKUP($AB5,'Sheet2 Edit'!$AD$5:$AR$19,11,FALSE),VLOOKUP($AB5,'Sheet2 Edit'!$AD$5:$AR$19,15,FALSE))","v":3},{"$f":"VLOOKUP($AB$5,'Sheet2 Edit'!$AD$5:$AO$19,12,FALSE)","v":3},{"$f":"VLOOKUP($AB5,'Sheet2 Edit'!$AD$5:$AU$32,16,FALSE)","v":0},{"$f":"VLOOKUP($AB5,'Sheet2 Edit'!$AD$5:$AU$32,17,FALSE)","v":0},{"$f":"VLOOKUP($AB5,'Sheet2 Edit'!$AD$5:$AU$32,18,FALSE)","v":3},1,null,null,0,5,{"$nulls":4},{"$f":"IF($BU$13=$F$2,VLOOKUP($AZ$4,$F$5:$P$13,10,FALSE),VLOOKUP($AZ$4,$AC$5:$AM$13,10,FALSE))","v":4},{"$f":"IF($BU$13=$F$2,VLOOKUP($AZ$4,$F$5:$P$13,11,FALSE),VLOOKUP($AZ$4,$AC$5:$AM$13,11,FALSE))","v":3},{"$nulls":13},{"$f":"IF($BU$13=$F$2,VLOOKUP($BO$4,$F$5:$P$13,10,FALSE),VLOOKUP($BO$4,$AC$5:$AM$13,10,FALSE))","v":3},{"$f":"IF($BU$13=$F$2,VLOOKUP($BO$4,$F$5:$P$13,11,FALSE),VLOOKUP($BO$4,$AC$5:$AM$13,11,FALSE))","v":5},{"$nulls":6},2,"C",3,2,2,1,1,1,1,1,1,1,0,{"$nulls":6},0.20450572428850755,7]
[null,{"$f":"IF(AND(H6=\"R\",$AE$23=\"R\"),$K6+$AG$23,$J6+$AG$23)","v":0},-1,-1,2,{"$f":"VLOOKUP(E6,'Sheet2 Edit'!E5:P19,2,FALSE)","v":"Lucas"},{"$f":"VLOOKUP(E6,'Sheet2 Edit'!E5:P19,3,FALSE)","v":"Peter"},{"$f":"VLOOKUP(E6,'Sheet2 Edit'!E5:P19,4,FALSE)","v":"B"},{"$f":"IF($T6=1,VLOOKUP($E6,'Sheet2 Edit'!$E$5:$P$19,5,FALSE),IF($T6=2,VLOOKUP($E6,'Sheet2 Edit'!$E$5:$T$19,13,FALSE),VLOOKUP($E6,'Sheet2 Edit'!$E$5:$T$19,14,FALSE)))","v":"2B"},{"$f":"VLOOKUP(E6,'Sheet2 Edit'!E5:P19,6,FALSE)","v":5},{"$f":"VLOOKUP(E6,'Sheet2 Edit'!E5:P19,7,FALSE)","v":3},{"$f":"VLOOKUP(E6,'Sheet2 Edit'!E5:P19,8,FALSE)","v":4},{"$f":"VLOOKUP(E6,'Sheet2 Edit'!E5:P19,9,FALSE)","v":4},{"$f":"VLOOKUP(E6,'Sheet2 Edit'!E5:P19,10,FALSE)","v":4},{"$f":"IF($T6=1,VLOOKUP($E6,'Sheet2 Edit'!$E$5:$P$19,11,FALSE),VLOOKUP($E6,'Sheet2 Edit'!$E$5:$T$19,15,FALSE))","v":5},{"$f":"VLOOKUP($E$6,'Sheet2 Edit'!$E$5:$P$19,12,FALSE)","v":3},{"$f":"VLOOKUP($E6,'Sheet2 Edit'!$E$5:$V$19,16,FALSE)","v":0},{"$f":"VLOOKUP($E6,'Sheet2 Edit'!$E$5:$V$19,17,FALSE)","v":0},{"$f":"VLOOKUP($E6,'Sheet2 Edit'!$E$5:$V$19,18,FALSE)","v":3},1,{"$nulls":4},{"$f":"IF(AND(AE6=\"R\",H23=\"R\"),AH6+J23,AG6+J23)","v":-1},{"$f":"IF(AND(AE6=\"B\",H23=\"R\"),AH6+I23,AG6+J23)","v":-1},{"$f":"IF(AND(AE6=\"L\",H23=\"L\"),AG6+I23,AH6+I23)","v":-3},2,{"$f":"VLOOKUP(AB6,'Sheet2 Edit'!AD5:AO19,2,FALSE)","v":"Johnstone"},{"$f":"VLOOKUP(AB6,'Sheet2 Edit'!AD5:AO19,3,FALSE)","v":"Dennis"},{"$f":"VLOOKUP(AB6,'Sheet2 Edit'!AD5:AO19,4,FALSE)","v":"L"},{"$f":"IF($AQ6=1,VLOOKUP($AB6,'Sheet2 Edit'!$AD$5:$AR$19,5,FALSE),IF($AQ6=2,VLOOKUP($AB6,'Sheet2 Edit'!$AD$5:$AR$19,13,FALSE),VLOOKUP($AB6,'Sheet2 Edit'!$AD$5:$AR$19,14,FALSE)))","v":"DH"},{"$f":"VLOOKUP(AB6,'Sheet2 Edit'!AD5:AO19,6,FALSE)","v":2},{"$f":"VLOOKUP(AB6,'Sheet2 Edit'!AD5:AO19,7,FALSE)","v":3},{"$f":"VLOOKUP(AB6,'Sheet2 Edit'!AD5:AO19,8,FALSE)","v":3},{"$f":"VLOOKUP(AB6,'Sheet2 Edit'!AD5:AO19,9,FALSE)","v":4},{"$f":"VLOOKUP(AB6,'Sheet2 Edit'!AD5:AO19,10,FALSE)","v":4},{"$f":"IF($AQ6=1,VLOOKUP($AB6,'Sheet2 Edit'!$AD$5:$AR$19,11,FALSE),VLOOKUP($AB6,'Sheet2 Edit'!$AD$5:$AR$19,15,FALSE))","v":2},{"$f":"VLOOKUP(AB6,'Sheet2 Edit'!AD5:AO19,12,FALSE)","v":2},{"$f":"VLOOKUP($AB6,'Sheet2 Edit'!$AD$5:$AU$32,16,FALSE)","v":0},{"$f":"VLOOKUP($AB6,'Sheet2 Edit'!$AD$5:$AU$32,17,FALSE)","v":0},{"$f":"VLOOKUP($AB6,'Sheet2 Edit'!$AD$5:$AU$32,18,FALSE)","v":1},1,null,null,-1,7,{"$nulls":4},"F","A",{"$nulls":13},"F","A",{"$nulls":6},3,"1B",4,2,2,1,1,1,1,1,0,0,0,{"$nulls":6},0.3650910674496727,5]
[null,{"$f":"IF(AND($H7=\"R\",$AE$23=\"R\"),$K7+$AG$23,$J7+$AG$23)","v":-1},-1,{"$f":"IF(AND($H7=\"L\",$AE$23=\"L\"),$J7+$AF$23,$K7+$AG$23)","v":0},3,{"$f":"VLOOKUP(E7,'Sheet2 Edit'!E5:P19,2,FALSE)","v":"Kemp"},{"$f":"VLOOKUP(E7,'Sheet2 Edit'!E5:P19,3,FALSE)","v":"Jay"},{"$f":"VLOOKUP(E7,'Sheet2 Edit'!E5:P19,4,FALSE)","v":"L"},{"$f":"IF($T7=1,VLOOKUP($E7,'Sheet2 Edit'!$E$5:$P$19,5,FALSE),IF($T7=2,VLOOKUP($E7,'Sheet2 Edit'!$E$5:$T$19,13,FALSE),VLOOKUP($E7,'Sheet2 Edit'!$E$5:$T$19,14,FALSE)))","v":"SS"},{"$f":"VLOOKUP(E7,'Sheet2 Edit'!E5:P19,6,FALSE)","v":4},{"$f":"VLOOKUP(E7,'Sheet2 Edit'!E5:P19,7,FALSE)","v":5},{"$f":"VLOOKUP(E7,'Sheet2 Edit'!E5:P19,8,FALSE)","v":2},{"$f":"VLOOKUP(E7,'Sheet2 Edit'!E5:P19,9,FALSE)","v":3},{"$f":"VLOOKUP(E7,'Sheet2 Edit'!E5:P19,10,FALSE)","v":2},{"$f":"IF($T7=1,VLOOKUP($E7,'Sheet2 Edit'!$E$5:$P$19,11,FALSE),VLOOKUP($E7,'Sheet2 Edit'!$E$5:$T$19,15,FALSE))","v":5},{"$f":"VLOOKUP($E$7,'Sheet2 Edit'!$E$5:$P$19,12,FALSE)","v":1},{"$f":"VLOOKUP($E7,'Sheet2 Edit'!$E$5:$V$19,16,FALSE)","v":0},{"$f":"VLOOKUP($E7,'Sheet2 Edit'!$E$5:$V$19,17,FALSE)","v":0},{"$f":"VLOOKUP($E7,'Sheet2 Edit'!$E$5:$V$19,18,FALSE)","v":4},1,{"$nulls":4},{"$f":"IF(AND(AE7=\"R\",H23=\"R\"),AH7+J23,AG7+J23)","v":1},{"$f":"IF(AND(AE7=\"B\",H23=\"R\"),AH7+I23,AG7+J23)","v":1},{"$f":"IF(AND(AE7=\"L\",H23=\"L\"),AG7+I23,AH7+I23)","v":-2},3,{"$f":"VLOOKUP(AB7,'Sheet2 Edit'!AD5:AO19,2,FALSE)","v":"O'Sheehan"},{"$f":"VLOOKUP(AB7,'Sheet2 Edit'!AD5:AO19,3,FALSE)","v":"Bill"},{"$f":"VLOOKUP(AB7,'Sheet2 Edit'!AD5:AO19,4,FALSE)","v":"R"},{"$f":"IF($AQ7=1,VLOOKUP($AB7,'Sheet2 Edit'!$AD$5:$AR$19,5,FALSE),IF($AQ7=2,VLOOKUP($AB7,'Sheet2 Edit'!$AD$5:$AR$19,13,FALSE),VLOOKUP($AB7,'Sheet2 Edit'!$AD$5:$AR$19,14,FALSE)))","v":"2B"},{"$f":"VLOOKUP(AB7,'Sheet2 Edit'!AD5:AO19,6,FALSE)","v":4},{"$f":"VLOOKUP(AB7,'Sheet2 Edit'!AD5:AO19,7,FALSE)","v":3},{"$f":"VLOOKUP(AB7,'Sheet2 Edit'!AD5:AO19,8,FALSE)","v":1},{"$f":"VLOOKUP(AB7,'Sheet2 Edit'!AD5:AO19,9,FALSE)","v":3},{"$f":"VLOOKUP(AB7,'Sheet2 Edit'!AD5:AO19,10,FALSE)","v":5},{"$f":"IF($AQ7=1,VLOOKUP($AB7,'Sheet2 Edit'!$AD$5:$AR$19,11,FALSE),VLOOKUP($AB7,'Sheet2 Edit'!$AD$5:$AR$19,15,FALSE))","v":4},{"$f":"VLOOKUP(AB7,'Sheet2 Edit'!AD5:AO19,12,FALSE)","v":3},{"$f":"VLOOKUP($AB7,'Sheet2 Edit'!$AD$5:$AU$32,16,FALSE)","v":0},{"$f":"VLOOKUP($AB7,'Sheet2 Edit'!$AD$5:$AU$32,17,FALSE)","v":0},{"$f":"VLOOKUP($AB7,'Sheet2 Edit'!$AD$5:$AU$32,18,FALSE)","v":2},1,null,null,-2,8,{"$nulls":27},4,"2B",5,2,1,1,1,1,0,0,0,0,0,{"$nulls":6},0.7447133965000349,2]
[null,-2,-2,{"$f":"IF(AND($H8=\"L\",$AE$23=\"L\"),$J8+$AF$23,$K8+$AF$23)","v":0},4,{"$f":"VLOOKUP(E8,'Sheet2 Edit'!E5:P19,2,FALSE)","v":"Holley"},{"$f":"VLOOKUP(E8,'Sheet2 Edit'!E5:P19,3,FALSE)","v":"Howard"},{"$f":"VLOOKUP(E8,'Sheet2 Edit'!E5:P19,4,FALSE)","v":"L"},{"$f":"IF($T8=1,VLOOKUP($E8,'Sheet2 Edit'!$E$5:$P$19,5,FALSE),IF($T8=2,VLOOKUP($E8,'Sheet2 Edit'!$E$5:$T$19,13,FALSE),VLOOKUP($E8,'Sheet2 Edit'!$E$5:$T$19,14,FALSE)))","v":"LF"},{"$f":"VLOOKUP(E8,'Sheet2 Edit'!E5:P19,6,FALSE)","v":3},{"$f":"VLOOKUP(E8,'Sheet2 Edit'!E5:P19,7,FALSE)","v":4},{"$f":"VLOOKUP(E8,'Sheet2 Edit'!E5:P19,8,FALSE)","v":1},{"$f":"VLOOKUP(E8,'Sheet2 Edit'!E5:P19,9,FALSE)","v":3},{"$f":"VLOOKUP($E$8,'Sheet2 Edit'!$E$5:$P$19,10,FALSE)","v":2},{"$f":"IF($T8=1,VLOOKUP($E8,'Sheet2 Edit'!$E$5:$P$19,11,FALSE),VLOOKUP($E8,'Sheet2 Edit'!$E$5:$T$19,15,FALSE))","v":4},{"$f":"VLOOKUP($E$8,'Sheet2 Edit'!$E$5:$P$19,12,FALSE)","v":3},{"$f":"VLOOKUP($E8,'Sheet2 Edit'!$E$5:$V$19,16,FALSE)","v":0},{"$f":"VLOOKUP($E8,'Sheet2 Edit'!$E$5:$V$19,17,FALSE)","v":0},{"$f":"VLOOKUP($E8,'Sheet2 Edit'!$E$5:$V$19,18,FALSE)","v":4},1,{"$nulls":4},{"$f":"IF(AND(AE8=\"R\",H23=\"R\"),AH8+J23,AG8+J23)","v":0},{"$f":"IF(AND(AE8=\"B\",H23=\"R\"),AH8+I23,AG8+J23)","v":0},{"$f":"IF(AND(AE8=\"L\",H23=\"L\"),AG8+I23,AH8+I23)","v":-1},4,{"$f":"VLOOKUP(AB8,'Sheet2 Edit'!AD5:AO19,2,FALSE)","v":"Rhodes"},{"$f":"VLOOKUP(AB8,'Sheet2 Edit'!AD5:AO19,3,FALSE)","v":"John"},{"$f":"VLOOKUP(AB8,'Sheet2 Edit'!AD5:AO19,4,FALSE)","v":"R"},{"$f":"IF($AQ8=1,VLOOKUP($AB8,'Sheet2 Edit'!$AD$5:$AR$19,5,FALSE),IF($AQ8=2,VLOOKUP($AB8,'Sheet2 Edit'!$AD$5:$AR$19,13,FALSE),VLOOKUP($AB8,'Sheet2 Edit'!$AD$5:$AR$19,14,FALSE)))","v":"3B"},{"$f":"VLOOKUP(AB8,'Sheet2 Edit'!AD5:AO19,6,FALSE)","v":3},{"$f":"VLOOKUP(AB8,'Sheet2 Edit'!AD5:AO19,7,FALSE)","v":4},{"$f":"VLOOKUP(AB8,'Sheet2 Edit'!AD5:AO19,8,FALSE)","v":1},{"$f":"VLOOKUP(AB8,'Sheet2 Edit'!AD5:AO19,9,FALSE)","v":1},{"$f":"VLOOKUP(AB8,'Sheet2 Edit'!AD5:AO19,10,FALSE)","v":2},{"$f":"IF($AQ8=1,VLOOKUP($AB8,'Sheet2 Edit'!$AD$5:$AR$19,11,FALSE),VLOOKUP($AB8,'Sheet2 Edit'!$AD$5:$AR$19,15,FALSE))","v":2},{"$f":"VLOOKUP(AB8,'Sheet2 Edit'!AD5:AO19,12,FALSE)","v":2},{"$f":"VLOOKUP($AB8,'Sheet2 Edit'!$AD$5:$AU$32,16,FALSE)","v":0},{"$f":"VLOOKUP($AB8,'Sheet2 Edit'!$AD$5:$AU$32,17,FALSE)","v":0},{"$f":"VLOOKUP($AB8,'Sheet2 Edit'!$AD$5:$AU$32,18,FALSE)","v":5},1,null,null,-3,9,{"$nulls":27},5,"3B",{"$nulls":17},0.4972723387131861,1]
[null,-3,-2,-2,5,{"$f":"VLOOKUP(E9,'Sheet2 Edit'!E5:P19,2,FALSE)","v":"Moran"},{"$f":"VLOOKUP(E9,'Sheet2 Edit'!E5:P19,3,FALSE)","v":"Octavio"},{"$f":"VLOOKUP(E9,'Sheet2 Edit'!E5:P19,4,FALSE)","v":"R"},{"$f":"IF($T9=1,VLOOKUP($E9,'Sheet2 Edit'!$E$5:$P$19,5,FALSE),IF($T9=2,VLOOKUP($E9,'Sheet2 Edit'!$E$5:$T$19,13,FALSE),VLOOKUP($E9,'Sheet2 Edit'!$E$5:$T$19,14,FALSE)))","v":"C"},{"$f":"VLOOKUP(E9,'Sheet2 Edit'!E5:P19,6,FALSE)","v":3},{"$f":"VLOOKUP(E9,'Sheet2 Edit'!E5:P19,7,FALSE)","v":2},{"$f":"VLOOKUP(E9,'Sheet2 Edit'!E5:P19,8,FALSE)","v":2},{"$f":"VLOOKUP(E9,'Sheet2 Edit'!E5:P19,9,FALSE)","v":2},{"$f":"VLOOKUP(E9,'Sheet2 Edit'!E5:P19,10,FALSE)","v":2},{"$f":"IF($T9=1,VLOOKUP($E9,'Sheet2 Edit'!$E$5:$P$19,11,FALSE),VLOOKUP($E9,'Sheet2 Edit'!$E$5:$T$19,15,FALSE))","v":5},{"$f":"VLOOKUP($E$9,'Sheet2 Edit'!$E$5:$P$19,12,FALSE)","v":3},{"$f":"VLOOKUP($E9,'Sheet2 Edit'!$E$5:$V$19,16,FALSE)","v":0},{"$f":"VLOOKUP($E9,'Sheet2 Edit'!$E$5:$V$19,17,FALSE)","v":0},{"$f":"VLOOKUP($E9,'Sheet2 Edit'!$E$5:$V$19,18,FALSE)","v":3},1,{"$nulls":4},{"$f":"IF(AND(AE9=\"R\",H23=\"R\"),AH9+J23,AG9+J23)","v":-1},{"$f":"IF(AND(AE9=\"B\",H23=\"R\"),AH9+I23,AG9+J23)","v":-1},{"$f":"IF(AND(AE9=\"L\",H23=\"L\"),AG9+I23,AH9+I23)","v":-4},5,{"$f":"VLOOKUP(AB9,'Sheet2 Edit'!AD5:AO19,2,FALSE)","v":"Shelton"},{"$f":"VLOOKUP(AB9,'Sheet2 Edit'!AD5:AO19,3,FALSE)","v":"Bill"},{"$f":"VLOOKUP(AB9,'Sheet2 Edit'!AD5:AO19,4,FALSE)","v":"B"},{"$f":"IF($AQ9=1,VLOOKUP($AB9,'Sheet2 Edit'!$AD$5:$AR$19,5,FALSE),IF($AQ9=2,VLOOKUP($AB9,'Sheet2 Edit'!$AD$5:$AR$19,13,FALSE),VLOOKUP($AB9,'Sheet2 Edit'!$AD$5:$AR$19,14,FALSE)))","v":"1B"},{"$f":"VLOOKUP(AB9,'Sheet2 Edit'!AD5:AO19,6,FALSE)","v":2},{"$f":"VLOOKUP(AB9,'Sheet2 Edit'!AD5:AO19,7,FALSE)","v":1},{"$f":"VLOOKUP(AB9,'Sheet2 Edit'!AD5:AO19,8,FALSE)","v":1},{"$f":"VLOOKUP(AB9,'Sheet2 Edit'!AD5:AO19,9,FALSE)","v":2},{"$f":"VLOOKUP(AB9,'Sheet2 Edit'!AD5:AO19,10,FALSE)","v":2},{"$f":"IF($AQ9=1,VLOOKUP($AB9,'Sheet2 Edit'!$AD$5:$AR$19,11,FALSE),VLOOKUP($AB9,'Sheet2 Edit'!$AD$5:$AR$19,15,FALSE))","v":3},{"$f":"VLOOKUP(AB9,'Sheet2 Edit'!AD5:AO19,12,FALSE)","v":2},{"$f":"VLOOKUP($AB9,'Sheet2 Edit'!$AD$5:$AU$32,16,FALSE)","v":0},{"$f":"VLOOKUP($AB9,'Sheet2 Edit'!$AD$5:$AU$32,17,FALSE)","v":0},{"$f":"VLOOKUP($AB9,'Sheet2 Edit'!$AD$5:$AU$32,18,FALSE)","v":5},1,null,null,-4,10,{"$nulls":8},"SS",{"$f":"IF(BU13=F2,INDEX(F5:F13,MATCH(BD9,I5:I13,0)),IF(BU13=AC2,INDEX(AC5:AC13,MATCH(BD9,AF5:AF13,0))))","v":"Kemp"},{"$nulls":5},"2B",{"$f":"IF(BU13=F2,INDEX(F5:F13,MATCH(BK9,I5:I13,0)),IF(BU13=AC2,INDEX(AC5:AC13,MATCH(BK9,AF5:AF13,0))))","v":"Lucas"},{"$nulls":10},6,"SS","IF",1,2,3,4,5,6,7,8,9,10,null,{"$f":"BG27","v":"1B"},{"$f":"IF($CK$2=\"1B\",OFFSET(BN14,1,1),IF($CK$2=\"2B\",OFFSET(BK9,1,1),IF($CK$2=\"3B\",OFFSET(BA14,1,1),IF($CK$2=\"SS\",OFFSET(BD9,1,1)))))","v":5},{"$nulls":3},0.20233220400498797,9]
[null,-2,-2,-1,6,{"$f":"VLOOKUP(E10,'Sheet2 Edit'!E5:P19,2,FALSE)","v":"Clark"},{"$f":"VLOOKUP(E10,'Sheet2 Edit'!E5:P19,3,FALSE)","v":"Randy"},{"$f":"VLOOKUP(E10,'Sheet2 Edit'!E5:P19,4,FALSE)","v":"R"},{"$f":"IF($T10=1,VLOOKUP($E10,'Sheet2 Edit'!$E$5:$P$19,5,FALSE),IF($T10=2,VLOOKUP($E10,'Sheet2 Edit'!$E$5:$T$19,13,FALSE),VLOOKUP($E10,'Sheet2 Edit'!$E$5:$T$19,14,FALSE)))","v":"1B"},{"$f":"VLOOKUP(E10,'Sheet2 Edit'!E5:P19,6,FALSE)","v":3},{"$f":"VLOOKUP(E10,'Sheet2 Edit'!E5:P19,7,FALSE)","v":3},{"$f":"VLOOKUP(E10,'Sheet2 Edit'!E5:P19,8,FALSE)","v":2},{"$f":"VLOOKUP(E10,'Sheet2 Edit'!E5:P19,9,FALSE)","v":2},{"$f":"VLOOKUP($E$10,'Sheet2 Edit'!$E$5:$P$19,10,FALSE)","v":2},{"$f":"IF($T10=1,VLOOKUP($E10,'Sheet2 Edit'!$E$5:$P$19,11,FALSE),VLOOKUP($E10,'Sheet2 Edit'!$E$5:$T$19,15,FALSE))","v":5},{"$f":"VLOOKUP($E$10,'Sheet2 Edit'!$E$5:$P$19,12,FALSE)","v":2},{"$f":"VLOOKUP($E10,'Sheet2 Edit'!$E$5:$V$19,16,FALSE)","v":0},{"$f":"VLOOKUP($E10,'Sheet2 Edit'!$E$5:$V$19,17,FALSE)","v":0},{"$f":"VLOOKUP($E10,'Sheet2 Edit'!$E$5:$V$19,18,FALSE)","v":3},1,{"$nulls":4},{"$f":"IF(AND(AE10=\"R\",H23=\"R\"),AH10+J23,AG10+J23)","v":1},{"$f":"IF(AND(AE10=\"B\",H23=\"R\"),AH10+I23,AG10+J23)","v":1},{"$f":"IF(AND(AE10=\"L\",H23=\"L\"),AG10+I23,AH10+I23)","v":-2},6,{"$f":"VLOOKUP(AB10,'Sheet2 Edit'!AD5:AO19,2,FALSE)","v":"Callaway"},{"$f":"VLOOKUP(AB10,'Sheet2 Edit'!AD5:AO19,3,FALSE)","v":"Daniel"},{"$f":"VLOOKUP(AB10,'Sheet2 Edit'!AD5:AO19,4,FALSE)","v":"B"},{"$f":"IF($AQ10=1,VLOOKUP($AB10,'Sheet2 Edit'!$AD$5:$AR$19,5,FALSE),IF($AQ10=2,VLOOKUP($AB10,'Sheet2 Edit'!$AD$5:$AR$19,13,FALSE),VLOOKUP($AB10,'Sheet2 Edit'!$AD$5:$AR$19,14,FALSE)))","v":"CF"},{"$f":"VLOOKUP(AB10,'Sheet2 Edit'!AD5:AO19,6,FALSE)","v":4},{"$f":"VLOOKUP(AB10,'Sheet2 Edit'!AD5:AO19,7,FALSE)","v":3},{"$f":"VLOOKUP(AB10,'Sheet2 Edit'!AD5:AO19,8,FALSE)","v":5},{"$f":"VLOOKUP(AB10,'Sheet2 Edit'!AD5:AO19,9,FALSE)","v":4},{"$f":"VLOOKUP(AB10,'Sheet2 Edit'!AD5:AO19,10,FALSE)","v":4},{"$f":"IF($AQ10=1,VLOOKUP($AB10,'Sheet2 Edit'!$AD$5:$AR$19,11,FALSE),VLOOKUP($AB10,'Sheet2 Edit'!$AD$5:$AR$19,15,FALSE))","v":5},{"$f":"VLOOKUP(AB10,'Sheet2 Edit'!AD5:AO19,12,FALSE)","v":4},{"$f":"VLOOKUP($AB10,'Sheet2 Edit'!$AD$5:$AU$32,16,FALSE)","v":0},{"$f":"VLOOKUP($AB10,'Sheet2 Edit'!$AD$5:$AU$32,17,FALSE)","v":0},{"$f":"VLOOKUP($AB10,'Sheet2 Edit'!$AD$5:$AU$32,18,FALSE)","v":3},1,null,null,0,6,{"$nulls":9},{"$f":"IF($BU$13=$F$2,VLOOKUP($BE$9,$F$5:$P$13,10,FALSE),VLOOKUP($BE$9,$AC$5:$AM$13,10,FALSE))","v":5},{"$f":"IF($BU$13=$F$2,VLOOKUP($BE$9,$F$5:$P$13,11,FALSE),VLOOKUP($BE$9,$AC$5:$AM$13,11,FALSE))","v":1},{"$nulls":5},{"$f":"IF($BU$13=$F$2,VLOOKUP($BL$9,$F$5:$P$13,10,FALSE),VLOOKUP($BL$9,$AC$5:$AM$13,10,FALSE))","v":5},{"$f":"IF($BU$13=$F$2,VLOOKUP($BL$9,$F$5:$P$13,11,FALSE),VLOOKUP($BL$9,$AC$5:$AM$13,11,FALSE))","v":3},{"$nulls":7},{"$f":"AC2","v":"Hornets"},null,7,"LF",1,2,2,2,2,1,1,1,1,1,1,{"$nulls":6},0.9524689754142197,8]
[null,-2,-1,-1,7,{"$f":"VLOOKUP(E11,'Sheet2 Edit'!E5:P19,2,FALSE)","v":"Gomez"},{"$f":"VLOOKUP(E11,'Sheet2 Edit'!E5:P19,3,FALSE)","v":"Augusto"},{"$f":"VLOOKUP($E$11,'Sheet2 Edit'!$E$5:$P$19,4,FALSE)","v":"B"},{"$f":"IF($T11=1,VLOOKUP($E11,'Sheet2 Edit'!$E$5:$P$19,5,FALSE),IF($T11=2,VLOOKUP($E11,'Sheet2 Edit'!$E$5:$T$19,13,FALSE),VLOOKUP($E11,'Sheet2 Edit'!$E$5:$T$19,14,FALSE)))","v":"3B"},{"$f":"VLOOKUP(E11,'Sheet2 Edit'!E5:P19,6,FALSE)","v":3},{"$f":"VLOOKUP(E11,'Sheet2 Edit'!E5:P19,7,FALSE)","v":3},{"$f":"VLOOKUP(E11,'Sheet2 Edit'!E5:P19,8,FALSE)","v":2},{"$f":"VLOOKUP(E11,'Sheet2 Edit'!E5:P19,9,FALSE)","v":3},{"$f":"VLOOKUP(E11,'Sheet2 Edit'!E5:P19,10,FALSE)","v":2},{"$f":"IF($T11=1,VLOOKUP($E11,'Sheet2 Edit'!$E$5:$P$19,11,FALSE),VLOOKUP($E11,'Sheet2 Edit'!$E$5:$T$19,15,FALSE))","v":5},{"$f":"VLOOKUP($E$11,'Sheet2 Edit'!$E$5:$P$19,12,FALSE)","v":3},{"$f":"VLOOKUP($E11,'Sheet2 Edit'!$E$5:$V$19,16,FALSE)","v":0},{"$f":"VLOOKUP($E11,'Sheet2 Edit'!$E$5:$V$19,17,FALSE)","v":0},{"$f":"VLOOKUP($E11,'Sheet2 Edit'!$E$5:$V$19,18,FALSE)","v":3},1,{"$nulls":4},{"$f":"IF(AND(AE11=\"R\",H23=\"R\"),AH11+J23,AG11+J23)","v":1},{"$f":"IF(AND(AE11=\"B\",H23=\"R\"),AH11+I23,AG11+J23)","v":1},{"$f":"IF(AND(AE11=\"L\",H23=\"L\"),AG11+I23,AH11+I23)","v":-1},7,{"$f":"VLOOKUP(AB11,'Sheet2 Edit'!AD5:AO19,2,FALSE)","v":"Rosas"},{"$f":"VLOOKUP(AB11,'Sheet2 Edit'!AD5:AO19,3,FALSE)","v":"Orlando"},{"$f":"VLOOKUP(AB11,'Sheet2 Edit'!AD5:AO19,4,FALSE)","v":"L"},{"$f":"IF($AQ11=1,VLOOKUP($AB11,'Sheet2 Edit'!$AD$5:$AR$19,5,FALSE),IF($AQ11=2,VLOOKUP($AB11,'Sheet2 Edit'!$AD$5:$AR$19,13,FALSE),VLOOKUP($AB11,'Sheet2 Edit'!$AD$5:$AR$19,14,FALSE)))","v":"LF"},{"$f":"VLOOKUP(AB11,'Sheet2 Edit'!AD5:AO19,6,FALSE)","v":4},{"$f":"VLOOKUP(AB11,'Sheet2 Edit'!AD5:AO19,7,FALSE)","v":3},{"$f":"VLOOKUP(AB11,'Sheet2 Edit'!AD5:AO19,8,FALSE)","v":3},{"$f":"VLOOKUP(AB11,'Sheet2 Edit'!AD5:AO19,9,FALSE)","v":4},{"$f":"VLOOKUP(AB11,'Sheet2 Edit'!AD5:AO19,10,FALSE)","v":3},{"$f":"IF($AQ11=1,VLOOKUP($AB11,'Sheet2 Edit'!$AD$5:$AR$19,11,FALSE),VLOOKUP($AB11,'Sheet2 Edit'!$AD$5:$AR$19,15,FALSE))","v":4},{"$f":"VLOOKUP(AB11,'Sheet2 Edit'!AD5:AO19,12,FALSE)","v":3},{"$f":"VLOOKUP($AB11,'Sheet2 Edit'!$AD$5:$AU$32,16,FALSE)","v":0},{"$f":"VLOOKUP($AB11,'Sheet2 Edit'!$AD$5:$AU$32,17,FALSE)","v":0},{"$f":"VLOOKUP($AB11,'Sheet2 Edit'!$AD$5:$AU$32,18,FALSE)","v":2},1,null,null,1,5,{"$nulls":9},"F","A",{"$nulls":5},"F","A",{"$nulls":7},{"$f":"F2","v":"Gators"},null,8,"CF",2,2,2,1,1,1,1,1,1,1,1]
[null,-3,-1,-2,8,{"$f":"VLOOKUP(E12,'Sheet2 Edit'!E5:P19,2,FALSE)","v":"Metcalf"},{"$f":"VLOOKUP(E12,'Sheet2 Edit'!E5:P19,3,FALSE)","v":"Jon"},{"$f":"VLOOKUP($E$12,'Sheet2 Edit'!$E$5:$P$19,4,FALSE)","v":"R"},{"$f":"IF($T12=1,VLOOKUP($E12,'Sheet2 Edit'!$E$5:$P$19,5,FALSE),IF($T12=2,VLOOKUP($E12,'Sheet2 Edit'!$E$5:$T$19,13,FALSE),VLOOKUP($E12,'Sheet2 Edit'!$E$5:$T$19,14,FALSE)))","v":"DH"},{"$f":"VLOOKUP(E12,'Sheet2 Edit'!E5:P19,6,FALSE)","v":4},{"$f":"VLOOKUP(E12,'Sheet2 Edit'!E5:P19,7,FALSE)","v":2},{"$f":"VLOOKUP(E12,'Sheet2 Edit'!E5:P19,8,FALSE)","v":4},{"$f":"VLOOKUP(E12,'Sheet2 Edit'!E5:P19,9,FALSE)","v":4},{"$f":"VLOOKUP(E12,'Sheet2 Edit'!E5:P19,10,FALSE)","v":3},{"$f":"IF($T12=1,VLOOKUP($E12,'Sheet2 Edit'!$E$5:$P$19,11,FALSE),VLOOKUP($E12,'Sheet2 Edit'!$E$5:$T$19,15,FALSE))","v":4},{"$f":"VLOOKUP($E$12,'Sheet2 Edit'!$E$5:$P$19,12,FALSE)","v":2},{"$f":"VLOOKUP($E12,'Sheet2 Edit'!$E$5:$V$19,16,FALSE)","v":0},{"$f":"VLOOKUP($E12,'Sheet2 Edit'!$E$5:$V$19,17,FALSE)","v":0},{"$f":"VLOOKUP($E12,'Sheet2 Edit'!$E$5:$V$19,18,FALSE)","v":2},1,{"$nulls":4},{"$f":"IF(AND(AE12=\"R\",H23=\"R\"),AH12+J23,AG12+J23)","v":-1},{"$f":"IF(AND(AE12=\"B\",H23=\"R\"),AH12+I23,AG12+J23)","v":-1},{"$f":"IF(AND(AE12=\"L\",H23=\"L\"),AG12+I23,AH12+I23)","v":-2},8,{"$f":"VLOOKUP(AB12,'Sheet2 Edit'!AD5:AO19,2,FALSE)","v":"Villarreal"},{"$f":"VLOOKUP(AB12,'Sheet2 Edit'!AD5:AO19,3,FALSE)","v":"Tony"},{"$f":"VLOOKUP(AB12,'Sheet2 Edit'!AD5:AO19,4,FALSE)","v":"R"},{"$f":"IF($AQ12=1,VLOOKUP($AB12,'Sheet2 Edit'!$AD$5:$AR$19,5,FALSE),IF($AQ12=2,VLOOKUP($AB12,'Sheet2 Edit'!$AD$5:$AR$19,13,FALSE),VLOOKUP($AB12,'Sheet2 Edit'!$AD$5:$AR$19,14,FALSE)))","v":"LF"},{"$f":"VLOOKUP(AB12,'Sheet2 Edit'!AD5:AO19,6,FALSE)","v":2},{"$f":"VLOOKUP(AB12,'Sheet2 Edit'!AD5:AO19,7,FALSE)","v":3},{"$f":"VLOOKUP(AB12,'Sheet2 Edit'!AD5:AO19,8,FALSE)","v":2},{"$f":"VLOOKUP(AB12,'Sheet2 Edit'!AD5:AO19,9,FALSE)","v":4},{"$f":"VLOOKUP(AB12,'Sheet2 Edit'!AD5:AO19,10,FALSE)","v":3},{"$f":"IF($AQ12=1,VLOOKUP($AB12,'Sheet2 Edit'!$AD$5:$AR$19,11,FALSE),VLOOKUP($AB12,'Sheet2 Edit'!$AD$5:$AR$19,15,FALSE))","v":4},{"$f":"VLOOKUP(AB12,'Sheet2 Edit'!AD5:AO19,12,FALSE)","v":2},{"$f":"VLOOKUP($AB12,'Sheet2 Edit'!$AD$5:$AU$32,16,FALSE)","v":0},{"$f":"VLOOKUP($AB12,'Sheet2 Edit'!$AD$5:$AU$32,17,FALSE)","v":0},{"$f":"VLOOKUP($AB12,'Sheet2 Edit'!$AD$5:$AU$32,18,FALSE)","v":1},1,null,null,2,4,{"$nulls":27},9,"RF",3,2,2,1,1,1,1,1,1,1,0,{"$nulls":6},"Sharkey","Batter"]
[null,-3,-2,-2,9,{"$f":"VLOOKUP($E13,'Sheet2 Edit'!$E$5:$P$19,2,FALSE)","v":"Lowery"},{"$f":"VLOOKUP($E13,'Sheet2 Edit'!$E$5:$P$19,3,FALSE)","v":"Shane"},{"$f":"VLOOKUP($E13,'Sheet2 Edit'!$E$5:$P$19,4,FALSE)","v":"R"},{"$f":"IF($T13=1,VLOOKUP($E13,'Sheet2 Edit'!$E$5:$P$19,5,FALSE),IF($T13=2,VLOOKUP($E13,'Sheet2 Edit'!$E$5:$T$19,13,FALSE),VLOOKUP($E13,'Sheet2 Edit'!$E$5:$T$19,14,FALSE)))","v":"CF"},{"$f":"VLOOKUP($E13,'Sheet2 Edit'!$E$5:$P$19,6,FALSE)","v":3},{"$f":"VLOOKUP($E13,'Sheet2 Edit'!$E$5:$P$19,7,FALSE)","v":2},{"$f":"VLOOKUP($E13,'Sheet2 Edit'!$E$5:$P$19,8,FALSE)","v":5},{"$f":"VLOOKUP($E13,'Sheet2 Edit'!$E$5:$P$19,9,FALSE)","v":5},{"$f":"VLOOKUP($E13,'Sheet2 Edit'!$E$5:$P$19,10,FALSE)","v":5},{"$f":"IF($T13=1,VLOOKUP($E13,'Sheet2 Edit'!$E$5:$P$19,11,FALSE),VLOOKUP($E13,'Sheet2 Edit'!$E$5:$T$19,15,FALSE))","v":4},{"$f":"VLOOKUP($E$13,'Sheet2 Edit'!$E$5:$P$19,12,FALSE)","v":2},{"$f":"VLOOKUP($E13,'Sheet2 Edit'!$E$5:$V$19,16,FALSE)","v":0},{"$f":"VLOOKUP($E13,'Sheet2 Edit'!$E$5:$V$19,17,FALSE)","v":0},{"$f":"VLOOKUP($E13,'Sheet2 Edit'!$E$5:$V$19,18,FALSE)","v":2},1,{"$nulls":4},{"$f":"IF(AND($AE13=\"R\",$H$23=\"R\"),$AH13+$J$23,$AG13+$J$23)","v":0},{"$f":"IF(AND($AE13=\"B\",$H$23=\"R\"),$AH13+$I$23,$AG13+$J$23)","v":0},{"$f":"IF(AND($AE13=\"L\",$H$23=\"L\"),$AG13+$I$23,$AH13+$I$23)","v":-3},9,{"$f":"VLOOKUP($AB13,'Sheet2 Edit'!$AD$5:$AO$19,2,FALSE)","v":"Hernandez"},{"$f":"VLOOKUP($AB13,'Sheet2 Edit'!$AD$5:$AO$19,3,FALSE)","v":"Edgar"},{"$f":"VLOOKUP($AB13,'Sheet2 Edit'!$AD$5:$AO$19,4,FALSE)","v":"R"},{"$f":"IF($AQ13=1,VLOOKUP($AB13,'Sheet2 Edit'!$AD$5:$AR$19,5,FALSE),IF($AQ13=2,VLOOKUP($AB13,'Sheet2 Edit'!$AD$5:$AR$19,13,FALSE),VLOOKUP($AB13,'Sheet2 Edit'!$AD$5:$AR$19,14,FALSE)))","v":"C"},{"$f":"VLOOKUP($AB13,'Sheet2 Edit'!$AD$5:$AO$19,6,FALSE)","v":3},{"$f":"VLOOKUP($AB13,'Sheet2 Edit'!$AD$5:$AO$19,7,FALSE)","v":2},{"$f":"VLOOKUP($AB13,'Sheet2 Edit'!$AD$5:$AO$19,8,FALSE)","v":1},{"$f":"VLOOKUP($AB13,'Sheet2 Edit'!$AD$5:$AO$19,9,FALSE)","v":2},{"$f":"VLOOKUP($AB13,'Sheet2 Edit'!$AD$5:$AO$19,10,FALSE)","v":2},{"$f":"IF($AQ13=1,VLOOKUP($AB13,'Sheet2 Edit'!$AD$5:$AR$19,11,FALSE),VLOOKUP($AB13,'Sheet2 Edit'!$AD$5:$AR$19,15,FALSE))","v":2},{"$f":"VLOOKUP($AB13,'Sheet2 Edit'!$AD$5:$AO$19,12,FALSE)","v":2},{"$f":"VLOOKUP($AB13,'Sheet2 Edit'!$AD$5:$AU$32,16,FALSE)","v":0},{"$f":"VLOOKUP($AB13,'Sheet2 Edit'!$AD$5:$AU$32,17,FALSE)","v":0},{"$f":"VLOOKUP($AB13,'Sheet2 Edit'!$AD$5:$AU$32,18,FALSE)","v":3},1,null,null,3,3,{"$nulls":11},"S","E","P",{"$nulls":10},2,{"$f":"IF(BT13=1,BU10,BU11)","v":"Gators"},null,10,null,4,2,2,1,1,1,1,1,0,0,0,{"$nulls":6},"Lane ","Batter"]
[null,-2,-2,-1,10,{"$f":"VLOOKUP($E14,'Sheet2 Edit'!$E$5:$P$19,2,FALSE)","v":"MacAldonich"},{"$f":"VLOOKUP($E14,'Sheet2 Edit'!$E$5:$P$19,3,FALSE)","v":"Chris"},{"$f":"VLOOKUP($E14,'Sheet2 Edit'!$E$5:$P$19,4,FALSE)","v":"R"},{"$f":"IF($T14=1,VLOOKUP($E14,'Sheet2 Edit'!$E$5:$P$19,5,FALSE),IF($T14=2,VLOOKUP($E14,'Sheet2 Edit'!$E$5:$T$19,13,FALSE),VLOOKUP($E14,'Sheet2 Edit'!$E$5:$T$19,14,FALSE)))","v":"CF"},{"$f":"VLOOKUP($E14,'Sheet2 Edit'!$E$5:$P$19,6,FALSE)","v":3},{"$f":"VLOOKUP($E14,'Sheet2 Edit'!$E$5:$P$19,7,FALSE)","v":3},{"$f":"VLOOKUP($E14,'Sheet2 Edit'!$E$5:$P$19,8,FALSE)","v":3},{"$f":"VLOOKUP($E14,'Sheet2 Edit'!$E$5:$P$19,9,FALSE)","v":4},{"$f":"VLOOKUP($E14,'Sheet2 Edit'!$E$5:$P$19,10,FALSE)","v":3},{"$f":"IF($T14=1,VLOOKUP($E14,'Sheet2 Edit'!$E$5:$P$19,11,FALSE),VLOOKUP($E14,'Sheet2 Edit'!$E$5:$T$19,15,FALSE))","v":4},{"$f":"VLOOKUP($E$14,'Sheet2 Edit'!$E$5:$P$19,12,FALSE)","v":4},{"$f":"VLOOKUP($E14,'Sheet2 Edit'!$E$5:$V$19,16,FALSE)","v":0},{"$f":"VLOOKUP($E14,'Sheet2 Edit'!$E$5:$V$19,17,FALSE)","v":0},{"$f":"VLOOKUP($E14,'Sheet2 Edit'!$E$5:$V$19,18,FALSE)","v":1},1,{"$nulls":4},-1,-1,-3,10,{"$f":"VLOOKUP($AB14,'Sheet2 Edit'!$AD$5:$AO$19,2,FALSE)","v":"Lopez"},{"$f":"VLOOKUP($AB14,'Sheet2 Edit'!$AD$5:$AO$19,3,FALSE)","v":"Pedro"},{"$f":"VLOOKUP($AB14,'Sheet2 Edit'!$AD$5:$AO$19,4,FALSE)","v":"L"},{"$f":"IF($AQ14=1,VLOOKUP($AB14,'Sheet2 Edit'!$AD$5:$AR$19,5,FALSE),IF($AQ14=2,VLOOKUP($AB14,'Sheet2 Edit'!$AD$5:$AR$19,13,FALSE),VLOOKUP($AB14,'Sheet2 Edit'!$AD$5:$AR$19,14,FALSE)))","v":"C"},{"$f":"VLOOKUP($AB14,'Sheet2 Edit'!$AD$5:$AO$19,6,FALSE)","v":2},{"$f":"VLOOKUP($AB14,'Sheet2 Edit'!$AD$5:$AO$19,7,FALSE)","v":2},{"$f":"VLOOKUP($AB14,'Sheet2 Edit'!$AD$5:$AO$19,8,FALSE)","v":5},{"$f":"VLOOKUP($AB14,'Sheet2 Edit'!$AD$5:$AO$19,9,FALSE)","v":3},{"$f":"VLOOKUP($AB14,'Sheet2 Edit'!$AD$5:$AO$19,10,FALSE)","v":2},{"$f":"IF($AQ14=1,VLOOKUP($AB14,'Sheet2 Edit'!$AD$5:$AR$19,11,FALSE),VLOOKUP($AB14,'Sheet2 Edit'!$AD$5:$AR$19,15,FALSE))","v":2},{"$f":"VLOOKUP($AB14,'Sheet2 Edit'!$AD$5:$AO$19,12,FALSE)","v":2},{"$f":"VLOOKUP($AB14,'Sheet2 Edit'!$AD$5:$AU$32,16,FALSE)","v":0},{"$f":"VLOOKUP($AB14,'Sheet2 Edit'!$AD$5:$AU$32,17,FALSE)","v":0},{"$f":"VLOOKUP($AB14,'Sheet2 Edit'!$AD$5:$AU$32,18,FALSE)","v":1},1,null,null,4,2,{"$nulls":5},"3B",{"$f":"IF(BU13=F2,INDEX(F5:F13,MATCH(BA14,I5:I13,0)),IF(BU13=AC2,INDEX(AC5:AC13,MATCH(BA14,AF5:AF13,0))))","v":"Gomez"},{"$nulls":4},{"$f":"IF($BU$13=\"Drillers\",VLOOKUP($BG$15,Drillers!$M$21:$AE$30,6,FALSE),IF($BU$13=\"Hornets\",VLOOKUP($BG$15,Hornets!$M$21:$AE$30,6,FALSE),IF($BU$13=\"Bulls\",VLOOKUP($BG$15,Bulls!$M$21:$AE$30,6,FALSE),IF($BU$13=\"Phantoms\",VLOOKUP($BG$15,Phantoms!$M$21:$AE$30,6,FALSE),IF($BU$13=\"Gators\",VLOOKUP($BG$15,Gators!$M$21:$AE$30,6,FALSE),IF($BU$13=\"Knights\",VLOOKUP($BG$15,Knights!$M$21:$AE$30,6,FALSE),IF($BU$13=\"Reds\",VLOOKUP($BG$15,Comets!$M$21:$AE$30,6,FALSE),IF($BU$13=\"Guardians\",VLOOKUP($BG$15,Wolves!$M$21:$AE$30,6,FALSE)))))))))","v":"5"},{"$f":"IF($BU$13=\"Drillers\",VLOOKUP($BG$15,Drillers!$M$21:$AE$30,19,FALSE),IF($BU$13=\"Hornets\",VLOOKUP($BG$15,Hornets!$M$21:$AE$30,19,FALSE),IF($BU$13=\"Bulls\",VLOOKUP($BG$15,Bulls!$M$21:$AE$30,19,FALSE),IF($BU$13=\"Phantoms\",VLOOKUP($BG$15,Phantoms!$M$21:$AE$30,19,FALSE),IF($BU$13=\"Gators\",VLOOKUP($BG$15,Gators!$M$21:$AE$30,19,FALSE),IF($BU$13=\"Knights\",VLOOKUP($BG$15,Knights!$M$21:$AE$30,19,FALSE),IF($BU$13=\"Reds\",VLOOKUP($BG$15,Comets!$M$21:$AE$30,19,FALSE),IF($BU$13=\"Guardians\",VLOOKUP($BG$15,Wolves!$M$21:$AE$30,19,FALSE)))))))))","v":5},{"$f":"IF($BU$13=\"Drillers\",VLOOKUP($BG$15,Drillers!$M$21:$AD$30,14,FALSE),IF($BU$13=\"Hornets\",VLOOKUP($BG$15,Hornets!$M$21:$AD$30,14,FALSE),IF($BU$13=\"Bulls\",VLOOKUP($BG$15,Bulls!$M$21:$AD$30,14,FALSE),IF($BU$13=\"Phantoms\",VLOOKUP($BG$15,Phantoms!$M$21:$AD$30,14,FALSE),IF($BU$13=\"Gators\",VLOOKUP($BG$15,Gators!$M$21:$AD$30,14,FALSE),IF($BU$13=\"Knights\",VLOOKUP($BG$15,Knights!$M$21:$AD$30,14,FALSE),IF($BU$13=\"Reds\",VLOOKUP($BG$15,Comets!$M$21:$AD$30,14,FALSE),IF($BU$13=\"Guardians\",VLOOKUP($BG$15,Wolves!$M$21:$AD$30,14,FALSE)))))))))","v":5},{"$nulls":4},"1B",{"$f":"IF(BU13=F2,INDEX(F5:F13,MATCH(BN14,I5:I13,0)),IF(BU13=AC2,INDEX(AC5:AC13,MATCH(BN14,AF5:AF13,0))))","v":"Clark"},{"$nulls":7},11,null,5,2,1,1,1,1,0,0,0,0,0]
[null,-3,-3,-2,11,{"$f":"VLOOKUP($E15,'Sheet2 Edit'!$E$5:$P$19,2,FALSE)","v":"Ornelas"},{"$f":"VLOOKUP($E15,'Sheet2 Edit'!$E$5:$P$19,3,FALSE)","v":"Colton"},{"$f":"VLOOKUP($E15,'Sheet2 Edit'!$E$5:$P$19,4,FALSE)","v":"R"},{"$f":"IF($T15=1,VLOOKUP($E15,'Sheet2 Edit'!$E$5:$P$19,5,FALSE),IF($T15=2,VLOOKUP($E15,'Sheet2 Edit'!$E$5:$T$19,13,FALSE),VLOOKUP($E15,'Sheet2 Edit'!$E$5:$T$19,14,FALSE)))","v":"LF"},{"$f":"VLOOKUP($E15,'Sheet2 Edit'!$E$5:$P$19,6,FALSE)","v":2},{"$f":"VLOOKUP($E15,'Sheet2 Edit'!$E$5:$P$19,7,FALSE)","v":2},{"$f":"VLOOKUP($E15,'Sheet2 Edit'!$E$5:$P$19,8,FALSE)","v":2},{"$f":"VLOOKUP($E15,'Sheet2 Edit'!$E$5:$P$19,9,FALSE)","v":5},{"$f":"VLOOKUP($E15,'Sheet2 Edit'!$E$5:$P$19,10,FALSE)","v":3},{"$f":"IF($T15=1,VLOOKUP($E15,'Sheet2 Edit'!$E$5:$P$19,11,FALSE),VLOOKUP($E15,'Sheet2 Edit'!$E$5:$T$19,15,FALSE))","v":5},{"$f":"VLOOKUP($E$15,'Sheet2 Edit'!$E$5:$P$19,12,FALSE)","v":2},{"$f":"VLOOKUP($E15,'Sheet2 Edit'!$E$5:$V$19,16,FALSE)","v":0},{"$f":"VLOOKUP($E15,'Sheet2 Edit'!$E$5:$V$19,17,FALSE)","v":0},{"$f":"VLOOKUP($E15,'Sheet2 Edit'!$E$5:$V$19,18,FALSE)","v":1},1,{"$nulls":4},2,2,-2,11,{"$f":"VLOOKUP($AB15,'Sheet2 Edit'!$AD$5:$AO$19,2,FALSE)","v":"Castillo"},{"$f":"VLOOKUP($AB15,'Sheet2 Edit'!$AD$5:$AO$19,3,FALSE)","v":"Ivan"},{"$f":"VLOOKUP($AB15,'Sheet2 Edit'!$AD$5:$AO$19,4,FALSE)","v":"R"},{"$f":"IF($AQ15=1,VLOOKUP($AB15,'Sheet2 Edit'!$AD$5:$AR$19,5,FALSE),IF($AQ15=2,VLOOKUP($AB15,'Sheet2 Edit'!$AD$5:$AR$19,13,FALSE),VLOOKUP($AB15,'Sheet2 Edit'!$AD$5:$AR$19,14,FALSE)))","v":"C"},{"$f":"VLOOKUP($AB15,'Sheet2 Edit'!$AD$5:$AO$19,6,FALSE)","v":5},{"$f":"VLOOKUP($AB15,'Sheet2 Edit'!$AD$5:$AO$19,7,FALSE)","v":3},{"$f":"VLOOKUP($AB15,'Sheet2 Edit'!$AD$5:$AO$19,8,FALSE)","v":1},{"$f":"VLOOKUP($AB15,'Sheet2 Edit'!$AD$5:$AO$19,9,FALSE)","v":2},{"$f":"VLOOKUP($AB15,'Sheet2 Edit'!$AD$5:$AO$19,10,FALSE)","v":2},{"$f":"IF($AQ15=1,VLOOKUP($AB15,'Sheet2 Edit'!$AD$5:$AR$19,11,FALSE),VLOOKUP($AB15,'Sheet2 Edit'!$AD$5:$AR$19,15,FALSE))","v":4},{"$f":"VLOOKUP($AB15,'Sheet2 Edit'!$AD$5:$AO$19,12,FALSE)","v":4},{"$f":"VLOOKUP($AB15,'Sheet2 Edit'!$AD$5:$AU$32,16,FALSE)","v":0},{"$f":"VLOOKUP($AB15,'Sheet2 Edit'!$AD$5:$AU$32,17,FALSE)","v":0},{"$f":"VLOOKUP($AB15,'Sheet2 Edit'!$AD$5:$AU$32,18,FALSE)","v":2},1,{"$nulls":10},{"$f":"IF($BU$13=$F$2,VLOOKUP($BB$14,$F$5:$P$13,10,FALSE),VLOOKUP($BB$14,$AC$5:$AM$13,10,FALSE))","v":5},{"$f":"IF($BU$13=$F$2,VLOOKUP($BB$14,$F$5:$P$13,11,FALSE),VLOOKUP($BB$14,$AC$5:$AM$13,11,FALSE))","v":3},null,null,"P",{"$f":"IF($BU$13=$F$2,F23,AC23)","v":"Bowerman"},null,{"$f":"IF(BU13=\"Allentown Gators\",H23,AE23)","v":"R"},{"$nulls":5},{"$f":"IF($BU$13=$F$2,VLOOKUP($BO$14,$F$5:$P$13,10,FALSE),VLOOKUP($BO$14,$AC$5:$AM$13,10,FALSE))","v":5},{"$f":"IF($BU$13=$F$2,VLOOKUP($BO$14,$F$5:$P$13,11,FALSE),VLOOKUP($BO$14,$AC$5:$AM$13,11,FALSE))","v":2},{"$nulls":6},12,{"$nulls":18},1]
[null,-3,-2,-2,12,{"$f":"VLOOKUP($E16,'Sheet2 Edit'!$E$5:$P$19,2,FALSE)","v":"Santos"},{"$f":"VLOOKUP($E16,'Sheet2 Edit'!$E$5:$P$19,3,FALSE)","v":"Ramon"},{"$f":"VLOOKUP($E16,'Sheet2 Edit'!$E$5:$P$19,4,FALSE)","v":"R"},{"$f":"IF($T16=1,VLOOKUP($E16,'Sheet2 Edit'!$E$5:$P$19,5,FALSE),IF($T16=2,VLOOKUP($E16,'Sheet2 Edit'!$E$5:$T$19,13,FALSE),VLOOKUP($E16,'Sheet2 Edit'!$E$5:$T$19,14,FALSE)))","v":"C"},{"$f":"VLOOKUP($E16,'Sheet2 Edit'!$E$5:$P$19,6,FALSE)","v":3},{"$f":"VLOOKUP($E16,'Sheet2 Edit'!$E$5:$P$19,7,FALSE)","v":2},{"$f":"VLOOKUP($E16,'Sheet2 Edit'!$E$5:$P$19,8,FALSE)","v":2},{"$f":"VLOOKUP($E16,'Sheet2 Edit'!$E$5:$P$19,9,FALSE)","v":2},{"$f":"VLOOKUP($E16,'Sheet2 Edit'!$E$5:$P$19,10,FALSE)","v":2},{"$f":"IF($T16=1,VLOOKUP($E16,'Sheet2 Edit'!$E$5:$P$19,11,FALSE),VLOOKUP($E16,'Sheet2 Edit'!$E$5:$T$19,15,FALSE))","v":2},{"$f":"VLOOKUP($E$16,'Sheet2 Edit'!$E$5:$P$19,12,FALSE)","v":2},{"$f":"VLOOKUP($E16,'Sheet2 Edit'!$E$5:$V$19,16,FALSE)","v":0},{"$f":"VLOOKUP($E16,'Sheet2 Edit'!$E$5:$V$19,17,FALSE)","v":0},{"$f":"VLOOKUP($E16,'Sheet2 Edit'!$E$5:$V$19,18,FALSE)","v":3},1,{"$nulls":4},0,0,-2,12,{"$f":"VLOOKUP($AB16,'Sheet2 Edit'!$AD$5:$AO$19,2,FALSE)","v":"Medina"},{"$f":"VLOOKUP($AB16,'Sheet2 Edit'!$AD$5:$AO$19,3,FALSE)","v":"Octavio"},{"$f":"VLOOKUP($AB16,'Sheet2 Edit'!$AD$5:$AO$19,4,FALSE)","v":"L"},{"$f":"IF($AQ16=1,VLOOKUP($AB16,'Sheet2 Edit'!$AD$5:$AR$19,5,FALSE),IF($AQ16=2,VLOOKUP($AB16,'Sheet2 Edit'!$AD$5:$AR$19,13,FALSE),VLOOKUP($AB16,'Sheet2 Edit'!$AD$5:$AR$19,14,FALSE)))","v":"3B"},{"$f":"VLOOKUP($AB16,'Sheet2 Edit'!$AD$5:$AO$19,6,FALSE)","v":3},{"$f":"VLOOKUP($AB16,'Sheet2 Edit'!$AD$5:$AO$19,7,FALSE)","v":3},{"$f":"VLOOKUP($AB16,'Sheet2 Edit'!$AD$5:$AO$19,8,FALSE)","v":2},{"$f":"VLOOKUP($AB16,'Sheet2 Edit'!$AD$5:$AO$19,9,FALSE)","v":3},{"$f":"VLOOKUP($AB16,'Sheet2 Edit'!$AD$5:$AO$19,10,FALSE)","v":3},{"$f":"IF($AQ16=1,VLOOKUP($AB16,'Sheet2 Edit'!$AD$5:$AR$19,11,FALSE),VLOOKUP($AB16,'Sheet2 Edit'!$AD$5:$AR$19,15,FALSE))","v":2},{"$f":"VLOOKUP($AB16,'Sheet2 Edit'!$AD$5:$AO$19,12,FALSE)","v":2},{"$f":"VLOOKUP($AB16,'Sheet2 Edit'!$AD$5:$AU$32,16,FALSE)","v":0},{"$f":"VLOOKUP($AB16,'Sheet2 Edit'!$AD$5:$AU$32,17,FALSE)","v":0},{"$f":"VLOOKUP($AB16,'Sheet2 Edit'!$AD$5:$AU$32,18,FALSE)","v":1},2,{"$nulls":10},"F","A",{"$nulls":3},{"$f":"IF($BU$13=\"Drillers\",VLOOKUP($BG$15,Drillers!$M$21:$AD$30,17,FALSE),IF($BU$13=\"Hornets\",VLOOKUP($BG$15,Hornets!$M$21:$AD$30,17,FALSE),IF($BU$13=\"Bulls\",VLOOKUP($BG$15,Bulls!$M$21:$AD$30,17,FALSE),IF($BU$13=\"Phantoms\",VLOOKUP($BG$15,Phantoms!$M$21:$AD$30,17,FALSE),IF($BU$13=\"Gators\",VLOOKUP($BG$15,Gators!$M$21:$AD$30,17,FALSE),IF($BU$13=\"Knights\",VLOOKUP($BG$15,Knights!$M$21:$AD$30,17,FALSE),IF($BU$13=\"Reds\",VLOOKUP($BG$15,Comets!$M$21:$AD$30,17,FALSE),IF($BU$13=\"Guardians\",VLOOKUP($BG$15,Wolves!$M$21:$AD$30,17,FALSE)))))))))","v":3},{"$f":"IF($BU$13=\"Drillers\",VLOOKUP($BG$15,Drillers!$M$21:$AD$30,18,FALSE),IF($BU$13=\"Hornets\",VLOOKUP($BG$15,Hornets!$M$21:$AD$30,18,FALSE),IF($BU$13=\"Bulls\",VLOOKUP($BG$15,Bulls!$M$21:$AD$30,18,FALSE),IF($BU$13=\"Phantoms\",VLOOKUP($BG$15,Phantoms!$M$21:$AD$30,18,FALSE),IF($BU$13=\"Gators\",VLOOKUP($BG$15,Gators!$M$21:$AD$30,18,FALSE),IF($BU$13=\"Knights\",VLOOKUP($BG$15,Knights!$M$21:$AD$30,18,FALSE),IF($BU$13=\"Reds\",VLOOKUP($BG$15,Comets!$M$21:$AD$30,18,FALSE),IF($BU$13=\"Guardians\",VLOOKUP($BG$15,Wolves!$M$21:$AD$30,18,FALSE)))))))))","v":3},{"$f":"IF($BU$13=\"Drillers\",VLOOKUP($BG$15,Drillers!$M$21:$AF$30,20,FALSE),IF($BU$13=\"Hornets\",VLOOKUP($BG$15,Hornets!$M$21:$AF$30,20,FALSE),IF($BU$13=\"Bulls\",VLOOKUP($BG$15,Bulls!$M$21:$AF$30,20,FALSE),IF($BU$13=\"Phantoms\",VLOOKUP($BG$15,Phantoms!$M$21:$AF$30,20,FALSE),IF($BU$13=\"Gators\",VLOOKUP($BG$15,Gators!$M$21:$AF$30,20,FALSE),IF($BU$13=\"Knights\",VLOOKUP($BG$15,Knights!$M$21:$AF$30,20,FALSE),IF($BU$13=\"Reds\",VLOOKUP($BG$15,Comets!$M$21:$AF$30,20,FALSE),IF($BU$13=\"Guardians\",VLOOKUP($BG$15,Wolves!$M$21:$AF$30,20,FALSE)))))))))","v":4},{"$nulls":5},"F","A",{"$nulls":6},13,null,"C",1,2,3,4,5,6,7,8,9,10,null,{"$f":"BG27","v":"1B"},{"$f":"IF(CK16=\"C\",OFFSET(BH23,1,1))","v":false},{"$nulls":3},2]
[null,-3,-2,-2,13,{"$f":"VLOOKUP($E17,'Sheet2 Edit'!$E$5:$P$19,2,FALSE)","v":"Gonzalez"},{"$f":"VLOOKUP($E17,'Sheet2 Edit'!$E$5:$P$19,3,FALSE)","v":"Jose"},{"$f":"VLOOKUP($E17,'Sheet2 Edit'!$E$5:$P$19,4,FALSE)","v":"R"},{"$f":"IF($T17=1,VLOOKUP($E17,'Sheet2 Edit'!$E$5:$P$19,5,FALSE),IF($T17=2,VLOOKUP($E17,'Sheet2 Edit'!$E$5:$T$19,13,FALSE),VLOOKUP($E17,'Sheet2 Edit'!$E$5:$T$19,14,FALSE)))","v":"SS"},{"$f":"VLOOKUP($E17,'Sheet2 Edit'!$E$5:$P$19,6,FALSE)","v":3},{"$f":"VLOOKUP($E17,'Sheet2 Edit'!$E$5:$P$19,7,FALSE)","v":2},{"$f":"VLOOKUP($E17,'Sheet2 Edit'!$E$5:$P$19,8,FALSE)","v":2},{"$f":"VLOOKUP($E17,'Sheet2 Edit'!$E$5:$P$19,9,FALSE)","v":3},{"$f":"VLOOKUP($E17,'Sheet2 Edit'!$E$5:$P$19,10,FALSE)","v":2},{"$f":"IF($T17=1,VLOOKUP($E17,'Sheet2 Edit'!$E$5:$P$19,11,FALSE),VLOOKUP($E17,'Sheet2 Edit'!$E$5:$T$19,15,FALSE))","v":4},{"$f":"VLOOKUP($E$17,'Sheet2 Edit'!$E$5:$P$19,12,FALSE)","v":2},{"$f":"VLOOKUP($E17,'Sheet2 Edit'!$E$5:$V$19,16,FALSE)","v":0},{"$f":"VLOOKUP($E17,'Sheet2 Edit'!$E$5:$V$19,17,FALSE)","v":0},{"$f":"VLOOKUP($E17,'Sheet2 Edit'!$E$5:$V$19,18,FALSE)","v":2},1,{"$nulls":4},-1,-1,-2,13,{"$f":"VLOOKUP($AB17,'Sheet2 Edit'!$AD$5:$AO$19,2,FALSE)","v":"Holland"},{"$f":"VLOOKUP($AB17,'Sheet2 Edit'!$AD$5:$AO$19,3,FALSE)","v":"Chris"},{"$f":"VLOOKUP($AB17,'Sheet2 Edit'!$AD$5:$AO$19,4,FALSE)","v":"B"},{"$f":"IF($AQ17=1,VLOOKUP($AB17,'Sheet2 Edit'!$AD$5:$AR$19,5,FALSE),IF($AQ17=2,VLOOKUP($AB17,'Sheet2 Edit'!$AD$5:$AR$19,13,FALSE),VLOOKUP($AB17,'Sheet2 Edit'!$AD$5:$AR$19,14,FALSE)))","v":"SS"},{"$f":"VLOOKUP($AB17,'Sheet2 Edit'!$AD$5:$AO$19,6,FALSE)","v":2},{"$f":"VLOOKUP($AB17,'Sheet2 Edit'!$AD$5:$AO$19,7,FALSE)","v":3},{"$f":"VLOOKUP($AB17,'Sheet2 Edit'!$AD$5:$AO$19,8,FALSE)","v":3},{"$f":"VLOOKUP($AB17,'Sheet2 Edit'!$AD$5:$AO$19,9,FALSE)","v":3},{"$f":"VLOOKUP($AB17,'Sheet2 Edit'!$AD$5:$AO$19,10,FALSE)","v":2},{"$f":"IF($AQ17=1,VLOOKUP($AB17,'Sheet2 Edit'!$AD$5:$AR$19,11,FALSE),VLOOKUP($AB17,'Sheet2 Edit'!$AD$5:$AR$19,15,FALSE))","v":3},{"$f":"VLOOKUP($AB17,'Sheet2 Edit'!$AD$5:$AO$19,12,FALSE)","v":2},{"$f":"VLOOKUP($AB17,'Sheet2 Edit'!$AD$5:$AU$32,16,FALSE)","v":0},{"$f":"VLOOKUP($AB17,'Sheet2 Edit'!$AD$5:$AU$32,17,FALSE)","v":0},{"$f":"VLOOKUP($AB17,'Sheet2 Edit'!$AD$5:$AU$32,18,FALSE)","v":3},1,{"$nulls":15},"F","A","H",{"$nulls":13},14,null,1,2,2,2,2,1,1,1,1,1,1,{"$nulls":6},3]
[null,-3,-2,-2,14,{"$f":"VLOOKUP($E18,'Sheet2 Edit'!$E$5:$P$19,2,FALSE)","v":"Cruz"},{"$f":"VLOOKUP($E18,'Sheet2 Edit'!$E$5:$P$19,3,FALSE)","v":"Orlando"},{"$f":"VLOOKUP($E18,'Sheet2 Edit'!$E$5:$P$19,4,FALSE)","v":"R"},{"$f":"IF($T18=1,VLOOKUP($E18,'Sheet2 Edit'!$E$5:$P$19,5,FALSE),IF($T18=2,VLOOKUP($E18,'Sheet2 Edit'!$E$5:$T$19,13,FALSE),VLOOKUP($E18,'Sheet2 Edit'!$E$5:$T$19,14,FALSE)))","v":"SS"},{"$f":"VLOOKUP($E18,'Sheet2 Edit'!$E$5:$P$19,6,FALSE)","v":3},{"$f":"VLOOKUP($E18,'Sheet2 Edit'!$E$5:$P$19,7,FALSE)","v":2},{"$f":"VLOOKUP($E18,'Sheet2 Edit'!$E$5:$P$19,8,FALSE)","v":4},{"$f":"VLOOKUP($E18,'Sheet2 Edit'!$E$5:$P$19,9,FALSE)","v":4},{"$f":"VLOOKUP($E18,'Sheet2 Edit'!$E$5:$P$19,10,FALSE)","v":2},{"$f":"IF($T18=1,VLOOKUP($E18,'Sheet2 Edit'!$E$5:$P$19,11,FALSE),VLOOKUP($E18,'Sheet2 Edit'!$E$5:$T$19,15,FALSE))","v":3},{"$f":"VLOOKUP($E$18,'Sheet2 Edit'!$E$5:$P$19,12,FALSE)","v":4},{"$f":"VLOOKUP($E18,'Sheet2 Edit'!$E$5:$V$19,16,FALSE)","v":0},{"$f":"VLOOKUP($E18,'Sheet2 Edit'!$E$5:$V$19,17,FALSE)","v":0},{"$f":"VLOOKUP($E18,'Sheet2 Edit'!$E$5:$V$19,18,FALSE)","v":1},1,{"$nulls":4},0,0,-3,14,{"$f":"VLOOKUP($AB18,'Sheet2 Edit'!$AD$5:$AO$19,2,FALSE)","v":"Stanley"},{"$f":"VLOOKUP($AB18,'Sheet2 Edit'!$AD$5:$AO$19,3,FALSE)","v":"Todd"},{"$f":"VLOOKUP($AB18,'Sheet2 Edit'!$AD$5:$AO$19,4,FALSE)","v":"R"},{"$f":"IF($AQ18=1,VLOOKUP($AB18,'Sheet2 Edit'!$AD$5:$AR$19,5,FALSE),IF($AQ18=2,VLOOKUP($AB18,'Sheet2 Edit'!$AD$5:$AR$19,13,FALSE),VLOOKUP($AB18,'Sheet2 Edit'!$AD$5:$AR$19,14,FALSE)))","v":"SS"},{"$f":"VLOOKUP($AB18,'Sheet2 Edit'!$AD$5:$AO$19,6,FALSE)","v":3},{"$f":"VLOOKUP($AB18,'Sheet2 Edit'!$AD$5:$AO$19,7,FALSE)","v":2},{"$f":"VLOOKUP($AB18,'Sheet2 Edit'!$AD$5:$AO$19,8,FALSE)","v":2},{"$f":"VLOOKUP($AB18,'Sheet2 Edit'!$AD$5:$AO$19,9,FALSE)","v":3},{"$f":"VLOOKUP($AB18,'Sheet2 Edit'!$AD$5:$AO$19,10,FALSE)","v":2},{"$f":"IF($AQ18=1,VLOOKUP($AB18,'Sheet2 Edit'!$AD$5:$AR$19,11,FALSE),VLOOKUP($AB18,'Sheet2 Edit'!$AD$5:$AR$19,15,FALSE))","v":2},{"$f":"VLOOKUP($AB18,'Sheet2 Edit'!$AD$5:$AO$19,12,FALSE)","v":2},{"$f":"VLOOKUP($AB18,'Sheet2 Edit'!$AD$5:$AU$32,16,FALSE)","v":0},{"$f":"VLOOKUP($AB18,'Sheet2 Edit'!$AD$5:$AU$32,17,FALSE)","v":0},{"$f":"VLOOKUP($AB18,'Sheet2 Edit'!$AD$5:$AU$32,18,FALSE)","v":2},1,{"$nulls":23},1,{"$f":"IF($BI$14=1,OFFSET(Sheet5!$AQ$1,1,3),IF($BI$14=2,OFFSET(Sheet5!$AQ$13,1,3),IF($BI$14=3,OFFSET(Sheet5!$AQ$25,1,3),IF($BI$14=4,OFFSET(Sheet5!$AQ$37,1,3),IF($BI$14=5,OFFSET(Sheet5!$AQ$49,1,3))))))","v":0},{"$f":"IF($BI$14=1,OFFSET(Sheet5!$AR$1,1,3),IF($BI$14=2,OFFSET(Sheet5!$AR$13,1,3),IF($BI$14=3,OFFSET(Sheet5!$AR$25,1,3),IF($BI$14=4,OFFSET(Sheet5!$AR$37,1,3),IF($BI$14=5,OFFSET(Sheet5!$AR$49,1,3))))))","v":-1},"Poise",{"$nulls":4},15,null,2,2,2,1,1,1,1,1,1,1,1,{"$nulls":6},4]
[null,-4,-2,-2,15,{"$f":"VLOOKUP($E19,'Sheet2 Edit'!$E$5:$P$19,2,FALSE)","v":"Aldridge"},{"$f":"VLOOKUP($E19,'Sheet2 Edit'!$E$5:$P$19,3,FALSE)","v":"Joe"},{"$f":"VLOOKUP($E19,'Sheet2 Edit'!$E$5:$P$19,4,FALSE)","v":"B"},{"$f":"IF($T19=1,VLOOKUP($E19,'Sheet2 Edit'!$E$5:$P$19,5,FALSE),IF($T19=2,VLOOKUP($E19,'Sheet2 Edit'!$E$5:$T$19,13,FALSE),VLOOKUP($E19,'Sheet2 Edit'!$E$5:$T$19,14,FALSE)))","v":"1B"},{"$f":"VLOOKUP($E19,'Sheet2 Edit'!$E$5:$P$19,6,FALSE)","v":1},{"$f":"VLOOKUP($E19,'Sheet2 Edit'!$E$5:$P$19,7,FALSE)","v":2},{"$f":"VLOOKUP($E19,'Sheet2 Edit'!$E$5:$P$19,8,FALSE)","v":2},{"$f":"VLOOKUP($E19,'Sheet2 Edit'!$E$5:$P$19,9,FALSE)","v":2},{"$f":"VLOOKUP($E19,'Sheet2 Edit'!$E$5:$P$19,10,FALSE)","v":1},{"$f":"IF($T19=1,VLOOKUP($E19,'Sheet2 Edit'!$E$5:$P$19,11,FALSE),VLOOKUP($E19,'Sheet2 Edit'!$E$5:$T$19,15,FALSE))","v":3},{"$f":"VLOOKUP($E$19,'Sheet2 Edit'!$E$5:$P$19,12,FALSE)","v":1},{"$f":"VLOOKUP($E19,'Sheet2 Edit'!$E$5:$V$19,16,FALSE)","v":0},{"$f":"VLOOKUP($E19,'Sheet2 Edit'!$E$5:$V$19,17,FALSE)","v":0},{"$f":"VLOOKUP($E19,'Sheet2 Edit'!$E$5:$V$19,18,FALSE)","v":3},1,{"$nulls":4},-1,-1,-3,15,{"$f":"VLOOKUP($AB19,'Sheet2 Edit'!$AD$5:$AO$19,2,FALSE)","v":"Garcia"},{"$f":"VLOOKUP($AB19,'Sheet2 Edit'!$AD$5:$AO$19,3,FALSE)","v":"Jose"},{"$f":"VLOOKUP($AB19,'Sheet2 Edit'!$AD$5:$AO$19,4,FALSE)","v":"L"},{"$f":"IF($AQ19=1,VLOOKUP($AB19,'Sheet2 Edit'!$AD$5:$AR$19,5,FALSE),IF($AQ19=2,VLOOKUP($AB19,'Sheet2 Edit'!$AD$5:$AR$19,13,FALSE),VLOOKUP($AB19,'Sheet2 Edit'!$AD$5:$AR$19,14,FALSE)))","v":"LF"},{"$f":"VLOOKUP($AB19,'Sheet2 Edit'!$AD$5:$AO$19,6,FALSE)","v":2},{"$f":"VLOOKUP($AB19,'Sheet2 Edit'!$AD$5:$AO$19,7,FALSE)","v":3},{"$f":"VLOOKUP($AB19,'Sheet2 Edit'!$AD$5:$AO$19,8,FALSE)","v":5},{"$f":"VLOOKUP($AB19,'Sheet2 Edit'!$AD$5:$AO$19,9,FALSE)","v":5},{"$f":"VLOOKUP($AB19,'Sheet2 Edit'!$AD$5:$AO$19,10,FALSE)","v":5},{"$f":"IF($AQ19=1,VLOOKUP($AB19,'Sheet2 Edit'!$AD$5:$AR$19,11,FALSE),VLOOKUP($AB19,'Sheet2 Edit'!$AD$5:$AR$19,15,FALSE))","v":0},{"$f":"VLOOKUP($AB$19,'Sheet2 Edit'!$AD$5:$AO$19,12,FALSE)","v":1},{"$f":"VLOOKUP($AB19,'Sheet2 Edit'!$AD$5:$AU$32,16,FALSE)","v":0},{"$f":"VLOOKUP($AB19,'Sheet2 Edit'!$AD$5:$AU$32,17,FALSE)","v":0},{"$f":"VLOOKUP($AB19,'Sheet2 Edit'!$AD$5:$AU$32,18,FALSE)","v":1},2,{"$nulls":23},2,{"$f":"IF($BI$14=1,OFFSET(Sheet5!$AQ$2,1,3),IF($BI$14=2,OFFSET(Sheet5!$AQ$14,1,3),IF($BI$14=3,OFFSET(Sheet5!$AQ$26,1,3),IF($BI$14=4,OFFSET(Sheet5!$AQ$38,1,3),IF($BI$14=5,OFFSET(Sheet5!$AQ$50,1,3))))))","v":1},{"$f":"IF($BI$14=1,OFFSET(Sheet5!$AR$2,1,3),IF($BI$14=2,OFFSET(Sheet5!$AR$14,1,3),IF($BI$14=3,OFFSET(Sheet5!$AR$26,1,3),IF($BI$14=4,OFFSET(Sheet5!$AR$38,1,3),IF($BI$14=5,OFFSET(Sheet5!$AR$50,1,3))))))","v":0},{"$nulls":7},3,2,2,1,1,1,1,1,1,1,0,{"$nulls":6},5]
[{"$nulls":66},3,{"$f":"IF($BI$14=1,OFFSET(Sheet5!$AQ$3,1,3),IF($BI$14=2,OFFSET(Sheet5!$AQ$15,1,3),IF($BI$14=3,OFFSET(Sheet5!$AQ$27,1,3),IF($BI$14=4,OFFSET(Sheet5!$AQ$39,1,3),IF($BI$14=5,OFFSET(Sheet5!$AQ$51,1,3))))))","v":0},{"$f":"IF($BI$14=1,OFFSET(Sheet5!$AR$3,1,3),IF($BI$14=2,OFFSET(Sheet5!$AR$15,1,3),IF($BI$14=3,OFFSET(Sheet5!$AR$27,1,3),IF($BI$14=4,OFFSET(Sheet5!$AR$39,1,3),IF($BI$14=5,OFFSET(Sheet5!$AR$51,1,3))))))","v":-1},{"$nulls":7},4,2,2,1,1,1,1,1,0,0,0,{"$nulls":6},6]
[{"$nulls":7},"T","VsL","VsR","ST",-1,"-2","-3","-4","-5","-6","-7","P","ST","GR",{"$nulls":9},"T","VsL","VsR","ST","-1","-2","-3","-4","-5","-6","-7","P","ST","GR",{"$nulls":22},4,{"$f":"IF($BI$14=1,OFFSET(Sheet5!$AQ$4,1,3),IF($BI$14=2,OFFSET(Sheet5!$AQ$16,1,3),IF($BI$14=3,OFFSET(Sheet5!$AQ$28,1,3),IF($BI$14=4,OFFSET(Sheet5!$AQ$40,1,3),IF($BI$14=5,OFFSET(Sheet5!$AQ$52,1,3))))))","v":1},{"$f":"IF($BI$14=1,OFFSET(Sheet5!$AR$4,1,3),IF($BI$14=2,OFFSET(Sheet5!$AR$16,1,3),IF($BI$14=3,OFFSET(Sheet5!$AR$28,1,3),IF($BI$14=4,OFFSET(Sheet5!$AR$40,1,3),IF($BI$14=5,OFFSET(Sheet5!$AR$52,1,3))))))","v":0},{"$nulls":7},5,2,1,1,1,1,0,0,0,0,0,{"$nulls":6},7]
[{"$nulls":3},"E",{"$nulls":22},"E",{"$nulls":39},5,{"$f":"IF($BI$14=1,OFFSET(Sheet5!$AQ$5,1,3),IF($BI$14=2,OFFSET(Sheet5!$AQ$17,1,3),IF($BI$14=3,OFFSET(Sheet5!$AQ$29,1,3),IF($BI$14=4,OFFSET(Sheet5!$AQ$41,1,3),IF($BI$14=5,OFFSET(Sheet5!$AQ$53,1,3))))))","v":1},{"$f":"IF($BI$14=1,OFFSET(Sheet5!$AR$5,1,3),IF($BI$14=2,OFFSET(Sheet5!$AR$17,1,3),IF($BI$14=3,OFFSET(Sheet5!$AR$29,1,3),IF($BI$14=4,OFFSET(Sheet5!$AR$41,1,3),IF($BI$14=5,OFFSET(Sheet5!$AR$53,1,3))))))","v":0},{"$nulls":24},8]
[{"$nulls":4},1,{"$f":"VLOOKUP($E23,'Sheet2 Edit'!$E$23:$S$32,2,FALSE)","v":"Bowerman"},{"$f":"VLOOKUP($E23,'Sheet2 Edit'!$E$23:$S$32,3,FALSE)","v":"Nate"},{"$f":"VLOOKUP($E23,'Sheet2 Edit'!$E$23:$S$32,4,FALSE)","v":"L"},{"$f":"VLOOKUP($E23,'Sheet2 Edit'!$E$23:$S$32,5,FALSE)-SUM(B23:D23)","v":-5},{"$f":"VLOOKUP($E23,'Sheet2 Edit'!$E$23:$S$32,6,FALSE)-SUM(B23:D23)","v":-3},{"$f":"VLOOKUP($E23,'Sheet2 Edit'!$E$23:$S$32,7,FALSE)","v":"5"},{"$f":"VLOOKUP($E23,'Sheet2 Edit'!$E$23:$S$32,8,FALSE)","v":0},{"$f":"VLOOKUP($E23,'Sheet2 Edit'!$E$23:$S$32,9,FALSE)","v":0},{"$f":"VLOOKUP($E23,'Sheet2 Edit'!$E$23:$S$32,10,FALSE)","v":0},{"$f":"VLOOKUP($E23,'Sheet2 Edit'!$E$23:$S$32,11,FALSE)","v":0},{"$f":"VLOOKUP($E23,'Sheet2 Edit'!$E$23:$S$32,12,FALSE)","v":0},{"$f":"VLOOKUP($E23,'Sheet2 Edit'!$E$23:$S$32,13,FALSE)","v":0},{"$f":"VLOOKUP($E$23,'Sheet2 Edit'!$E$23:$S$32,14,FALSE)","v":0},{"$f":"VLOOKUP($E23,'Sheet2 Edit'!$E$23:$S$32,15,FALSE)","v":5},{"$f":"VLOOKUP($E23,'Sheet2 Edit'!$E$23:$U$32,16,FALSE)","v":0},{"$f":"VLOOKUP($E23,'Sheet2 Edit'!$E$23:$U$32,17,FALSE)","v":0},{"$nulls":6},1,{"$f":"VLOOKUP($AB23,'Sheet2 Edit'!$AD$23:$AR$32,2,FALSE)","v":"Joseph"},{"$f":"VLOOKUP($AB23,'Sheet2 Edit'!$AD$23:$AR$32,3,FALSE)","v":"Dennis"},{"$f":"VLOOKUP($AB23,'Sheet2 Edit'!$AD$22:$AR$32,4,FALSE)","v":"R"},{"$f":"VLOOKUP($AB23,'Sheet2 Edit'!$AD$23:$AR$32,5,FALSE)-SUM($Y23:$AA23)","v":-4},{"$f":"VLOOKUP($AB23,'Sheet2 Edit'!$AD$23:$AR$32,6,FALSE)-SUM($Y23:$AA23)","v":-5},{"$f":"VLOOKUP($AB23,'Sheet2 Edit'!$AD$23:$AR$32,7,FALSE)","v":5},{"$f":"VLOOKUP($AB$23,'Sheet2 Edit'!$AD$23:$AR$32,8,FALSE)","v":0},{"$f":"VLOOKUP($AB23,'Sheet2 Edit'!$AD$23:$AR$32,9,FALSE)","v":0},{"$f":"VLOOKUP($AB23,'Sheet2 Edit'!$AD$23:$AR$32,10,FALSE)","v":0},{"$f":"VLOOKUP($AB23,'Sheet2 Edit'!$AD$23:$AR$32,11,FALSE)","v":0},{"$f":"VLOOKUP($AB23,'Sheet2 Edit'!$AD$23:$AR$32,12,FALSE)","v":0},{"$f":"VLOOKUP($AB23,'Sheet2 Edit'!$AD$23:$AR$32,13,FALSE)","v":0},{"$f":"VLOOKUP($AB23,'Sheet2 Edit'!$AD$23:$AR$32,14,FALSE)","v":0},{"$f":"VLOOKUP($AB23,'Sheet2 Edit'!$AD$23:$AR$32,15,FALSE)","v":3},{"$f":"VLOOKUP($AB23,'Sheet2 Edit'!$AD$23:$AU$32,16,FALSE)","v":0},{"$f":"VLOOKUP($AB23,'Sheet2 Edit'!$AD$23:$AU$32,17,FALSE)","v":0},{"$nulls":7},"SS","2B",{"$nulls":6},"C",{"$f":"IF(BU13=F2,INDEX(F5:F13,MATCH(BH23,I5:I13,0)),IF(BU13=AC2,INDEX(AC5:AC13,MATCH(BH23,AF5:AF13,0))))","v":"Moran"},{"$nulls":5},6,{"$f":"IF($BI$14=1,OFFSET(Sheet5!$AQ$6,1,3),IF($BI$14=2,OFFSET(Sheet5!$AQ$18,1,3),IF($BI$14=3,OFFSET(Sheet5!$AQ$30,1,3),IF($BI$14=4,OFFSET(Sheet5!$AQ$42,1,3),IF($BI$14=5,OFFSET(Sheet5!$AQ$54,1,3))))))","v":0},{"$f":"IF($BI$14=1,OFFSET(Sheet5!$AR$6,1,3),IF($BI$14=2,OFFSET(Sheet5!$AR$18,1,3),IF($BI$14=3,OFFSET(Sheet5!$AR$30,1,3),IF($BI$14=4,OFFSET(Sheet5!$AR$42,1,3),IF($BI$14=5,OFFSET(Sheet5!$AR$54,1,3))))))","v":0},{"$nulls":24},9]
[{"$nulls":4},2,{"$f":"VLOOKUP($E24,'Sheet2 Edit'!$E$23:$S$32,2,FALSE)","v":"Francis"},{"$f":"VLOOKUP($E24,'Sheet2 Edit'!$E$23:$S$32,3,FALSE)","v":"Mark"},{"$f":"VLOOKUP($E24,'Sheet2 Edit'!$E$23:$S$32,4,FALSE)","v":"R"},{"$f":"VLOOKUP($E24,'Sheet2 Edit'!$E$23:$S$32,5,FALSE)-SUM(B24:D24)","v":-4},{"$f":"VLOOKUP($E24,'Sheet2 Edit'!$E$23:$S$32,6,FALSE)-SUM(B24:D24)","v":-3},{"$f":"VLOOKUP($E24,'Sheet2 Edit'!$E$23:$S$32,7,FALSE)","v":"5"},{"$f":"VLOOKUP($E24,'Sheet2 Edit'!$E$23:$S$32,8,FALSE)","v":0},{"$f":"VLOOKUP($E24,'Sheet2 Edit'!$E$23:$S$32,9,FALSE)","v":0},{"$f":"VLOOKUP($E24,'Sheet2 Edit'!$E$23:$S$32,10,FALSE)","v":0},{"$f":"VLOOKUP($E24,'Sheet2 Edit'!$E$23:$S$32,11,FALSE)","v":0},{"$f":"VLOOKUP($E24,'Sheet2 Edit'!$E$23:$S$32,12,FALSE)","v":0},{"$f":"VLOOKUP($E24,'Sheet2 Edit'!$E$23:$S$32,13,FALSE)","v":0},{"$f":"VLOOKUP($E$23,'Sheet2 Edit'!$E$23:$S$32,14,FALSE)","v":0},{"$f":"VLOOKUP($E24,'Sheet2 Edit'!$E$23:$S$32,15,FALSE)","v":2},{"$f":"VLOOKUP($E24,'Sheet2 Edit'!$E$23:$U$32,16,FALSE)","v":0},{"$f":"VLOOKUP($E24,'Sheet2 Edit'!$E$23:$U$32,17,FALSE)","v":0},{"$nulls":6},2,{"$f":"VLOOKUP($AB24,'Sheet2 Edit'!$AD$23:$AR$32,2,FALSE)","v":"Robinson"},{"$f":"VLOOKUP($AB24,'Sheet2 Edit'!$AD$23:$AR$32,3,FALSE)","v":"Johnny"},{"$f":"VLOOKUP($AB24,'Sheet2 Edit'!$AD$22:$AR$32,4,FALSE)","v":"L"},{"$f":"VLOOKUP($AB24,'Sheet2 Edit'!$AD$23:$AR$32,5,FALSE)-SUM($Y24:$AA24)","v":-4},{"$f":"VLOOKUP($AB24,'Sheet2 Edit'!$AD$23:$AR$32,6,FALSE)-SUM($Y24:$AA24)","v":-3},{"$f":"VLOOKUP($AB24,'Sheet2 Edit'!$AD$23:$AR$32,7,FALSE)","v":5},{"$f":"VLOOKUP($AB24,'Sheet2 Edit'!$AD$23:$AR$32,8,FALSE)","v":0},{"$f":"VLOOKUP($AB24,'Sheet2 Edit'!$AD$23:$AR$32,9,FALSE)","v":0},{"$f":"VLOOKUP($AB24,'Sheet2 Edit'!$AD$23:$AR$32,10,FALSE)","v":0},{"$f":"VLOOKUP($AB24,'Sheet2 Edit'!$AD$23:$AR$32,11,FALSE)","v":0},{"$f":"VLOOKUP($AB24,'Sheet2 Edit'!$AD$23:$AR$32,12,FALSE)","v":0},{"$f":"VLOOKUP($AB24,'Sheet2 Edit'!$AD$23:$AR$32,13,FALSE)","v":0},{"$f":"VLOOKUP($AB24,'Sheet2 Edit'!$AD$23:$AR$32,14,FALSE)","v":0},{"$f":"VLOOKUP($AB24,'Sheet2 Edit'!$AD$23:$AR$32,15,FALSE)","v":2},{"$f":"VLOOKUP($AB24,'Sheet2 Edit'!$AD$23:$AU$32,16,FALSE)","v":0},{"$f":"VLOOKUP($AB24,'Sheet2 Edit'!$AD$23:$AU$32,17,FALSE)","v":0},{"$nulls":7},"2B","SS",{"$nulls":7},{"$f":"IF($BU$13=$F$2,VLOOKUP($BI$23,$F$5:$P$13,10,FALSE),VLOOKUP($BI$23,$AC$5:$AM$13,10,FALSE))","v":5},{"$f":"IF($BU$13=$F$2,VLOOKUP($BI$23,$F$5:$P$13,11,FALSE),VLOOKUP($BI$23,$AC$5:$AM$13,11,FALSE))","v":3},{"$nulls":4},7,{"$f":"IF($BI$14=1,OFFSET(Sheet5!$AQ$7,1,3),IF($BI$14=2,OFFSET(Sheet5!$AQ$19,1,3),IF($BI$14=3,OFFSET(Sheet5!$AQ$31,1,3),IF($BI$14=4,OFFSET(Sheet5!$AQ$43,1,3),IF($BI$14=5,OFFSET(Sheet5!$AQ$55,1,3))))))","v":1},{"$f":"IF($BI$14=1,OFFSET(Sheet5!$AR$7,1,3),IF($BI$14=2,OFFSET(Sheet5!$AR$19,1,3),IF($BI$14=3,OFFSET(Sheet5!$AR$31,1,3),IF($BI$14=4,OFFSET(Sheet5!$AR$43,1,3),IF($BI$14=5,OFFSET(Sheet5!$AR$55,1,3))))))","v":-1},null,null,{"$f":"AK55","v":"Allentown"},{"$nulls":4},{"$f":"COUNTIF(Stats!C2:C50,\"Batter\")","v":0},{"$nulls":4},{"$f":"AT55","v":"Harrisburg"},null,null,{"$f":"COUNTIF(Stats!F2:F50,\"Batter\")","v":0},{"$nulls":8},10]
[{"$nulls":4},3,{"$f":"VLOOKUP($E25,'Sheet2 Edit'!$E$23:$S$32,2,FALSE)","v":"Hoover"},{"$f":"VLOOKUP($E25,'Sheet2 Edit'!$E$23:$S$32,3,FALSE)","v":"Stanley"},{"$f":"VLOOKUP($E25,'Sheet2 Edit'!$E$23:$S$32,4,FALSE)","v":"L"},{"$f":"VLOOKUP($E25,'Sheet2 Edit'!$E$23:$S$32,5,FALSE)-SUM(B25:D25)","v":-3},{"$f":"VLOOKUP($E25,'Sheet2 Edit'!$E$23:$S$32,6,FALSE)-SUM(B25:D25)","v":-4},{"$f":"VLOOKUP($E25,'Sheet2 Edit'!$E$23:$S$32,7,FALSE)","v":"4"},{"$f":"VLOOKUP($E25,'Sheet2 Edit'!$E$23:$S$32,8,FALSE)","v":0},{"$f":"VLOOKUP($E25,'Sheet2 Edit'!$E$23:$S$32,9,FALSE)","v":0},{"$f":"VLOOKUP($E25,'Sheet2 Edit'!$E$23:$S$32,10,FALSE)","v":0},{"$f":"VLOOKUP($E25,'Sheet2 Edit'!$E$23:$S$32,11,FALSE)","v":0},{"$f":"VLOOKUP($E25,'Sheet2 Edit'!$E$23:$S$32,12,FALSE)","v":0},{"$f":"VLOOKUP($E25,'Sheet2 Edit'!$E$23:$S$32,13,FALSE)","v":0},{"$f":"VLOOKUP($E$23,'Sheet2 Edit'!$E$23:$S$32,14,FALSE)","v":0},{"$f":"VLOOKUP($E25,'Sheet2 Edit'!$E$23:$S$32,15,FALSE)","v":3},{"$f":"VLOOKUP($E25,'Sheet2 Edit'!$E$23:$U$32,16,FALSE)","v":0},{"$f":"VLOOKUP($E25,'Sheet2 Edit'!$E$23:$U$32,17,FALSE)","v":0},{"$nulls":6},3,{"$f":"VLOOKUP($AB25,'Sheet2 Edit'!$AD$23:$AR$32,2,FALSE)","v":"Bradford"},{"$f":"VLOOKUP($AB25,'Sheet2 Edit'!$AD$23:$AR$32,3,FALSE)","v":"Robert"},{"$f":"VLOOKUP($AB25,'Sheet2 Edit'!$AD$22:$AR$32,4,FALSE)","v":"L"},{"$f":"VLOOKUP($AB25,'Sheet2 Edit'!$AD$23:$AR$32,5,FALSE)-SUM($Y25:$AA25)","v":-5},{"$f":"VLOOKUP($AB25,'Sheet2 Edit'!$AD$23:$AR$32,6,FALSE)-SUM($Y25:$AA25)","v":-3},{"$f":"VLOOKUP($AB25,'Sheet2 Edit'!$AD$23:$AR$32,7,FALSE)","v":5},{"$f":"VLOOKUP($AB25,'Sheet2 Edit'!$AD$23:$AR$32,8,FALSE)","v":0},{"$f":"VLOOKUP($AB25,'Sheet2 Edit'!$AD$23:$AR$32,9,FALSE)","v":0},{"$f":"VLOOKUP($AB25,'Sheet2 Edit'!$AD$23:$AR$32,10,FALSE)","v":0},{"$f":"VLOOKUP($AB25,'Sheet2 Edit'!$AD$23:$AR$32,11,FALSE)","v":0},{"$f":"VLOOKUP($AB25,'Sheet2 Edit'!$AD$23:$AR$32,12,FALSE)","v":0},{"$f":"VLOOKUP($AB25,'Sheet2 Edit'!$AD$23:$AR$32,13,FALSE)","v":0},{"$f":"VLOOKUP($AB25,'Sheet2 Edit'!$AD$23:$AR$32,14,FALSE)","v":" "},{"$f":"VLOOKUP($AB25,'Sheet2 Edit'!$AD$23:$AR$32,15,FALSE)","v":3},{"$f":"VLOOKUP($AB25,'Sheet2 Edit'!$AD$23:$AU$32,16,FALSE)","v":0},{"$f":"VLOOKUP($AB25,'Sheet2 Edit'!$AD$23:$AU$32,17,FALSE)","v":0},{"$nulls":3},"OF","F","A",null,"1B","SS",{"$nulls":7},"F","A",{"$nulls":4},8,{"$f":"IF($BI$14=1,OFFSET(Sheet5!$AQ$8,1,3),IF($BI$14=2,OFFSET(Sheet5!$AQ$20,1,3),IF($BI$14=3,OFFSET(Sheet5!$AQ$32,1,3),IF($BI$14=4,OFFSET(Sheet5!$AQ$44,1,3),IF($BI$14=5,OFFSET(Sheet5!$AQ$56,1,3))))))","v":1},{"$f":"IF($BI$14=1,OFFSET(Sheet5!$AR$8,1,3),IF($BI$14=2,OFFSET(Sheet5!$AR$20,1,3),IF($BI$14=3,OFFSET(Sheet5!$AR$32,1,3),IF($BI$14=4,OFFSET(Sheet5!$AR$44,1,3),IF($BI$14=5,OFFSET(Sheet5!$AR$56,1,3))))))","v":0},{"$nulls":24},11]
[{"$nulls":4},4,{"$f":"VLOOKUP($E26,'Sheet2 Edit'!$E$23:$S$32,2,FALSE)","v":"Rivas"},{"$f":"VLOOKUP($E26,'Sheet2 Edit'!$E$23:$S$32,3,FALSE)","v":"Antonio"},{"$f":"VLOOKUP($E26,'Sheet2 Edit'!$E$23:$S$32,4,FALSE)","v":"R"},{"$f":"VLOOKUP($E26,'Sheet2 Edit'!$E$23:$S$32,5,FALSE)-SUM(B26:D26)","v":-2},{"$f":"VLOOKUP($E26,'Sheet2 Edit'!$E$23:$S$32,6,FALSE)-SUM(B26:D26)","v":-3},{"$f":"VLOOKUP($E26,'Sheet2 Edit'!$E$23:$S$32,7,FALSE)","v":4},{"$f":"VLOOKUP($E26,'Sheet2 Edit'!$E$23:$S$32,8,FALSE)","v":0},{"$f":"VLOOKUP($E26,'Sheet2 Edit'!$E$23:$S$32,9,FALSE)","v":0},{"$f":"VLOOKUP($E26,'Sheet2 Edit'!$E$23:$S$32,10,FALSE)","v":0},{"$f":"VLOOKUP($E26,'Sheet2 Edit'!$E$23:$S$32,11,FALSE)","v":0},{"$f":"VLOOKUP($E26,'Sheet2 Edit'!$E$23:$S$32,12,FALSE)","v":0},{"$f":"VLOOKUP($E26,'Sheet2 Edit'!$E$23:$S$32,13,FALSE)","v":0},{"$f":"VLOOKUP($E$23,'Sheet2 Edit'!$E$23:$S$32,14,FALSE)","v":0},{"$f":"VLOOKUP($E26,'Sheet2 Edit'!$E$23:$S$32,15,FALSE)","v":2},{"$f":"VLOOKUP($E26,'Sheet2 Edit'!$E$23:$U$32,16,FALSE)","v":0},{"$f":"VLOOKUP($E26,'Sheet2 Edit'!$E$23:$U$32,17,FALSE)","v":0},{"$nulls":6},4,{"$f":"VLOOKUP($AB26,'Sheet2 Edit'!$AD$23:$AR$32,2,FALSE)","v":"Molina"},{"$f":"VLOOKUP($AB26,'Sheet2 Edit'!$AD$23:$AR$32,3,FALSE)","v":"Jesus"},{"$f":"VLOOKUP($AB26,'Sheet2 Edit'!$AD$22:$AR$32,4,FALSE)","v":"R"},{"$f":"VLOOKUP($AB26,'Sheet2 Edit'!$AD$23:$AR$32,5,FALSE)-SUM($Y26:$AA26)","v":-3},{"$f":"VLOOKUP($AB26,'Sheet2 Edit'!$AD$23:$AR$32,6,FALSE)-SUM($Y26:$AA26)","v":-3},{"$f":"VLOOKUP($AB26,'Sheet2 Edit'!$AD$23:$AR$32,7,FALSE)","v":5},{"$f":"VLOOKUP($AB26,'Sheet2 Edit'!$AD$23:$AR$32,8,FALSE)","v":0},{"$f":"VLOOKUP($AB26,'Sheet2 Edit'!$AD$23:$AR$32,9,FALSE)","v":0},{"$f":"VLOOKUP($AB26,'Sheet2 Edit'!$AD$23:$AR$32,10,FALSE)","v":0},{"$f":"VLOOKUP($AB26,'Sheet2 Edit'!$AD$23:$AR$32,11,FALSE)","v":0},{"$f":"VLOOKUP($AB26,'Sheet2 Edit'!$AD$23:$AR$32,12,FALSE)","v":0},{"$f":"VLOOKUP($AB26,'Sheet2 Edit'!$AD$23:$AR$32,13,FALSE)","v":0},{"$f":"VLOOKUP($AB26,'Sheet2 Edit'!$AD$23:$AR$32,14,FALSE)","v":0},{"$f":"VLOOKUP($AB26,'Sheet2 Edit'!$AD$23:$AR$32,15,FALSE)","v":3},{"$f":"VLOOKUP($AB26,'Sheet2 Edit'!$AD$23:$AU$32,16,FALSE)","v":0},{"$f":"VLOOKUP($AB26,'Sheet2 Edit'!$AD$23:$AU$32,17,FALSE)","v":0},{"$nulls":4},{"$f":"IF($BU$13=$AC$2,SUM($AZ$5,$BH$3,$BO$5),SUM($AZ$5,$BH$3,$BO$5))","v":11},{"$f":"IF($BU$13=$AC$2,SUM($BA$5,$BI$3,$BP$5),SUM($BA$5,$BI$3,$BP$5))","v":10},null,"3B","2B",{"$nulls":10},"Speed",null,null,9,{"$f":"IF($BI$14=1,OFFSET(Sheet5!$AQ$9,1,3),IF($BI$14=2,OFFSET(Sheet5!$AQ$21,1,3),IF($BI$14=3,OFFSET(Sheet5!$AQ$33,1,3),IF($BI$14=4,OFFSET(Sheet5!$AQ$45,1,3),IF($BI$14=5,OFFSET(Sheet5!$AQ$57,1,3))))))","v":0},{"$f":"IF($BI$14=1,OFFSET(Sheet5!$AR$9,1,3),IF($BI$14=2,OFFSET(Sheet5!$AR$21,1,3),IF($BI$14=3,OFFSET(Sheet5!$AR$33,1,3),IF($BI$14=4,OFFSET(Sheet5!$AR$45,1,3),IF($BI$14=5,OFFSET(Sheet5!$AR$57,1,3))))))","v":0},{"$nulls":24},12]
[{"$nulls":4},5,{"$f":"VLOOKUP($E27,'Sheet2 Edit'!$E$23:$S$32,2,FALSE)","v":"Serrano"},{"$f":"VLOOKUP($E27,'Sheet2 Edit'!$E$23:$S$32,3,FALSE)","v":"Jose"},{"$f":"VLOOKUP($E27,'Sheet2 Edit'!$E$23:$S$32,4,FALSE)","v":"R"},{"$f":"VLOOKUP($E27,'Sheet2 Edit'!$E$23:$S$32,5,FALSE)-SUM(B27:D27)","v":-2},{"$f":"VLOOKUP($E27,'Sheet2 Edit'!$E$23:$S$32,6,FALSE)-SUM(B27:D27)","v":-2},{"$f":"VLOOKUP($E27,'Sheet2 Edit'!$E$23:$S$32,7,FALSE)","v":5},{"$f":"VLOOKUP($E27,'Sheet2 Edit'!$E$23:$S$32,8,FALSE)","v":0},{"$f":"VLOOKUP($E27,'Sheet2 Edit'!$E$23:$S$32,9,FALSE)","v":0},{"$f":"VLOOKUP($E27,'Sheet2 Edit'!$E$23:$S$32,10,FALSE)","v":0},{"$f":"VLOOKUP($E27,'Sheet2 Edit'!$E$23:$S$32,11,FALSE)","v":0},{"$f":"VLOOKUP($E27,'Sheet2 Edit'!$E$23:$S$32,12,FALSE)","v":0},{"$f":"VLOOKUP($E27,'Sheet2 Edit'!$E$23:$S$32,13,FALSE)","v":0},{"$f":"VLOOKUP($E$23,'Sheet2 Edit'!$E$23:$S$32,14,FALSE)","v":0},{"$f":"VLOOKUP($E27,'Sheet2 Edit'!$E$23:$S$32,15,FALSE)","v":5},{"$f":"VLOOKUP($E27,'Sheet2 Edit'!$E$23:$U$32,16,FALSE)","v":0},{"$f":"VLOOKUP($E27,'Sheet2 Edit'!$E$23:$U$32,17,FALSE)","v":0},{"$nulls":6},5,{"$f":"VLOOKUP($AB27,'Sheet2 Edit'!$AD$23:$AR$32,2,FALSE)","v":"Philips"},{"$f":"VLOOKUP($AB27,'Sheet2 Edit'!$AD$23:$AR$32,3,FALSE)","v":"Julian"},{"$f":"VLOOKUP($AB27,'Sheet2 Edit'!$AD$22:$AR$32,4,FALSE)","v":"L"},{"$f":"VLOOKUP($AB27,'Sheet2 Edit'!$AD$23:$AR$32,5,FALSE)-SUM($Y27:$AA27)","v":-4},{"$f":"VLOOKUP($AB27,'Sheet2 Edit'!$AD$23:$AR$32,6,FALSE)-SUM($Y27:$AA27)","v":-3},{"$f":"VLOOKUP($AB27,'Sheet2 Edit'!$AD$23:$AR$32,7,FALSE)","v":5},{"$f":"VLOOKUP($AB27,'Sheet2 Edit'!$AD$23:$AR$32,8,FALSE)","v":0},{"$f":"VLOOKUP($AB27,'Sheet2 Edit'!$AD$23:$AR$32,9,FALSE)","v":0},{"$f":"VLOOKUP($AB27,'Sheet2 Edit'!$AD$23:$AR$32,10,FALSE)","v":0},{"$f":"VLOOKUP($AB27,'Sheet2 Edit'!$AD$23:$AR$32,11,FALSE)","v":0},{"$f":"VLOOKUP($AB27,'Sheet2 Edit'!$AD$23:$AR$32,12,FALSE)","v":0},{"$f":"VLOOKUP($AB27,'Sheet2 Edit'!$AD$23:$AR$32,13,FALSE)","v":0},{"$f":"VLOOKUP($AB27,'Sheet2 Edit'!$AD$23:$AR$32,14,FALSE)","v":0},{"$f":"VLOOKUP($AB27,'Sheet2 Edit'!$AD$23:$AR$32,15,FALSE)","v":2},{"$f":"VLOOKUP($AB27,'Sheet2 Edit'!$AD$23:$AU$32,16,FALSE)","v":0},{"$f":"VLOOKUP($AB27,'Sheet2 Edit'!$AD$23:$AU$32,17,FALSE)","v":0},{"$nulls":7},"P","SS",{"$nulls":4},3,{"$f":"VLOOKUP(BF27,BW4:BX12,2,FALSE)","v":"1B"},{"$nulls":4},5,null,null,10,{"$f":"IF($BI$14=1,OFFSET(Sheet5!$AQ$10,1,3),IF($BI$14=2,OFFSET(Sheet5!$AQ$22,1,3),IF($BI$14=3,OFFSET(Sheet5!$AQ$34,1,3),IF($BI$14=4,OFFSET(Sheet5!$AQ$46,1,3),IF($BI$14=5,OFFSET(Sheet5!$AQ$58,1,3))))))","v":1},{"$f":"IF($BI$14=1,OFFSET(Sheet5!$AR$10,1,3),IF($BI$14=2,OFFSET(Sheet5!$AR$22,1,3),IF($BI$14=3,OFFSET(Sheet5!$AR$34,1,3),IF($BI$14=4,OFFSET(Sheet5!$AR$46,1,3),IF($BI$14=5,OFFSET(Sheet5!$AR$58,1,3))))))","v":0},{"$nulls":24},13]
[{"$nulls":4},6,{"$f":"VLOOKUP($E28,'Sheet2 Edit'!$E$23:$S$32,2,FALSE)","v":"Garcim"},{"$f":"VLOOKUP($E28,'Sheet2 Edit'!$E$23:$S$32,3,FALSE)","v":"Tony"},{"$f":"VLOOKUP($E28,'Sheet2 Edit'!$E$23:$S$32,4,FALSE)","v":"L"},{"$f":"VLOOKUP($E28,'Sheet2 Edit'!$E$23:$S$32,5,FALSE)-SUM(B28:D28)","v":-4},{"$f":"VLOOKUP($E28,'Sheet2 Edit'!$E$23:$S$32,6,FALSE)-SUM(B28:D28)","v":-3},{"$f":"VLOOKUP($E28,'Sheet2 Edit'!$E$23:$S$32,7,FALSE)","v":1},{"$f":"VLOOKUP($E28,'Sheet2 Edit'!$E$23:$S$32,8,FALSE)","v":0},{"$f":"VLOOKUP($E28,'Sheet2 Edit'!$E$23:$S$32,9,FALSE)","v":0},{"$f":"VLOOKUP($E28,'Sheet2 Edit'!$E$23:$S$32,10,FALSE)","v":0},{"$f":"VLOOKUP($E28,'Sheet2 Edit'!$E$23:$S$32,11,FALSE)","v":0},{"$f":"VLOOKUP($E28,'Sheet2 Edit'!$E$23:$S$32,12,FALSE)","v":0},{"$f":"VLOOKUP($E28,'Sheet2 Edit'!$E$23:$S$32,13,FALSE)","v":0},{"$f":"VLOOKUP($E$23,'Sheet2 Edit'!$E$23:$S$32,14,FALSE)","v":0},{"$f":"VLOOKUP($E28,'Sheet2 Edit'!$E$23:$S$32,15,FALSE)","v":5},{"$f":"VLOOKUP($E28,'Sheet2 Edit'!$E$23:$U$32,16,FALSE)","v":0},{"$f":"VLOOKUP($E28,'Sheet2 Edit'!$E$23:$U$32,17,FALSE)","v":0},{"$nulls":6},6,{"$f":"VLOOKUP($AB28,'Sheet2 Edit'!$AD$23:$AR$32,2,FALSE)","v":"Samuels"},{"$f":"VLOOKUP($AB28,'Sheet2 Edit'!$AD$23:$AR$32,3,FALSE)","v":"Keith"},{"$f":"VLOOKUP($AB28,'Sheet2 Edit'!$AD$22:$AR$32,4,FALSE)","v":"L"},{"$f":"VLOOKUP($AB28,'Sheet2 Edit'!$AD$23:$AR$32,5,FALSE)-SUM($Y28:$AA28)","v":-5},{"$f":"VLOOKUP($AB28,'Sheet2 Edit'!$AD$23:$AR$32,6,FALSE)-SUM($Y28:$AA28)","v":-4},{"$f":"VLOOKUP($AB28,'Sheet2 Edit'!$AD$23:$AR$32,7,FALSE)","v":1},{"$f":"VLOOKUP($AB28,'Sheet2 Edit'!$AD$23:$AR$32,8,FALSE)","v":0},{"$f":"VLOOKUP($AB28,'Sheet2 Edit'!$AD$23:$AR$32,9,FALSE)","v":0},{"$f":"VLOOKUP($AB28,'Sheet2 Edit'!$AD$23:$AR$32,10,FALSE)","v":0},{"$f":"VLOOKUP($AB28,'Sheet2 Edit'!$AD$23:$AR$32,11,FALSE)","v":0},{"$f":"VLOOKUP($AB28,'Sheet2 Edit'!$AD$23:$AR$32,12,FALSE)","v":0},{"$f":"VLOOKUP($AB28,'Sheet2 Edit'!$AD$23:$AR$32,13,FALSE)","v":0},{"$f":"VLOOKUP($AB28,'Sheet2 Edit'!$AD$23:$AR$32,14,FALSE)","v":0},{"$f":"VLOOKUP($AB28,'Sheet2 Edit'!$AD$23:$AR$32,15,FALSE)","v":4},{"$f":"VLOOKUP($AB28,'Sheet2 Edit'!$AD$23:$AU$32,16,FALSE)","v":0},{"$f":"VLOOKUP($AB28,'Sheet2 Edit'!$AD$23:$AU$32,17,FALSE)","v":0},{"$nulls":3},"IF","F","A",{"$nulls":43},14]
[{"$nulls":4},7,{"$f":"VLOOKUP($E29,'Sheet2 Edit'!$E$23:$S$32,2,FALSE)","v":"Kelley"},{"$f":"VLOOKUP($E29,'Sheet2 Edit'!$E$23:$S$32,3,FALSE)","v":"John"},{"$f":"VLOOKUP($E29,'Sheet2 Edit'!$E$23:$S$32,4,FALSE)","v":"R"},{"$f":"VLOOKUP($E29,'Sheet2 Edit'!$E$23:$S$32,5,FALSE)-SUM(B29:D29)","v":-3},{"$f":"VLOOKUP($E29,'Sheet2 Edit'!$E$23:$S$32,6,FALSE)-SUM(B29:D29)","v":-4},{"$f":"VLOOKUP($E29,'Sheet2 Edit'!$E$23:$S$32,7,FALSE)","v":1},{"$f":"VLOOKUP($E29,'Sheet2 Edit'!$E$23:$S$32,8,FALSE)","v":0},{"$f":"VLOOKUP($E29,'Sheet2 Edit'!$E$23:$S$32,9,FALSE)","v":0},{"$f":"VLOOKUP($E29,'Sheet2 Edit'!$E$23:$S$32,10,FALSE)","v":0},{"$f":"VLOOKUP($E29,'Sheet2 Edit'!$E$23:$S$32,11,FALSE)","v":0},{"$f":"VLOOKUP($E29,'Sheet2 Edit'!$E$23:$S$32,12,FALSE)","v":0},{"$f":"VLOOKUP($E29,'Sheet2 Edit'!$E$23:$S$32,13,FALSE)","v":0},{"$f":"VLOOKUP($E$23,'Sheet2 Edit'!$E$23:$S$32,14,FALSE)","v":0},{"$f":"VLOOKUP($E29,'Sheet2 Edit'!$E$23:$S$32,15,FALSE)","v":4},{"$f":"VLOOKUP($E29,'Sheet2 Edit'!$E$23:$U$32,16,FALSE)","v":0},{"$f":"VLOOKUP($E29,'Sheet2 Edit'!$E$23:$U$32,17,FALSE)","v":0},{"$nulls":6},7,{"$f":"VLOOKUP($AB29,'Sheet2 Edit'!$AD$23:$AR$32,2,FALSE)","v":"Berry"},{"$f":"VLOOKUP($AB29,'Sheet2 Edit'!$AD$23:$AR$32,3,FALSE)","v":"Vince"},{"$f":"VLOOKUP($AB29,'Sheet2 Edit'!$AD$22:$AR$32,4,FALSE)","v":"R"},{"$f":"VLOOKUP($AB29,'Sheet2 Edit'!$AD$23:$AR$32,5,FALSE)-SUM($Y29:$AA29)","v":-2},{"$f":"VLOOKUP($AB29,'Sheet2 Edit'!$AD$23:$AR$32,6,FALSE)-SUM($Y29:$AA29)","v":-4},{"$f":"VLOOKUP($AB29,'Sheet2 Edit'!$AD$23:$AR$32,7,FALSE)","v":1},{"$f":"VLOOKUP($AB29,'Sheet2 Edit'!$AD$23:$AR$32,8,FALSE)","v":0},{"$f":"VLOOKUP($AB29,'Sheet2 Edit'!$AD$23:$AR$32,9,FALSE)","v":0},{"$f":"VLOOKUP($AB29,'Sheet2 Edit'!$AD$23:$AR$32,10,FALSE)","v":0},{"$f":"VLOOKUP($AB29,'Sheet2 Edit'!$AD$23:$AR$32,11,FALSE)","v":0},{"$f":"VLOOKUP($AB29,'Sheet2 Edit'!$AD$23:$AR$32,12,FALSE)","v":0},{"$f":"VLOOKUP($AB29,'Sheet2 Edit'!$AD$23:$AR$32,13,FALSE)","v":0},{"$f":"VLOOKUP($AB29,'Sheet2 Edit'!$AD$23:$AR$32,14,FALSE)","v":0},{"$f":"VLOOKUP($AB29,'Sheet2 Edit'!$AD$23:$AR$32,15,FALSE)","v":4},{"$f":"VLOOKUP($AB29,'Sheet2 Edit'!$AD$23:$AU$32,16,FALSE)","v":0},{"$f":"VLOOKUP($AB29,'Sheet2 Edit'!$AD$23:$AU$32,17,FALSE)","v":0},{"$nulls":4},{"$f":"IF($BU$13=$AC$2,SUM($BB$15,$BE$10,$BL$10,$BI$24,$BO$15),SUM($BB$15,$BE$10,$BL$10,$BO$15,$BI$24))","v":25},{"$f":"IF($BU$13=$AC$2,SUM($BC$15,$BF$10,$BM$10,$BP$15,$BJ$24),SUM($BC$15,$BF$10,$BM$10,$BP$15,$BJ$24))","v":12},{"$nulls":13},"Row",{"$nulls":29},15]
[{"$nulls":4},8,{"$f":"VLOOKUP($E30,'Sheet2 Edit'!$E$23:$S$32,2,FALSE)","v":"McAughy"},{"$f":"VLOOKUP($E30,'Sheet2 Edit'!$E$23:$S$32,3,FALSE)","v":"Shane"},{"$f":"VLOOKUP($E30,'Sheet2 Edit'!$E$23:$S$32,4,FALSE)","v":"R"},{"$f":"VLOOKUP($E30,'Sheet2 Edit'!$E$23:$S$32,5,FALSE)-SUM(B30:D30)","v":-4},{"$f":"VLOOKUP($E30,'Sheet2 Edit'!$E$23:$S$32,6,FALSE)-SUM(B30:D30)","v":-3},{"$f":"VLOOKUP($E30,'Sheet2 Edit'!$E$23:$S$32,7,FALSE)","v":1},{"$f":"VLOOKUP($E30,'Sheet2 Edit'!$E$23:$S$32,8,FALSE)","v":0},{"$f":"VLOOKUP($E30,'Sheet2 Edit'!$E$23:$S$32,9,FALSE)","v":0},{"$f":"VLOOKUP($E30,'Sheet2 Edit'!$E$23:$S$32,10,FALSE)","v":0},{"$f":"VLOOKUP($E30,'Sheet2 Edit'!$E$23:$S$32,11,FALSE)","v":0},{"$f":"VLOOKUP($E30,'Sheet2 Edit'!$E$23:$S$32,12,FALSE)","v":0},{"$f":"VLOOKUP($E30,'Sheet2 Edit'!$E$23:$S$32,13,FALSE)","v":0},{"$f":"VLOOKUP($E$23,'Sheet2 Edit'!$E$23:$S$32,14,FALSE)","v":0},{"$f":"VLOOKUP($E30,'Sheet2 Edit'!$E$23:$S$32,15,FALSE)","v":3},{"$f":"VLOOKUP($E30,'Sheet2 Edit'!$E$23:$U$32,16,FALSE)","v":0},{"$f":"VLOOKUP($E30,'Sheet2 Edit'!$E$23:$U$32,17,FALSE)","v":0},{"$nulls":6},8,{"$f":"VLOOKUP($AB30,'Sheet2 Edit'!$AD$23:$AR$32,2,FALSE)","v":"Little"},{"$f":"VLOOKUP($AB30,'Sheet2 Edit'!$AD$23:$AR$32,3,FALSE)","v":"Derek"},{"$f":"VLOOKUP($AB30,'Sheet2 Edit'!$AD$22:$AR$32,4,FALSE)","v":"L"},{"$f":"VLOOKUP($AB30,'Sheet2 Edit'!$AD$23:$AR$32,5,FALSE)-SUM($Y30:$AA30)","v":-4},{"$f":"VLOOKUP($AB30,'Sheet2 Edit'!$AD$23:$AR$32,6,FALSE)-SUM($Y30:$AA30)","v":-2},{"$f":"VLOOKUP($AB30,'Sheet2 Edit'!$AD$23:$AR$32,7,FALSE)","v":1},{"$f":"VLOOKUP($AB30,'Sheet2 Edit'!$AD$23:$AR$32,8,FALSE)","v":0},{"$f":"VLOOKUP($AB30,'Sheet2 Edit'!$AD$23:$AR$32,9,FALSE)","v":0},{"$f":"VLOOKUP($AB30,'Sheet2 Edit'!$AD$23:$AR$32,10,FALSE)","v":0},{"$f":"VLOOKUP($AB30,'Sheet2 Edit'!$AD$23:$AR$32,11,FALSE)","v":0},{"$f":"VLOOKUP($AB30,'Sheet2 Edit'!$AD$23:$AR$32,12,FALSE)","v":0},{"$f":"VLOOKUP($AB30,'Sheet2 Edit'!$AD$23:$AR$32,13,FALSE)","v":0},{"$f":"VLOOKUP($AB30,'Sheet2 Edit'!$AD$23:$AR$32,14,FALSE)","v":0},{"$f":"VLOOKUP($AB30,'Sheet2 Edit'!$AD$23:$AR$32,15,FALSE)","v":3},{"$f":"VLOOKUP($AB30,'Sheet2 Edit'!$AD$23:$AU$32,16,FALSE)","v":0},{"$f":"VLOOKUP($AB30,'Sheet2 Edit'!$AD$23:$AU$32,17,FALSE)","v":0},{"$nulls":13},5,{"$f":"VLOOKUP(BF30,$BW$4:$BX$12,2,FALSE)","v":"3B"},"DP1",{"$nulls":3},2,{"$f":"VLOOKUP(BL30,Sheet5!BN7:BO10,2,FALSE)","v":"S3/R3/SBH"}]
[{"$nulls":4},9,{"$f":"VLOOKUP($E31,'Sheet2 Edit'!$E$23:$S$32,2,FALSE)","v":"Marino"},{"$f":"VLOOKUP($E31,'Sheet2 Edit'!$E$23:$S$32,3,FALSE)","v":"Francisco"},{"$f":"VLOOKUP($E31,'Sheet2 Edit'!$E$23:$S$32,4,FALSE)","v":"R"},{"$f":"VLOOKUP($E31,'Sheet2 Edit'!$E$23:$S$32,5,FALSE)-SUM(B31:D31)","v":-2},{"$f":"VLOOKUP($E31,'Sheet2 Edit'!$E$23:$S$32,6,FALSE)-SUM(B31:D31)","v":-2},{"$f":"VLOOKUP($E31,'Sheet2 Edit'!$E$23:$S$32,7,FALSE)","v":4},{"$f":"VLOOKUP($E31,'Sheet2 Edit'!$E$23:$S$32,8,FALSE)","v":0},{"$f":"VLOOKUP($E31,'Sheet2 Edit'!$E$23:$S$32,9,FALSE)","v":0},{"$f":"VLOOKUP($E31,'Sheet2 Edit'!$E$23:$S$32,10,FALSE)","v":0},{"$f":"VLOOKUP($E31,'Sheet2 Edit'!$E$23:$S$32,11,FALSE)","v":0},{"$f":"VLOOKUP($E31,'Sheet2 Edit'!$E$23:$S$32,12,FALSE)","v":0},{"$f":"VLOOKUP($E31,'Sheet2 Edit'!$E$23:$S$32,13,FALSE)","v":0},{"$f":"VLOOKUP($E$23,'Sheet2 Edit'!$E$23:$S$32,14,FALSE)","v":0},{"$f":"VLOOKUP($E31,'Sheet2 Edit'!$E$23:$S$32,15,FALSE)","v":3},{"$f":"VLOOKUP($E31,'Sheet2 Edit'!$E$23:$U$32,16,FALSE)","v":0},{"$f":"VLOOKUP($E31,'Sheet2 Edit'!$E$23:$U$32,17,FALSE)","v":0},{"$nulls":6},9,{"$f":"VLOOKUP($AB31,'Sheet2 Edit'!$AD$23:$AR$32,2,FALSE)","v":"Pierson"},{"$f":"VLOOKUP($AB31,'Sheet2 Edit'!$AD$23:$AR$32,3,FALSE)","v":"Gary"},{"$f":"VLOOKUP($AB31,'Sheet2 Edit'!$AD$22:$AR$32,4,FALSE)","v":"R"},{"$f":"VLOOKUP($AB31,'Sheet2 Edit'!$AD$23:$AR$32,5,FALSE)-SUM($Y31:$AA31)","v":-2},{"$f":"VLOOKUP($AB31,'Sheet2 Edit'!$AD$23:$AR$32,6,FALSE)-SUM($Y31:$AA31)","v":-3},{"$f":"VLOOKUP($AB31,'Sheet2 Edit'!$AD$23:$AR$32,7,FALSE)","v":2},{"$f":"VLOOKUP($AB31,'Sheet2 Edit'!$AD$23:$AR$32,8,FALSE)","v":0},{"$f":"VLOOKUP($AB31,'Sheet2 Edit'!$AD$23:$AR$32,9,FALSE)","v":0},{"$f":"VLOOKUP($AB31,'Sheet2 Edit'!$AD$23:$AR$32,10,FALSE)","v":0},{"$f":"VLOOKUP($AB31,'Sheet2 Edit'!$AD$23:$AR$32,11,FALSE)","v":0},{"$f":"VLOOKUP($AB31,'Sheet2 Edit'!$AD$23:$AR$32,12,FALSE)","v":0},{"$f":"VLOOKUP($AB31,'Sheet2 Edit'!$AD$23:$AR$32,13,FALSE)","v":0},{"$f":"VLOOKUP($AB31,'Sheet2 Edit'!$AD$23:$AR$32,14,FALSE)","v":0},{"$f":"VLOOKUP($AB31,'Sheet2 Edit'!$AD$23:$AR$32,15,FALSE)","v":3},{"$f":"VLOOKUP($AB31,'Sheet2 Edit'!$AD$23:$AU$32,16,FALSE)","v":0},{"$f":"VLOOKUP($AB31,'Sheet2 Edit'!$AD$23:$AU$32,17,FALSE)","v":0}]
[{"$nulls":4},10,{"$f":"VLOOKUP($E32,'Sheet2 Edit'!$E$23:$S$32,2,FALSE)","v":"Zamora"},{"$f":"VLOOKUP($E32,'Sheet2 Edit'!$E$23:$S$32,3,FALSE)","v":"Juan"},{"$f":"VLOOKUP($E32,'Sheet2 Edit'!$E$23:$S$32,4,FALSE)","v":"L"},{"$f":"VLOOKUP($E32,'Sheet2 Edit'!$E$23:$S$32,5,FALSE)-SUM(B32:D32)","v":-4},{"$f":"VLOOKUP($E32,'Sheet2 Edit'!$E$23:$S$32,6,FALSE)-SUM(B32:D32)","v":-3},{"$f":"VLOOKUP($E32,'Sheet2 Edit'!$E$23:$S$32,7,FALSE)","v":3},{"$f":"VLOOKUP($E32,'Sheet2 Edit'!$E$23:$S$32,8,FALSE)","v":0},{"$f":"VLOOKUP($E32,'Sheet2 Edit'!$E$23:$S$32,9,FALSE)","v":0},{"$f":"VLOOKUP($E32,'Sheet2 Edit'!$E$23:$S$32,10,FALSE)","v":0},{"$f":"VLOOKUP($E32,'Sheet2 Edit'!$E$23:$S$32,11,FALSE)","v":0},{"$f":"VLOOKUP($E32,'Sheet2 Edit'!$E$23:$S$32,12,FALSE)","v":0},{"$f":"VLOOKUP($E32,'Sheet2 Edit'!$E$23:$S$32,13,FALSE)","v":0},{"$f":"VLOOKUP($E$23,'Sheet2 Edit'!$E$23:$S$32,14,FALSE)","v":0},{"$f":"VLOOKUP($E32,'Sheet2 Edit'!$E$23:$S$32,15,FALSE)","v":4},{"$f":"VLOOKUP($E32,'Sheet2 Edit'!$E$23:$U$32,16,FALSE)","v":0},{"$f":"VLOOKUP($E32,'Sheet2 Edit'!$E$23:$U$32,17,FALSE)","v":0},{"$nulls":6},10,{"$f":"VLOOKUP($AB32,'Sheet2 Edit'!$AD$23:$AR$32,2,FALSE)","v":"Stanford"},{"$f":"VLOOKUP($AB32,'Sheet2 Edit'!$AD$23:$AR$32,3,FALSE)","v":"Edgar"},{"$f":"VLOOKUP($AB32,'Sheet2 Edit'!$AD$22:$AR$32,4,FALSE)","v":"R"},{"$f":"VLOOKUP($AB32,'Sheet2 Edit'!$AD$23:$AR$32,5,FALSE)-SUM($Y32:$AA32)","v":-1},{"$f":"VLOOKUP($AB32,'Sheet2 Edit'!$AD$23:$AR$32,6,FALSE)-SUM($Y32:$AA32)","v":-2},{"$f":"VLOOKUP($AB32,'Sheet2 Edit'!$AD$23:$AR$32,7,FALSE)","v":1},{"$f":"VLOOKUP($AB32,'Sheet2 Edit'!$AD$23:$AR$32,8,FALSE)","v":0},{"$f":"VLOOKUP($AB32,'Sheet2 Edit'!$AD$23:$AR$32,9,FALSE)","v":0},{"$f":"VLOOKUP($AB32,'Sheet2 Edit'!$AD$23:$AR$32,10,FALSE)","v":0},{"$f":"VLOOKUP($AB32,'Sheet2 Edit'!$AD$23:$AR$32,11,FALSE)","v":0},{"$f":"VLOOKUP($AB32,'Sheet2 Edit'!$AD$23:$AR$32,12,FALSE)","v":0},{"$f":"VLOOKUP($AB32,'Sheet2 Edit'!$AD$23:$AR$32,13,FALSE)","v":0},{"$f":"VLOOKUP($AB32,'Sheet2 Edit'!$AD$23:$AR$32,14,FALSE)","v":0},{"$f":"VLOOKUP($AB32,'Sheet2 Edit'!$AD$23:$AR$32,15,FALSE)","v":2},{"$f":"VLOOKUP($AB32,'Sheet2 Edit'!$AD$23:$AU$32,16,FALSE)","v":0},{"$f":"VLOOKUP($AB32,'Sheet2 Edit'!$AD$23:$AU$32,17,FALSE)","v":0}]
[{"$nulls":57},3,{"$f":"IF(BG30=\"SS\",BX7,IF(BG30=\"2B\",BX9,IF(BG30=\"3B\",BX7,IF(BG30=\"P\",BX9,IF(BG30=\"1B\",BX9,IF(BG30=\"C\",BX9,IF(BG30=\"LF\",BX10,IF(BG30=\"CF\",BX11,IF(BG30=\"RF\",BX12)))))))))","v":"2B"},"DP2"]
[]
[]
[]
[{"$nulls":34},"Speed 5",{"$nulls":4},"Speed 4",{"$nulls":4},"Speed 3",{"$nulls":4},"Speed 2",{"$nulls":4},"Speed 1"]
[{"$nulls":30},"S2/RH/SBR",{"$nulls":3},{"$f":"$BG$27","v":"1B"},{"$f":"_xlfn.IFS($AI$38=$BH$23,$BJ$24,$AI$38=$BN$14,$BP$15,$AI$38=$BK$9,$BM$10,$AI$38=$BD$9,$BF$10,$AI$38=$BA$14,$BC$15,$AI$38=$AY$4,$BA$5,$AI$38=$BG$2,$BI$3,$AI$38=$BN$4,$BP$5,AI38=BF15,BH16)","v":2},{"$f":"_xlfn.IFS(AL$38=2,\"90%\",AL$38=3,\"80%\",AL$38=4,\"70%\",AL$38=5,\"60%\",AL$38=6,\"50%\",AL$38=7,\"40%\",AL$38=8,\"30%\",AL$38=9,\"20%\",AL$38=10,\"10%\")","v":"80%"},{"$f":"INDEX(Sheet2!$D$3:$D$7,MATCH(Sheet1!$AJ$38,Sheet2!$C$3:$C$7,0))","v":3},null,{"$f":"$BG$27","v":"1B"},{"$f":"_xlfn.IFS($AN$38=$BH$23,$BJ$24,$AN$38=$BN$14,$BP$15,$AN$38=$BK$9,$BM$10,$AN$38=$BD$9,$BF$10,$AN$38=$BA$14,$BC$15,$AN$38=$AY$4,$BA$5,$AN$38=$BG$2,$BI$3,$AN$38=$BN$4,$BP$5,AN38=BF15,BH16)","v":2},{"$f":"_xlfn.IFS($AQ38=2,\"90%\",$AQ38=3,\"80%\",$AQ38=4,\"70%\",$AQ38=5,\"60%\",$AQ38=6,\"50%\",$AQ38=7,\"40%\",$AQ38=8,\"30%\",$AQ38=9,\"20%\",$AQ38=10,\"10%\")","v":"70%"},{"$f":"INDEX(Sheet2!$G$3:$G$7,MATCH($AO$38,Sheet2!$F$3:$F$7,0))","v":4},null,{"$f":"$BG$27","v":"1B"},{"$f":"_xlfn.IFS($AS$38=$BH$23,$BJ$24,$AS$38=$BN$14,$BP$15,$AS$38=$BK$9,$BM$10,$AS$38=$BD$9,$BF$10,$AS$38=$BA$14,$BC$15,$AS$38=$AY$4,$BA$5,$AS$38=$BG$2,$BI$3,$AS$38=$BN$4,$BP$5,AS38=BF15,BH16)","v":2},{"$f":"_xlfn.IFS($AV38=2,\"90%\",$AV38=3,\"80%\",$AV38=4,\"70%\",$AV38=5,\"60%\",$AV38=6,\"50%\",$AV38=7,\"40%\",$AV38=8,\"30%\",$AV38=9,\"20%\",$AV38=10,\"10%\")","v":"60%"},{"$f":"INDEX(Sheet2!$J$3:$J$7,MATCH($AT$38,Sheet2!$I$3:$I$7,0))","v":5},null,{"$f":"$BG$27","v":"1B"},{"$f":"_xlfn.IFS($AX$38=$BH$23,$BJ$24,$AX$38=$BN$14,$BP$15,$AX$38=$BK$9,$BM$10,$AX$38=$BD$9,$BF$10,$AX$38=$BA$14,$BC$15,$AX$38=$AY$4,$BA$5,$AX$38=$BG$2,$BI$3,$AX$38=$BN$4,$BP$5,AX38=BF15,BH16)","v":2},{"$f":"_xlfn.IFS($BA38=2,\"90%\",$BA38=3,\"80%\",$BA38=4,\"70%\",$BA38=5,\"60%\",$BA38=6,\"50%\",$BA38=7,\"40%\",$BA38=8,\"30%\",$BA38=9,\"20%\",$BA38=10,\"10%\")","v":"50%"},{"$f":"INDEX(Sheet2!$M$3:$M$7,MATCH($AY$38,Sheet2!$L$3:$L$7,0))","v":6},null,{"$f":"$BG$27","v":"1B"},{"$f":"_xlfn.IFS($BC$38=$BH$23,$BJ$24,$BC$38=$BN$14,$BP$15,$BC$38=$BK$9,$BM$10,$BC$38=$BD$9,$BF$10,$BC$38=$BA$14,$BC$15,$BC$38=$AY$4,$BA$5,$BC$38=$BG$2,$BI$3,$BC$38=$BN$4,$BP$5,BC38=BF15,BH16)","v":2},{"$f":"_xlfn.IFS($BF38=2,\"90%\",$BF38=3,\"80%\",$BF38=4,\"70%\",$BF38=5,\"60%\",$BF38=6,\"50%\",$BF38=7,\"40%\",$BF38=8,\"30%\",$BF38=9,\"20%\",$BF38=10,\"10%\")","v":"40%"},{"$f":"INDEX(Sheet2!$P$3:$P$7,MATCH($BD$38,Sheet2!$O$3:$O$7,0))","v":7}]
[{"$nulls":30},"S3/R3/SBH",{"$nulls":3},{"$f":"$BG$27","v":"1B"},{"$f":"_xlfn.IFS($AI$39=$BH$23,$BJ$24,$AI$39=$BN$14,$BP$15,$AI$39=$BK$9,$BM$10,$AI$39=$BD$9,$BF$10,$AI$39=$BA$14,$BC$15,$AI$39=$AY$4,$BA$5,$AI$39=$BG$2,$BI$3,$AI$39=$BN$4,$BP$5,AI38=BF15,BH16)","v":2},{"$f":"_xlfn.IFS($AL39=2,\"90%\",$AL39=3,\"80%\",$AL39=4,\"70%\",$AL39=5,\"60%\",$AL39=6,\"50%\",$AL39=7,\"40%\",$AL39=8,\"30%\",$AL39=9,\"20%\",$AL39=10,\"10%\")","v":"60%"},{"$f":"INDEX(Sheet2!$D$9:$D$13,MATCH(Sheet1!$AJ$39,Sheet2!$C$9:$C$13,0))","v":5},null,{"$f":"$BG$27","v":"1B"},{"$f":"_xlfn.IFS($AN$39=$BH$23,$BJ$24,$AN$39=$BN$14,$BP$15,$AN$39=$BK$9,$BM$10,$AN$39=$BD$9,$BF$10,$AN$39=$BA$14,$BC$15,$AN$39=$AY$4,$BA$5,$AN$39=$BG$2,$BI$3,$AN$39=$BN$4,$BP$5,AN39=BF15,BH16)","v":2},{"$f":"_xlfn.IFS($AQ39=2,\"90%\",$AQ39=3,\"80%\",$AQ39=4,\"70%\",$AQ39=5,\"60%\",$AQ39=6,\"50%\",$AQ39=7,\"40%\",$AQ39=8,\"30%\",$AQ39=9,\"20%\",$AQ39=10,\"10%\")","v":"50%"},{"$f":"INDEX(Sheet2!$G$9:$G$13,MATCH($AO$39,Sheet2!$F$9:$F$13,0))","v":6},null,{"$f":"$BG$27","v":"1B"},{"$f":"_xlfn.IFS($AS$39=$BH$23,$BJ$24,$AS$39=$BN$14,$BP$15,$AS$39=$BK$9,$BM$10,$AS$39=$BD$9,$BF$10,$AS$39=$BA$14,$BC$15,$AS$39=$AY$4,$BA$5,$AS$39=$BG$2,$BI$3,$AS$39=$BN$4,$BP$5,AS39=BF15,BH16)","v":2},{"$f":"_xlfn.IFS($AV39=2,\"90%\",$AV39=3,\"80%\",$AV39=4,\"70%\",$AV39=5,\"60%\",$AV39=6,\"50%\",$AV39=7,\"40%\",$AV39=8,\"30%\",$AV39=9,\"20%\",$AV39=10,\"10%\")","v":"40%"},{"$f":"INDEX(Sheet2!$J$9:$J$13,MATCH($AT$39,Sheet2!$I$9:$I$13,0))","v":7},null,{"$f":"$BG$27","v":"1B"},{"$f":"_xlfn.IFS($AX$39=$BH$23,$BJ$24,$AX$39=$BN$14,$BP$15,$AX$39=$BK$9,$BM$10,$AX$39=$BD$9,$BF$10,$AX$39=$BA$14,$BC$15,$AX$39=$AY$4,$BA$5,$AX$39=$BG$2,$BI$3,$AX$39=$BN$4,$BP$5,AX39=BF15,BH16)","v":2},{"$f":"_xlfn.IFS($BA39=2,\"90%\",$BA39=3,\"80%\",$BA39=4,\"70%\",$BA39=5,\"60%\",$BA39=6,\"50%\",$BA39=7,\"40%\",$BA39=8,\"30%\",$BA39=9,\"20%\",$BA39=10,\"10%\")","v":"30%"},{"$f":"INDEX(Sheet2!$M$9:$M$13,MATCH($AY$39,Sheet2!$L$9:$L$13,0))","v":8},null,{"$f":"$BG$27","v":"1B"},{"$f":"_xlfn.IFS($BC$39=$BH$23,$BJ$24,$BC$39=$BN$14,$BP$15,$BC$39=$BK$9,$BM$10,$BC$39=$BD$9,$BF$10,$BC$39=$BA$14,$BC$15,$BC$39=$AY$4,$BA$5,$BC$39=$BG$2,$BI$3,$BC$39=$BN$4,$BP$5,BC39=BF15,BH16)","v":2},{"$f":"_xlfn.IFS($BF39=2,\"90%\",$BF39=3,\"80%\",$BF39=4,\"70%\",$BF39=5,\"60%\",$BF39=6,\"50%\",$BF39=7,\"40%\",$BF39=8,\"30%\",$BF39=9,\"20%\",$BF39=10,\"10%\")","v":"20%"},{"$f":"INDEX(Sheet2!$P$9:$P$13,MATCH($BD$39,Sheet2!$O$9:$O$13,0))","v":9}]
[{"$nulls":30},"DP23/R2",{"$nulls":3},{"$f":"$BG$30","v":"3B"},{"$f":"_xlfn.IFS($AI$40=$BF$15,$BG$16,$AI$40=$BH$23,$BI$24,$AI$40=$BN$14,$BO$15,$AI$40=$BK$9,$BL$10,$AI$40=$BD$9,$BE$10,$AI$40=$BA$14,$BB$15,$AI$40=$AY$4,$AZ$5,$AI$40=$BG$2,$BH$3,$AI$40=$BN$4,$BO$5)","v":5},{"$f":"_xlfn.IFS($AL40=2,\"90%\",$AL40=3,\"80%\",$AL40=4,\"70%\",$AL40=5,\"60%\",$AL40=6,\"50%\",$AL40=7,\"40%\",$AL40=8,\"30%\",$AL40=9,\"20%\",$AL40=10,\"10%\")","v":"20%"},{"$f":"INDEX(Sheet2!$D$15:$D$19,MATCH(Sheet1!$AJ$40,Sheet2!$C$15:$C$19,0))","v":9},null,{"$f":"$BG$30","v":"3B"},{"$f":"_xlfn.IFS($AN$40=$BF$15,$BG$16,$AN$40=$BH$23,$BI$24,$AN$40=$BN$14,$BO$15,$AN$40=$BK$9,$BL$10,$AN$40=$BD$9,$BE$10,$AN$40=$BA$14,$BB$15,$AN$40=$AY$4,$AZ$5,$AN$40=$BG$2,$BH$3,$AN$40=$BN$4,$BO$5)","v":5},{"$f":"_xlfn.IFS($AQ40=2,\"90%\",$AQ40=3,\"80%\",$AQ40=4,\"70%\",$AQ40=5,\"60%\",$AQ40=6,\"50%\",$AQ40=7,\"40%\",$AQ40=8,\"30%\",$AQ40=9,\"20%\",$AQ40=10,\"10%\")","v":"10%"},{"$f":"INDEX(Sheet2!$G$15:$G$19,MATCH($AO$40,Sheet2!$F$15:$F$19,0))","v":10},null,{"$f":"$BG$30","v":"3B"},{"$f":"_xlfn.IFS($AS$40=$BF$15,$BG$16,$AS$40=$BH$23,$BI$24,$AS$40=$BN$14,$BO$15,$AS$40=$BK$9,$BL$10,$AS$40=$BD$9,$BE$10,$AS$40=$BA$14,$BB$15,$AS$40=$AY$4,$AZ$5,$AS$40=$BG$2,$BH$3,$AS$40=$BN$4,$BO$5)","v":5},{"$f":"_xlfn.IFS($AV40=2,\"90%\",$AV40=3,\"80%\",$AV40=4,\"70%\",$AV40=5,\"60%\",$AV40=6,\"50%\",$AV40=7,\"40%\",$AV40=8,\"30%\",$AV40=9,\"20%\",$AV40=10,\"10%\",AV40=\"OUT\",\"\")","v":""},{"$f":"INDEX(Sheet2!$J$15:$J$19,MATCH($AT$40,Sheet2!$I$15:$I$19,0))","v":"OUT"},null,{"$f":"$BG$30","v":"3B"},{"$f":"_xlfn.IFS($AX$40=$BF$15,$BG$16,$AX$40=$BH$23,$BI$24,$AX$40=$BN$14,$BO$15,$AX$40=$BK$9,$BL$10,$AX$40=$BD$9,$BE$10,$AX$40=$BA$14,$BB$15,$AX$40=$AY$4,$AZ$5,$AX$40=$BG$2,$BH$3,$AX$40=$BN$4,$BO$5)","v":5},{"$f":"_xlfn.IFS($BA40=2,\"90%\",$BA40=3,\"80%\",$BA40=4,\"70%\",$BA40=5,\"60%\",$BA40=6,\"50%\",$BA40=7,\"40%\",$BA40=8,\"30%\",$BA40=9,\"20%\",$BA40=10,\"10%\")","v":{"$error":"#N/A"}},{"$f":"INDEX(Sheet2!$M$15:$M$19,MATCH($AY$40,Sheet2!$L$15:$L$19,0))","v":"OUT"},null,{"$f":"$BG$30","v":"3B"},{"$f":"_xlfn.IFS($BC$40=$BF$15,$BG$16,$BC$40=$BH$23,$BI$24,$BC$40=$BN$14,$BO$15,$BC$40=$BK$9,$BL$10,$BC$40=$BD$9,$BE$10,$BC$40=$BA$14,$BB$15,$BC$40=$AY$4,$AZ$5,$BC$40=$BG$2,$BH$3,$BC$40=$BN$4,$BO$5)","v":5},{"$error":"#N/A"},{"$f":"INDEX(Sheet2!$P$15:$P$19,MATCH($BD$40,Sheet2!$O$15:$O$19,0))","v":"OUT"}]
[{"$nulls":30},"DP1/R1",{"$nulls":3},{"$f":"$BG$33","v":"2B"},{"$f":"_xlfn.IFS($AI$41=$BH$23,$BI$24,$AI$41=$BN$14,$BO$15,$AI$41=$BK$9,$BL$10,$AI$41=$BD$9,$BE$10,$AI$41=$BA$14,$BB$15,$AI$41=$AY$4,$AZ$5,$AI$41=$BG$2,$BH$3,$AI$41=$BN$4,$BO$5)","v":5},"40%",{"$f":"INDEX(Sheet2!$D$21:$D$25,MATCH(Sheet1!$AJ$41,Sheet2!$C$21:$C$25,0))","v":7},null,{"$f":"$BG$33","v":"2B"},{"$f":"_xlfn.IFS($AN$41=$BH$23,$BI$24,$AN$41=$BN$14,$BO$15,$AN$41=$BK$9,$BL$10,$AN$41=$BD$9,$BE$10,$AN$41=$BA$14,$BB$15,$AN$41=$AY$4,$AZ$5,$AN$41=$BG$2,$BH$3,$AN$41=$BN$4,$BO$5)","v":5},{"$f":"_xlfn.IFS($AQ41=2,\"90%\",$AQ41=3,\"80%\",$AQ41=4,\"70%\",$AQ41=5,\"60%\",$AQ41=6,\"50%\",$AQ41=7,\"40%\",$AQ41=8,\"30%\",$AQ41=9,\"20%\",$AQ41=10,\"10%\")","v":"30%"},{"$f":"INDEX(Sheet2!$G$21:$G$25,MATCH($AO$41,Sheet2!$F$21:$F$25,0))","v":8},null,{"$f":"$BG$33","v":"2B"},{"$f":"_xlfn.IFS($AS$41=$BH$23,$BI$24,$AS$41=$BN$14,$BO$15,$AS$41=$BK$9,$BL$10,$AS$41=$BD$9,$BE$10,$AS$41=$BA$14,$BB$15,$AS$41=$AY$4,$AZ$5,$AS$41=$BG$2,$BH$3,$AS$41=$BN$4,$BO$5)","v":5},{"$f":"_xlfn.IFS($AV41=2,\"90%\",$AV41=3,\"80%\",$AV41=4,\"70%\",$AV41=5,\"60%\",$AV41=6,\"50%\",$AV41=7,\"40%\",$AV41=8,\"30%\",$AV41=9,\"20%\",$AV41=10,\"10%\")","v":"20%"},{"$f":"INDEX(Sheet2!$J$21:$J$25,MATCH($AT$41,Sheet2!$I$21:$I$25,0))","v":9},null,{"$f":"$BG$33","v":"2B"},{"$f":"_xlfn.IFS($AX$41=$BH$23,$BI$24,$AX$41=$BN$14,$BO$15,$AX$41=$BK$9,$BL$10,$AX$41=$BD$9,$BE$10,$AX$41=$BA$14,$BB$15,$AX$41=$AY$4,$AZ$5,$AX$41=$BG$2,$BH$3,$AX$41=$BN$4,$BO$5)","v":5},{"$f":"_xlfn.IFS($BA41=2,\"90%\",$BA41=3,\"80%\",$BA41=4,\"70%\",$BA41=5,\"60%\",$BA41=6,\"50%\",$BA41=7,\"40%\",$BA41=8,\"30%\",$BA41=9,\"20%\",$BA41=10,\"10%\")","v":"10%"},{"$f":"INDEX(Sheet2!$M$21:$M$25,MATCH($AY$41,Sheet2!$L$21:$L$25,0))","v":10},null,{"$f":"$BG$33","v":"2B"},{"$f":"_xlfn.IFS($BC$41=$BH$23,$BI$24,$BC$41=$BN$14,$BO$15,$BC$41=$BK$9,$BL$10,$BC$41=$BD$9,$BE$10,$BC$41=$BA$14,$BB$15,$BC$41=$AY$4,$AZ$5,$BC$41=$BG$2,$BH$3,$BC$41=$BN$4,$BO$5)","v":5},{"$error":"#N/A"},{"$f":"INDEX(Sheet2!$P$21:$P$25,MATCH($BD$41,Sheet2!$O$21:$O$25,0))","v":"OUT"}]
[]
[{"$nulls":34},0,{"$nulls":25},{"$f":"CQ1","v":10}]
[{"$nulls":34},1,{"$f":"$F$5","v":"Sharkey"},{"$f":"$F$5","v":"Sharkey"},{"$f":"$F$5","v":"Sharkey"},{"$f":"_xlfn.IFS($H$5=\"R\",$B$5,$H$5=\"B\",$C$5,$H$5=\"L\",$D$5)","v":-2},{"$f":"IF($AM44<0,VLOOKUP($AM44,$AT$6:$AU$9,2,FALSE),VLOOKUP($AM44,$AT$10:$AU$14,2,FALSE))","v":8},{"$nulls":3},1,{"$f":"$AC$5","v":"Monteso"},null,null,{"$f":"_xlfn.IFS($AE$5=\"R\",$Y$5,$AE$5=\"B\",$Z$5,$AE$5=\"L\",$AA$5)","v":0},{"$f":"IF($AV44<0,VLOOKUP($AV44,$AT$5:$AU$9,2,FALSE),VLOOKUP($AV44,$AT$10:$AU$14,2,FALSE))","v":6},{"$nulls":5},{"$f":"VLOOKUP($BC$45,$F$5:$T$19,14,FALSE)","v":1},{"$nulls":7},{"$f":"VLOOKUP($BK$45,$AC$5:$AQ$19,14,FALSE)","v":3},{"$nulls":6},{"$f":"VLOOKUP(BK45,AR44:AW52,6,FALSE)","v":{"$error":"#N/A"}},{"$f":"IF(BR44<=$BI$43,\"Batter\",\"Pitcher\")","v":{"$error":"#N/A"}}]
[{"$nulls":34},2,{"$f":"$F$6","v":"Lucas"},{"$f":"$F$6","v":"Lucas"},{"$f":"$F$6","v":"Lucas"},{"$f":"_xlfn.IFS($H$6=\"R\",$B$6,$H$6=\"B\",$C$6,$H$6=\"L\",$D$6)","v":-1},{"$f":"IF($AM45<0,VLOOKUP($AM45,$AT$6:$AU$9,2,FALSE),VLOOKUP($AM45,$AT$10:$AU$14,2,FALSE))","v":7},{"$nulls":3},2,{"$f":"$AC$6","v":"Johnstone"},{"$f":"$AC$6","v":"Johnstone"},null,{"$f":"_xlfn.IFS($AE6=\"R\",$Y6,$AE6=\"B\",$Z6,$AE6=\"L\",$AA6)","v":-3},{"$f":"IF($AV45<0,VLOOKUP($AV45,$AT$5:$AU$9,2,FALSE),VLOOKUP($AV45,$AT$10:$AU$14,2,FALSE))","v":9},{"$nulls":4},1,{"$f":"VLOOKUP($BB$45,$AI$44:$AN$53,4,FALSE)","v":"Sharkey"},{"$nulls":4},{"$f":"VLOOKUP(BB45,AI44:AN52,6,FALSE)","v":8},null,1,{"$f":"VLOOKUP(BJ45,AR44:AW52,2,FALSE)","v":"Monteso"},{"$nulls":4},{"$f":"VLOOKUP(BJ45,AR44:AW53,6,FALSE)","v":6}]
[{"$nulls":34},3,{"$f":"$F$7","v":"Kemp"},{"$f":"$F$7","v":"Kemp"},{"$f":"$F$7","v":"Kemp"},{"$f":"_xlfn.IFS($H$7=\"R\",$B$7,$H$7=\"B\",$C$7,$H$7=\"L\",$D$7)","v":0},6,{"$nulls":3},3,{"$f":"$AC$7","v":"O'Sheehan"},{"$f":"$AC$7","v":"O'Sheehan"},null,{"$f":"_xlfn.IFS($AE7=\"R\",$Y7,$AE7=\"B\",$Z7,$AE7=\"L\",$AA7)","v":1},5]
[{"$nulls":34},4,{"$f":"$F$8","v":"Holley"},{"$f":"$F$8","v":"Holley"},{"$f":"$F$8","v":"Holley"},{"$f":"_xlfn.IFS($H$8=\"R\",$B$8,$H$8=\"B\",$C$8,$H$8=\"L\",$D$8)","v":0},6,{"$nulls":3},4,{"$f":"$AC$8","v":"Rhodes"},{"$f":"$AC$8","v":"Rhodes"},null,{"$f":"_xlfn.IFS($AE$8=\"R\",$Y$8,$AE$8=\"B\",$Z$8,$AE$8=\"L\",$AA$8)","v":0},6,{"$nulls":5},{"$f":"IF(BH45<=BI43,\"Batter\",\"Pitcher\")","v":"Batter"},{"$nulls":7},{"$f":"IF(BP45<=BI43,\"Batter\",\"Pitcher\")","v":"Batter"}]
[{"$nulls":34},5,{"$f":"$F$9","v":"Moran"},{"$f":"$F$9","v":"Moran"},{"$f":"$F$9","v":"Moran"},{"$f":"_xlfn.IFS($H$9=\"R\",$B$9,$H$9=\"B\",$C$9,$H$9=\"L\",$D$9)","v":-3},{"$f":"IF($AM48<0,VLOOKUP($AM48,$AT$6:$AU$9,2,FALSE),VLOOKUP($AM48,$AT$10:$AU$14,2,FALSE))","v":9},{"$nulls":3},5,{"$f":"$AC$9","v":"Shelton"},{"$f":"$AC$9","v":"Shelton"},null,{"$f":"_xlfn.IFS($AE$9=\"R\",$Y$9,$AE$9=\"B\",$Z$9,$AE$9=\"L\",$AA$9)","v":-1},7]
[{"$nulls":34},6,{"$f":"$F$10","v":"Clark"},{"$f":"$F$10","v":"Clark"},{"$f":"$F$10","v":"Clark"},{"$f":"_xlfn.IFS($H$10=\"R\",$B$10,$H$10=\"B\",$C$10,$H$10=\"L\",$D$10)","v":-2},8,{"$nulls":3},6,{"$f":"$AC$10","v":"Callaway"},{"$f":"$AC$10","v":"Callaway"},null,{"$f":"_xlfn.IFS($AE$10=\"R\",$Y$10,$AE$10=\"B\",$Z$10,$AE$10=\"L\",$AA$10)","v":1},5]
[{"$nulls":34},7,{"$f":"$F$11","v":"Gomez"},{"$f":"$F$11","v":"Gomez"},{"$f":"$F$11","v":"Gomez"},{"$f":"_xlfn.IFS($H$11=\"R\",$B$11,$H$11=\"B\",$C$11,$H$11=\"L\",$D$11)","v":-1},7,{"$nulls":3},7,{"$f":"$AC$11","v":"Rosas"},{"$f":"$AC$11","v":"Rosas"},null,{"$f":"_xlfn.IFS($AE$11=\"R\",$Y$11,$AE$11=\"B\",$Z$11,$AE$11=\"L\",$AA$11)","v":-1},7]
[{"$nulls":34},8,{"$f":"$F$12","v":"Metcalf"},{"$f":"$F$12","v":"Metcalf"},{"$f":"$F$12","v":"Metcalf"},{"$f":"_xlfn.IFS($H$12=\"R\",$B$12,$H$12=\"B\",$C$12,$H$12=\"L\",$D$12)","v":-3},9,{"$nulls":3},8,{"$f":"$AC$12","v":"Villarreal"},{"$f":"$AC$12","v":"Villarreal"},null,{"$f":"_xlfn.IFS($AE$12=\"R\",$Y$12,$AE$12=\"B\",$Z$12,$AE$12=\"L\",$AA$12)","v":-1},7]
[{"$nulls":34},9,{"$f":"$F$13","v":"Lowery"},{"$f":"$F$13","v":"Lowery"},{"$f":"$F$13","v":"Lowery"},{"$f":"_xlfn.IFS($H$13=\"R\",$B$13,$H$13=\"B\",$C$13,$H$13=\"L\",$D$13)","v":-3},9,{"$nulls":3},9,{"$f":"$AC$13","v":"Hernandez"},{"$f":"$AC$13","v":"Hernandez"},null,{"$f":"_xlfn.IFS($AE$13=\"R\",$Y$13,$AE$13=\"B\",$Z$13,$AE$13=\"L\",$AA$13)","v":0},6,{"$nulls":5},{"$f":"F2","v":"Gators"},{"$nulls":7},{"$f":"AC2","v":"Hornets"}]
[{"$nulls":34},10]
[{"$nulls":38},{"$f":"SUM(AM44:AM52)","v":-15},{"$nulls":8},{"$f":"SUM(AV44:AV52)","v":-4}]
[{"$nulls":36},{"$f":"IF($F$2=\"Bulls\",\"Baltimore\",IF($F$2=\"Phantoms\",\"Pittsburgh\",IF($F$2=\"Gators\",\"Allentown\",IF($F$2=\"Knights\",\"Carson City\",IF($F$2=\"Drillers\",\"Danville\",IF($F$2=\"Hornets\",\"Harrisburg\"))))))","v":"Allentown"},{"$nulls":4},"at",{"$nulls":3},{"$f":"IF($AC$2=\"Bulls\",\"Baltimore\",IF($AC$2=\"Phantoms\",\"Pittsburgh\",IF($AC$2=\"Gators\",\"Allentown\",IF($AC$2=\"Knights\",\"Carson City\",IF($AC$2=\"Drillers\",\"Danville\",IF($AC$2=\"Hornets\",\"Harrisburg\"))))))","v":"Harrisburg"}]
{"$rows_empty":7}
[{"$nulls":80},0,0]
{"$rows_empty":237}
[{"$nulls":59},9]
{"$rows_empty":209}
[{"$nulls":19},1]
{"$rows_empty":1003}
[{"$nulls":42},2]
{"$rows_empty":302}
[{"$nulls":42},1]

{"sheet":"Sheet2 Edit","index":2,"n_rows":34,"n_cols":73,"rows_kept":34,"merged":[[0,5,0,10],[0,30,0,35]]}
[{"$nulls":5},{"$f":"VLOOKUP(AZ3,BA3:BB10,2,FALSE)","v":"Gators"},{"$nulls":24},{"$f":"VLOOKUP(AY3,BA3:BB10,2,FALSE)","v":"Hornets"},{"$nulls":41},1]
[{"$nulls":72},2]
[{"$nulls":5},"First","Last","B","POS","vsL","vsR","Bu","S","J","PP","A","2P",null,"D",null,null,"P",{"$nulls":8},"Last","First","B","POS","vsL","vsR","Bu","S","J","PP","A","2P",null,"D",null,null,"P",{"$nulls":3},6,3,1,"Bulls",{"$nulls":18},3]
[{"$nulls":52},2,"Phantoms",{"$nulls":18},4]
[{"$nulls":4},1,{"$f":"IF($F$1=\"Drillers\",OFFSET(Drillers!L2,ROW(F1),1),IF($F$1=\"Bulls\",OFFSET(Bulls!L2,ROW(F1),1),IF($F$1=\"Phantoms\",OFFSET(Phantoms!L2,ROW(F1),1),IF($F$1=\"Gators\",OFFSET(Gators!L2,ROW(F1),1),IF($F$1=\"Knights\",OFFSET(Knights!L2,ROW(F1),1),IF($F$1=\"Hornets\",OFFSET(Hornets!L2,ROW(F1),1),IF($F$1=\"Reds\",OFFSET(Comets!L2,ROW(F1),1),IF($F$1=\"Guardians\",OFFSET(Wolves!L2,ROW(F1),1)))))))))","v":"Sharkey"},{"$f":"IF($F$1=\"Drillers\",OFFSET(Drillers!$L$2,ROW($F1),2),IF($F$1=\"Bulls\",OFFSET(Bulls!$L$2,ROW($F1),2),IF($F$1=\"Phantoms\",OFFSET(Phantoms!$L$2,ROW($F1),2),IF($F$1=\"Gators\",OFFSET(Gators!$L$2,ROW($F1),2),IF($F$1=\"Knights\",OFFSET(Knights!$L$2,ROW($F1),2),IF($F$1=\"Hornets\",OFFSET(Hornets!$L$2,ROW($F1),2),IF($F$1=\"Reds\",OFFSET(Comets!$L$2,ROW($F1),2),IF($F$1=\"Guardians\",OFFSET(Wolves!$L$2,ROW($F1),2)))))))))","v":"Bill"},{"$f":"IF($F$1=\"Drillers\",OFFSET(Drillers!$L$2,ROW($F1),3),IF($F$1=\"Bulls\",OFFSET(Bulls!$L$2,ROW($F1),3),IF($F$1=\"Phantoms\",OFFSET(Phantoms!$L$2,ROW($F1),3),IF($F$1=\"Gators\",OFFSET(Gators!$L$2,ROW($F1),3),IF($F$1=\"Knights\",OFFSET(Knights!$L$2,ROW($F1),3),IF($F$1=\"Hornets\",OFFSET(Hornets!$L$2,ROW($F1),3),IF($F$1=\"Guardians\",OFFSET(Wolves!$L$2,ROW($F1),3),IF($F$1=\"Reds\",OFFSET(Comets!$L$2,ROW($F1),3)))))))))","v":"R"},{"$f":"IF($F$1=\"Drillers\",OFFSET(Drillers!$L$2,ROW($F1),4),IF($F$1=\"Bulls\",OFFSET(Bulls!$L$2,ROW($F1),4),IF($F$1=\"Phantoms\",OFFSET(Phantoms!$L$2,ROW($F1),4),IF($F$1=\"Gators\",OFFSET(Gators!$L$2,ROW($F1),4),IF($F$1=\"Knights\",OFFSET(Knights!$L$2,ROW($F1),4),IF($F$1=\"Hornets\",OFFSET(Hornets!$L$2,ROW($F1),4),IF($F$1=\"Guardians\",OFFSET(Wolves!$L$2,ROW($F1),4),IF($F$1=\"Reds\",OFFSET(Comets!$L$2,ROW($F1),4)))))))))","v":"RF"},{"$f":"IF($F$1=\"Drillers\",OFFSET(Drillers!$L$2,ROW($F1),5),IF($F$1=\"Bulls\",OFFSET(Bulls!$L$2,ROW($F1),5),IF($F$1=\"Phantoms\",OFFSET(Phantoms!$L$2,ROW($F1),5),IF($F$1=\"Gators\",OFFSET(Gators!$L$2,ROW($F1),5),IF($F$1=\"Knights\",OFFSET(Knights!$L$2,ROW($F1),5),IF($F$1=\"Hornets\",OFFSET(Hornets!$L$2,ROW($F1),5),IF($F$1=\"Guardians\",OFFSET(Wolves!$L$2,ROW($F1),5),IF($F$1=\"Reds\",OFFSET(Comets!$L$2,ROW($F1),5)))))))))","v":4},{"$f":"IF($F$1=\"Drillers\",OFFSET(Drillers!$L$2,ROW($F1),6),IF($F$1=\"Bulls\",OFFSET(Bulls!$L$2,ROW($F1),6),IF($F$1=\"Phantoms\",OFFSET(Phantoms!$L$2,ROW($F1),6),IF($F$1=\"Gators\",OFFSET(Gators!$L$2,ROW($F1),6),IF($F$1=\"Knights\",OFFSET(Knights!$L$2,ROW($F1),6),IF($F$1=\"Hornets\",OFFSET(Hornets!$L$2,ROW($F1),6),IF($F$1=\"Guardians\",OFFSET(Wolves!$L$2,ROW($F1),6),IF($F$1=\"Reds\",OFFSET(Comets!$L$2,ROW($F1),6)))))))))","v":3},{"$f":"IF($F$1=\"Drillers\",OFFSET(Drillers!$L$2,ROW(F1),7),IF($F$1=\"Bulls\",OFFSET(Bulls!$L$2,ROW(F1),7),IF($F$1=\"Phantoms\",OFFSET(Phantoms!$L$2,ROW(F1),7),IF($F$1=\"Gators\",OFFSET(Gators!$L$2,ROW(F1),7),IF($F$1=\"Knights\",OFFSET(Knights!$L$2,ROW(F1),7),IF($F$1=\"Hornets\",OFFSET(Hornets!$L$2,ROW(F1),7),IF($F$1=\"Guardians\",OFFSET(Wolves!$L$2,ROW(F1),7),IF($F$1=\"Reds\",OFFSET(Comets!$L$2,ROW(F1),7),))))))))","v":4},{"$f":"IF($F$1=\"Drillers\",OFFSET(Drillers!$L$2,ROW(F1),8),IF($F$1=\"Bulls\",OFFSET(Bulls!$L$2,ROW(F1),8),IF($F$1=\"Phantoms\",OFFSET(Phantoms!$L$2,ROW(F1),8),IF($F$1=\"Gators\",OFFSET(Gators!$L$2,ROW(F1),8),IF($F$1=\"Knights\",OFFSET(Knights!$L$2,ROW(F1),8),IF($F$1=\"Hornets\",OFFSET(Hornets!$L$2,ROW(F1),8),IF($F$1=\"Guardians\",OFFSET(Wolves!$L$2,ROW(F1),8),IF($F$1=\"Reds\",OFFSET(Comets!$L$2,ROW(F1),8)))))))))","v":4},{"$f":"IF($F$1=\"Drillers\",OFFSET(Drillers!$L$2,ROW($F1),9),IF($F$1=\"Bulls\",OFFSET(Bulls!$L$2,ROW($F1),9),IF($F$1=\"Phantoms\",OFFSET(Phantoms!$L$2,ROW($F1),9),IF($F$1=\"Gators\",OFFSET(Gators!$L$2,ROW($F1),9),IF($F$1=\"Knights\",OFFSET(Knights!$L$2,ROW($F1),9),IF($F$1=\"Hornets\",OFFSET(Hornets!$L$2,ROW(F1),9),IF($F$1=\"Guardians\",OFFSET(Wolves!$L$2,ROW($F1),9),IF($F$1=\"Reds\",OFFSET(Comets!$L$2,ROW($F1),9)))))))))","v":4},{"$f":"IF($F$1=\"Drillers\",OFFSET(Drillers!$L$2,ROW(F1),10),IF($F$1=\"Bulls\",OFFSET(Bulls!$L$2,ROW(F1),10),IF($F$1=\"Phantoms\",OFFSET(Phantoms!$L$2,ROW(F1),10),IF($F$1=\"Gators\",OFFSET(Gators!$L$2,ROW(F1),10),IF($F$1=\"Knights\",OFFSET(Knights!$L$2,ROW(F1),10),IF($F$1=\"Hornets\",OFFSET(Hornets!$L$2,ROW(F1),10),IF($F$1=\"Guardians\",OFFSET(Wolves!$L$2,ROW(F1),10),IF($F$1=\"Reds\",OFFSET(Comets!$L$2,ROW(F1),10)))))))))","v":3},{"$f":"IF($F$1=\"Drillers\",OFFSET(Drillers!$L$2,ROW(F1),11),IF($F$1=\"Bulls\",OFFSET(Bulls!$L$2,ROW(F1),11),IF($F$1=\"Phantoms\",OFFSET(Phantoms!$L$2,ROW(F1),11),IF($F$1=\"Gators\",OFFSET(Gators!$L$2,ROW(F1),11),IF($F$1=\"Knights\",OFFSET(Knights!$L$2,ROW(F1),11),IF($F$1=\"Hornets\",OFFSET(Hornets!$L$2,ROW(F1),11),IF($F$1=\"Guardians\",OFFSET(Wolves!$L$2,ROW(F1),11),IF($F$1=\"Drillers\",OFFSET(Drillers!$L$2,ROW(F1),11),IF($F$1=\"Reds\",OFFSET(Comets!$L$2,ROW(F1),11))))))))))","v":5},{"$f":"IF($F$1=\"Drillers\",OFFSET(Drillers!$L$2,ROW(F1),12),IF($F$1=\"Bulls\",OFFSET(Bulls!$L$2,ROW(F1),12),IF($F$1=\"Phantoms\",OFFSET(Phantoms!$L$2,ROW(F1),12),IF($F$1=\"Gators\",OFFSET(Gators!$L$2,ROW(F1),12),IF($F$1=\"Knights\",OFFSET(Knights!$L$2,ROW(F1),12),IF($F$1=\"Hornets\",OFFSET(Hornets!$L$2,ROW(F1),12),IF($F$1=\"Guardians\",OFFSET(Wolves!$L$2,ROW(F1),12),IF($F$1=\"Reds\",OFFSET(Comets!$L$2,ROW(F1),12),))))))))","v":"LF"},{"$f":"IF($F$1=\"Drillers\",OFFSET(Drillers!$L$2,ROW(F1),13),IF($F$1=\"Bulls\",OFFSET(Bulls!$L$2,ROW(F1),13),IF($F$1=\"Phantoms\",OFFSET(Phantoms!$L$2,ROW(F1),13),IF($F$1=\"Gators\",OFFSET(Gators!$L$2,ROW(F1),13),IF($F$1=\"Knights\",OFFSET(Knights!$L$2,ROW(F1),13),IF($F$1=\"Hornets\",OFFSET(Hornets!$L$2,ROW(F1),13),IF($F$1=\"Guardians\",OFFSET(Wolves!$L$2,ROW(F1),13),IF($F$1=\"Reds\",OFFSET(Comets!$L$2,ROW(F1),13),))))))))","v":0},{"$f":"IF($F$1=\"Drillers\",OFFSET(Drillers!$L$2,ROW(F1),14),IF($F$1=\"Bulls\",OFFSET(Bulls!$L$2,ROW(F1),14),IF($F$1=\"Phantoms\",OFFSET(Phantoms!$L$2,ROW(F1),14),IF($F$1=\"Gators\",OFFSET(Gators!$L$2,ROW(F1),14),IF($F$1=\"Knights\",OFFSET(Knights!$L$2,ROW(F1),14),IF($F$1=\"Hornets\",OFFSET(Hornets!$L$2,ROW(F1),14),IF($F$1=\"Guardians\",OFFSET(Wolves!$L$2,ROW(F1),14,),IF($F$1=\"Reds\",OFFSET(Comets!$L$2,ROW(F1),14)))))))))","v":2},{"$f":"IF(F$1=\"Drillers\",OFFSET(Drillers!$L$2,ROW(F1),15),IF(F$1=\"Bulls\",OFFSET(Bulls!$L$2,ROW(F1),15),IF(F$1=\"Phantoms\",OFFSET(Phantoms!$L$2,ROW(F1),15),IF(F$1=\"Gators\",OFFSET(Gators!$L$2,ROW(F1),15),IF(F$1=\"Knights\",OFFSET(Knights!$L$2,ROW(F1),15),IF(F$1=\"Hornets\",OFFSET(Hornets!$L$2,ROW(F1),15),IF(F$1=\"Guardians\",OFFSET(Wolves!$L$2,ROW(F1),15),IF(F$1=\"Reds\",OFFSET(Comets!$L$2,ROW(F1),15)))))))))","v":0},{"$f":"IF(F$1=\"Drillers\",OFFSET(Drillers!$L$2,ROW(F1),16),IF(F$1=\"Bulls\",OFFSET(Bulls!$L$2,ROW(F1),16),IF(F$1=\"Phantoms\",OFFSET(Phantoms!$L$2,ROW(F1),16),IF(F$1=\"Gators\",OFFSET(Gators!$L$2,ROW(F1),16),IF(F$1=\"Knights\",OFFSET(Knights!$L$2,ROW(F1),16),IF(F$1=\"Hornets\",OFFSET(Hornets!$L$2,ROW(F1),16),IF(F$1=\"Guardians\",OFFSET(Wolves!$L$2,ROW(F1),16),IF(F$1=\"Reds\",OFFSET(Comets!$L$2,ROW(F1),16)))))))))","v":0},{"$f":"IF($F$1=\"Drillers\",OFFSET(Drillers!$L$2,ROW($F1),17),IF($F$1=\"Bulls\",OFFSET(Bulls!$L$2,ROW($F1),17),IF($F$1=\"Phantoms\",OFFSET(Phantoms!$L$2,ROW($F1),17),IF($F$1=\"Gators\",OFFSET(Gators!$L$2,ROW($F1),17),IF($F$1=\"Knights\",OFFSET(Knights!$L$2,ROW($F1),17),IF($F$1=\"Hornets\",OFFSET(Hornets!$L$2,ROW($F1),17),IF($F$1=\"Guardians\",OFFSET(Wolves!$L$2,ROW($F1),17),IF($F$1=\"Reds\",OFFSET(Comets!$L$2,ROW($F1),17)))))))))","v":1},{"$nulls":7},1,{"$f":"IF($AE$1=\"Drillers\",OFFSET(Drillers!$L$2,ROW(AE$1),1),IF($AE$1=\"Bulls\",OFFSET(Bulls!$L$2,ROW(AE$1),1),IF($AE$1=\"Phantoms\",OFFSET(Phantoms!$L$2,ROW(AE$1),1),IF($AE$1=\"Gators\",OFFSET(Gators!$L$2,ROW(AE$1),1),IF($AE$1=\"Knights\",OFFSET(Knights!$L$2,ROW(AE$1),1),IF($AE$1=\"Hornets\",OFFSET(Hornets!$L$2,ROW(AE$1),1),IF($AE$1=\"Wolves\",OFFSET(Wolves!$L$2,ROW(AE$1),1),IF($AE$1=\"Comets\",OFFSET(Comets!$L$2,ROW(AE$1),1)))))))))","v":"Monteso"},{"$f":"IF($AE$1=\"Drillers\",OFFSET(Drillers!$L$2,ROW($AF1),2),IF($AE$1=\"Bulls\",OFFSET(Bulls!$L$2,ROW($AF1),2),IF($AE$1=\"Phantoms\",OFFSET(Phantoms!$L$2,ROW($AF1),2),IF($AE$1=\"Gators\",OFFSET(Gators!$L$2,ROW($AF1),2),IF($AE$1=\"Knights\",OFFSET(Knights!$L$2,ROW($AF1),2),IF($AE$1=\"Hornets\",OFFSET(Hornets!$L$2,ROW($AF1),2),IF($AE$1=\"Wolves\",OFFSET(Wolves!$L$2,ROW($AF1),2),IF($AE$1=\"Comets\",OFFSET(Comets!$L$2,ROW($AF1),2)))))))))","v":"Luis"},{"$f":"IF($AE$1=\"Drillers\",OFFSET(Drillers!$L$2,ROW($AE1),3),IF($AE$1=\"Bulls\",OFFSET(Bulls!$L$2,ROW($AE1),3),IF($AE$1=\"Phantoms\",OFFSET(Phantoms!$L$2,ROW($AE1),3),IF($AE$1=\"Gators\",OFFSET(Gators!$L$2,ROW($AE1),3),IF($AE$1=\"Knights\",OFFSET(Knights!$L$2,ROW($AE1),3),IF($AE$1=\"Hornets\",OFFSET(Hornets!$L$2,ROW($AE1),3),IF($AE$1=\"Wolves\",OFFSET(Wolves!$L$2,ROW($AE1),3),IF($AE$1=\"Comets\",OFFSET(Comets!$L$2,ROW($AE1),3)))))))))","v":"R"},{"$f":"IF($AE$1=\"Drillers\",OFFSET(Drillers!$L$2,ROW($AE1),4),IF($AE$1=\"Bulls\",OFFSET(Bulls!$L$2,ROW($AE1),4),IF($AE$1=\"Phantoms\",OFFSET(Phantoms!$L$2,ROW($AE1),4),IF($AE$1=\"Gators\",OFFSET(Gators!$L$2,ROW($AE1),4),IF($AE$1=\"Knights\",OFFSET(Knights!$L$2,ROW($AE1),4),IF($AE$1=\"Hornets\",OFFSET(Hornets!$L$2,ROW($AE1),4),IF($AE$1=\"Wolves\",OFFSET(Wolves!$L$2,ROW($AE1),4),IF($AE$1=\"Comets\",OFFSET(Comets!$L$2,ROW($AE1),4)))))))))","v":"SS"},{"$f":"IF($AE$1=\"Drillers\",OFFSET(Drillers!$L$2,ROW($AE1),5),IF($AE$1=\"Bulls\",OFFSET(Bulls!$L$2,ROW($AE1),5),IF($AE$1=\"Phantoms\",OFFSET(Phantoms!$L$2,ROW($AE1),5),IF($AE$1=\"Gators\",OFFSET(Gators!$L$2,ROW($AE1),5),IF($AE$1=\"Knights\",OFFSET(Knights!$L$2,ROW($AE1),5),IF($AE$1=\"Hornets\",OFFSET(Hornets!$L$2,ROW($AE1),5),IF($AE$1=\"Wolves\",OFFSET(Wolves!$L$2,ROW($AE1),5),IF($AE$1=\"Comets\",OFFSET(Comets!$L$2,ROW($AE1),5)))))))))","v":3},{"$f":"IF($AE$1=\"Drillers\",OFFSET(Drillers!$L$2,ROW($AE1),6),IF($AE$1=\"Bulls\",OFFSET(Bulls!$L$2,ROW($AE1),6),IF($AE$1=\"Phantoms\",OFFSET(Phantoms!$L$2,ROW($AE1),6),IF($AE$1=\"Gators\",OFFSET(Gators!$L$2,ROW($AE1),6),IF($AE$1=\"Knights\",OFFSET(Knights!$L$2,ROW($AE1),6),IF($AE$1=\"Hornets\",OFFSET(Hornets!$L$2,ROW($AE1),6),IF($AE$1=\"Wolves\",OFFSET(Wolves!$L$2,ROW($AE1),6),IF($AE$1=\"Comets\",OFFSET(Comets!$L$2,ROW($AE1),6)))))))))","v":4},{"$f":"IF($AE$1=\"Drillers\",OFFSET(Drillers!$L$2,ROW($AE1),7),IF($AE$1=\"Bulls\",OFFSET(Bulls!$L$2,ROW($AE1),7),IF($AE$1=\"Phantoms\",OFFSET(Phantoms!$L$2,ROW($AE1),7),IF($AE$1=\"Gators\",OFFSET(Gators!$L$2,ROW($AE1),7),IF($AE$1=\"Knights\",OFFSET(Knights!$L$2,ROW($AE1),7),IF($AE$1=\"Hornets\",OFFSET(Hornets!$L$2,ROW($AE1),7),IF($AE$1=\"Wolves\",OFFSET(Wolves!$L$2,ROW($AE1),7),IF($AE$1=\"Comets\",OFFSET(Comets!$L$2,ROW($AE1),7)))))))))","v":3},{"$f":"IF($AE$1=\"Drillers\",OFFSET(Drillers!$L$2,ROW($AE1),8),IF($AE$1=\"Bulls\",OFFSET(Bulls!$L$2,ROW($AE1),8),IF($AE$1=\"Phantoms\",OFFSET(Phantoms!$L$2,ROW($AE1),8),IF($AE$1=\"Gators\",OFFSET(Gators!$L$2,ROW($AE1),8),IF($AE$1=\"Knights\",OFFSET(Knights!$L$2,ROW($AE1),8),IF($AE$1=\"Hornets\",OFFSET(Hornets!$L$2,ROW($AE1),8),IF($AE$1=\"Wolves\",OFFSET(Wolves!$L$2,ROW($AE1),8),IF($AE$1=\"Comets\",OFFSET(Comets!$L$2,ROW($AE1),8)))))))))","v":5},{"$f":"IF($AE$1=\"Drillers\",OFFSET(Drillers!$L$2,ROW($AE1),9),IF($AE$1=\"Bulls\",OFFSET(Bulls!$L$2,ROW($AE1),9),IF($AE$1=\"Phantoms\",OFFSET(Phantoms!$L$2,ROW($AE1),9),IF($AE$1=\"Gators\",OFFSET(Gators!$L$2,ROW($AE1),9),IF($AE$1=\"Knights\",OFFSET(Knights!$L$2,ROW($AE1),9),IF($AE$1=\"Hornets\",OFFSET(Hornets!$L$2,ROW($AE1),9),IF($AE$1=\"Wolves\",OFFSET(Wolves!$L$2,ROW($AE1),9),IF($AE$1=\"Comets\",OFFSET(Comets!$L$2,ROW($AE1),9)))))))))","v":4},{"$f":"IF($AE$1=\"Drillers\",OFFSET(Drillers!$L$2,ROW($AE1),10),IF($AE$1=\"Bulls\",OFFSET(Bulls!$L$2,ROW($AE1),10),IF($AE$1=\"Phantoms\",OFFSET(Phantoms!$L$2,ROW($AE1),10),IF($AE$1=\"Gators\",OFFSET(Gators!$L$2,ROW($AE1),10),IF($AE$1=\"Knights\",OFFSET(Knights!$L$2,ROW($AE1),10),IF($AE$1=\"Hornets\",OFFSET(Hornets!$L$2,ROW($AE1),10),IF($AE$1=\"Wolves\",OFFSET(Wolves!$L$2,ROW($AE1),10),IF($AE$1=\"Comets\",OFFSET(Comets!$L$2,ROW($AE1),10)))))))))","v":3},{"$f":"IF($AE$1=\"Drillers\",OFFSET(Drillers!$L$2,ROW($AE1),11),IF($AE$1=\"Bulls\",OFFSET(Bulls!$L$2,ROW($AE1),11),IF($AE$1=\"Phantoms\",OFFSET(Phantoms!$L$2,ROW($AE1),11),IF($AE$1=\"Gators\",OFFSET(Gators!$L$2,ROW($AE1),11),IF($AE$1=\"Knights\",OFFSET(Knights!$L$2,ROW($AE1),11),IF($AE$1=\"Hornets\",OFFSET(Hornets!$L$2,ROW($AE1),11),IF($AE$1=\"Wolves\",OFFSET(Wolves!$L$2,ROW($AE1),11),IF($AE$1=\"Comets\",OFFSET(Comets!$L$2,ROW($AE1),11)))))))))","v":3},{"$f":"IF($AE$1=\"Drillers\",OFFSET(Drillers!$L$2,ROW($AE1),12),IF($AE$1=\"Bulls\",OFFSET(Bulls!$L$2,ROW($AE1),12),IF($AE$1=\"Phantoms\",OFFSET(Phantoms!$L$2,ROW($AE1),12),IF($AE$1=\"Gators\",OFFSET(Gators!$L$2,ROW($AE1),12),IF($AE$1=\"Knights\",OFFSET(Knights!$L$2,ROW($AE1),12),IF($AE$1=\"Hornets\",OFFSET(Hornets!$L$2,ROW($AE1),12),IF($AE$1=\"Wolves\",OFFSET(Wolves!$L$2,ROW($AE1),12),IF($AE$1=\"Comets\",OFFSET(Comets!$L$2,ROW($AE1),12)))))))))","v":"2B"},{"$f":"IF($AE$1=\"Drillers\",OFFSET(Drillers!$L$2,ROW($AE1),13),IF($AE$1=\"Bulls\",OFFSET(Bulls!$L$2,ROW($AE1),13),IF($AE$1=\"Phantoms\",OFFSET(Phantoms!$L$2,ROW($AE1),13),IF($AE$1=\"Gators\",OFFSET(Gators!$L$2,ROW($AE1),13),IF($AE$1=\"Knights\",OFFSET(Knights!$L$2,ROW($AE1),13),IF($AE$1=\"Hornets\",OFFSET(Hornets!$L$2,ROW($AE1),13),IF($AE$1=\"Wolves\",OFFSET(Wolves!$L$2,ROW($AE1),13),IF($AE$1=\"Comets\",OFFSET(Comets!$L$2,ROW($AE1),13)))))))))","v":0},{"$f":"IF($AE$1=\"Drillers\",OFFSET(Drillers!$L$2,ROW($AE$1),14),IF($AE$1=\"Bulls\",OFFSET(Bulls!$L$2,ROW($AE$1),14),IF($AE$1=\"Phantoms\",OFFSET(Phantoms!$L$2,ROW($AE$1),14),IF($AE$1=\"Gators\",OFFSET(Gators!$L$2,ROW($AE$1),14),IF($AE$1=\"Knights\",OFFSET(Knights!$L$2,ROW($AE$1),14),IF($AE$1=\"Hornets\",OFFSET(Hornets!$L$2,ROW($AE$1),14),IF($AE$1=\"Wolves\",OFFSET(Wolves!$L$2,ROW($AE$1),14),IF($AE$1=\"Comets\",OFFSET(Comets!$L$2,ROW($AE$1),14)))))))))","v":2},{"$f":"IF(AE$1=\"Drillers\",OFFSET(Drillers!$L$2,ROW(AE1),15),IF(AE$1=\"Bulls\",OFFSET(Bulls!$L$2,ROW(AE1),15),IF(AE$1=\"Phantoms\",OFFSET(Phantoms!$L$2,ROW(AE1),15),IF(AE$1=\"Gators\",OFFSET(Gators!$L$2,ROW(AE1),15),IF(AE$1=\"Knights\",OFFSET(Knights!$L$2,ROW(AE1),15),IF(AE$1=\"Hornets\",OFFSET(Hornets!$L$2,ROW(AE1),15),IF(AE$1=\"Wolves\",OFFSET(Wolves!$L$2,ROW(AE1),15),IF(AE$1=\"Comets\",OFFSET(Comets!$L$2,ROW(AE1),15)))))))))","v":0},{"$f":"IF($AE$1=\"Drillers\",OFFSET(Drillers!$L$2,ROW(AE1),16),IF($AE$1=\"Bulls\",OFFSET(Bulls!$L$2,ROW(AE1),16),IF($AE$1=\"Phantoms\",OFFSET(Phantoms!$L$2,ROW(AE1),16),IF($AE$1=\"Gators\",OFFSET(Gators!$L$2,ROW(AE1),16),IF($AE$1=\"Knights\",OFFSET(Knights!$L$2,ROW(AE1),16),IF($AE$1=\"Hornets\",OFFSET(Hornets!$L$2,ROW(AE1),16),IF($AE$1=\"Wolves\",OFFSET(Wolves!$L$2,ROW(AE1),16),IF($AE$1=\"Comets\",OFFSET(Comets!$L$2,ROW(AE1),16)))))))))","v":0},{"$f":"IF($AE$1=\"Drillers\",OFFSET(Drillers!$L$2,ROW($AE1),17),IF($AE$1=\"Bulls\",OFFSET(Bulls!$L$2,ROW($AE1),17),IF($AE$1=\"Phantoms\",OFFSET(Phantoms!$L$2,ROW($AE1),17),IF($AE$1=\"Gators\",OFFSET(Gators!$L$2,ROW($AE1),17),IF($AE$1=\"Knights\",OFFSET(Knights!$L$2,ROW($AE1),17),IF($AE$1=\"Hornets\",OFFSET(Hornets!$L$2,ROW($AE1),17),IF($AE$1=\"Wolves\",OFFSET(Wolves!$L$2,ROW($AE1),17),IF($AE$1=\"Comets\",OFFSET(Comets!$L$2,ROW($AE1),17)))))))))","v":3},{"$nulls":5},3,"Gators",{"$nulls":18},5]
[{"$nulls":4},2,{"$f":"IF($F$1=\"Drillers\",OFFSET(Drillers!$L$2,ROW($F2),1),IF($F$1=\"Bulls\",OFFSET(Bulls!$L$2,ROW($F2),1),IF($F$1=\"Phantoms\",OFFSET(Phantoms!$L$2,ROW($F2),1),IF($F$1=\"Gators\",OFFSET(Gators!$L$2,ROW($F2),1),IF($F$1=\"Knights\",OFFSET(Knights!$L$2,ROW($F2),1),IF($F$1=\"Hornets\",OFFSET(Hornets!$L$2,ROW($F2),1),IF($F$1=\"Reds\",OFFSET(Comets!$L$2,ROW($F2),1),IF($F$1=\"Guardians\",OFFSET(Wolves!$L$2,ROW($F2),1)))))))))","v":"Lucas"},{"$f":"IF($F$1=\"Drillers\",OFFSET(Drillers!$L$2,ROW($F2),2),IF($F$1=\"Bulls\",OFFSET(Bulls!$L$2,ROW($F2),2),IF($F$1=\"Phantoms\",OFFSET(Phantoms!$L$2,ROW($F2),2),IF($F$1=\"Gators\",OFFSET(Gators!$L$2,ROW($F2),2),IF($F$1=\"Knights\",OFFSET(Knights!$L$2,ROW($F2),2),IF($F$1=\"Hornets\",OFFSET(Hornets!$L$2,ROW($F2),2),IF($F$1=\"Reds\",OFFSET(Comets!$L$2,ROW($F2),2),IF($F$1=\"Guardians\",OFFSET(Wolves!$L$2,ROW($F2),2)))))))))","v":"Peter"},{"$f":"IF($F$1=\"Drillers\",OFFSET(Drillers!$L$2,ROW($F2),3),IF($F$1=\"Bulls\",OFFSET(Bulls!$L$2,ROW($F2),3),IF($F$1=\"Phantoms\",OFFSET(Phantoms!$L$2,ROW($F2),3),IF($F$1=\"Gators\",OFFSET(Gators!$L$2,ROW($F2),3),IF($F$1=\"Knights\",OFFSET(Knights!$L$2,ROW($F2),3),IF($F$1=\"Hornets\",OFFSET(Hornets!$L$2,ROW($F2),3),IF($F$1=\"Guardians\",OFFSET(Wolves!$L$2,ROW($F2),3),IF($F$1=\"Reds\",OFFSET(Comets!$L$2,ROW($F2),3)))))))))","v":"B"},{"$f":"IF($F$1=\"Drillers\",OFFSET(Drillers!$L$2,ROW($F2),4),IF($F$1=\"Bulls\",OFFSET(Bulls!$L$2,ROW($F2),4),IF($F$1=\"Phantoms\",OFFSET(Phantoms!$L$2,ROW($F2),4),IF($F$1=\"Gators\",OFFSET(Gators!$L$2,ROW($F2),4),IF($F$1=\"Knights\",OFFSET(Knights!$L$2,ROW($F2),4),IF($F$1=\"Hornets\",OFFSET(Hornets!$L$2,ROW($F2),4),IF($F$1=\"Guardians\",OFFSET(Wolves!$L$2,ROW($F2),4),IF($F$1=\"Reds\",OFFSET(Comets!$L$2,ROW($F2),4)))))))))","v":"2B"},{"$f":"IF($F$1=\"Drillers\",OFFSET(Drillers!$L$2,ROW($F2),5),IF($F$1=\"Bulls\",OFFSET(Bulls!$L$2,ROW($F2),5),IF($F$1=\"Phantoms\",OFFSET(Phantoms!$L$2,ROW($F2),5),IF($F$1=\"Gators\",OFFSET(Gators!$L$2,ROW($F2),5),IF($F$1=\"Knights\",OFFSET(Knights!$L$2,ROW($F2),5),IF($F$1=\"Hornets\",OFFSET(Hornets!$L$2,ROW($F2),5),IF($F$1=\"Guardians\",OFFSET(Wolves!$L$2,ROW($F2),5),IF($F$1=\"Reds\",OFFSET(Comets!$L$2,ROW($F2),5)))))))))","v":5},{"$f":"IF($F$1=\"Drillers\",OFFSET(Drillers!$L$2,ROW($F2),6),IF($F$1=\"Bulls\",OFFSET(Bulls!$L$2,ROW($F2),6),IF($F$1=\"Phantoms\",OFFSET(Phantoms!$L$2,ROW($F2),6),IF($F$1=\"Gators\",OFFSET(Gators!$L$2,ROW($F2),6),IF($F$1=\"Knights\",OFFSET(Knights!$L$2,ROW($F2),6),IF($F$1=\"Hornets\",OFFSET(Hornets!$L$2,ROW($F2),6),IF($F$1=\"Guardians\",OFFSET(Wolves!$L$2,ROW($F2),6),IF($F$1=\"Reds\",OFFSET(Comets!$L$2,ROW($F2),6)))))))))","v":3},{"$f":"IF($F$1=\"Drillers\",OFFSET(Drillers!$L$2,ROW(F2),7),IF($F$1=\"Bulls\",OFFSET(Bulls!$L$2,ROW(F2),7),IF($F$1=\"Phantoms\",OFFSET(Phantoms!$L$2,ROW(F2),7),IF($F$1=\"Gators\",OFFSET(Gators!$L$2,ROW(F2),7),IF($F$1=\"Knights\",OFFSET(Knights!$L$2,ROW(F2),7),IF($F$1=\"Hornets\",OFFSET(Hornets!$L$2,ROW(F2),7),IF($F$1=\"Guardians\",OFFSET(Wolves!$L$2,ROW(F2),7),IF($F$1=\"Reds\",OFFSET(Comets!$L$2,ROW(F2),7),))))))))","v":4},{"$f":"IF($F$1=\"Drillers\",OFFSET(Drillers!$L$2,ROW(F2),8),IF($F$1=\"Bulls\",OFFSET(Bulls!$L$2,ROW(F2),8),IF($F$1=\"Phantoms\",OFFSET(Phantoms!$L$2,ROW(F2),8),IF($F$1=\"Gators\",OFFSET(Gators!$L$2,ROW(F2),8),IF($F$1=\"Knights\",OFFSET(Knights!$L$2,ROW(F2),8),IF($F$1=\"Hornets\",OFFSET(Hornets!$L$2,ROW(F2),8),IF($F$1=\"Guardians\",OFFSET(Wolves!$L$2,ROW(F2),8),IF($F$1=\"Reds\",OFFSET(Comets!$L$2,ROW(F2),8)))))))))","v":4},{"$f":"IF($F$1=\"Drillers\",OFFSET(Drillers!$L$2,ROW($F2),9),IF($F$1=\"Bulls\",OFFSET(Bulls!$L$2,ROW($F2),9),IF($F$1=\"Phantoms\",OFFSET(Phantoms!$L$2,ROW($F2),9),IF($F$1=\"Gators\",OFFSET(Gators!$L$2,ROW($F2),9),IF($F$1=\"Knights\",OFFSET(Knights!$L$2,ROW($F2),9),IF($F$1=\"Hornets\",OFFSET(Hornets!$L$2,ROW(F2),9),IF($F$1=\"Guardians\",OFFSET(Wolves!$L$2,ROW($F2),9),IF($F$1=\"Reds\",OFFSET(Comets!$L$2,ROW($F2),9)))))))))","v":4},{"$f":"IF($F$1=\"Drillers\",OFFSET(Drillers!$L$2,ROW(F2),10),IF($F$1=\"Bulls\",OFFSET(Bulls!$L$2,ROW(F2),10),IF($F$1=\"Phantoms\",OFFSET(Phantoms!$L$2,ROW(F2),10),IF($F$1=\"Gators\",OFFSET(Gators!$L$2,ROW(F2),10),IF($F$1=\"Knights\",OFFSET(Knights!$L$2,ROW(F2),10),IF($F$1=\"Hornets\",OFFSET(Hornets!$L$2,ROW(F2),10),IF($F$1=\"Guardians\",OFFSET(Wolves!$L$2,ROW(F2),10),IF($F$1=\"Reds\",OFFSET(Comets!$L$2,ROW(F2),10)))))))))","v":5},{"$f":"IF($F$1=\"Drillers\",OFFSET(Drillers!$L$2,ROW(F2),11),IF($F$1=\"Bulls\",OFFSET(Bulls!$L$2,ROW(F2),11),IF($F$1=\"Phantoms\",OFFSET(Phantoms!$L$2,ROW(F2),11),IF($F$1=\"Gators\",OFFSET(Gators!$L$2,ROW(F2),11),IF($F$1=\"Knights\",OFFSET(Knights!$L$2,ROW(F2),11),IF($F$1=\"Hornets\",OFFSET(Hornets!$L$2,ROW(F2),11),IF($F$1=\"Guardians\",OFFSET(Wolves!$L$2,ROW(F2),11),IF($F$1=\"Drillers\",OFFSET(Drillers!$L$2,ROW(F2),11),IF($F$1=\"Reds\",OFFSET(Comets!$L$2,ROW(F2),11))))))))))","v":3},{"$f":"IF($F$1=\"Drillers\",OFFSET(Drillers!$L$2,ROW(F2),12),IF($F$1=\"Bulls\",OFFSET(Bulls!$L$2,ROW(F2),12),IF($F$1=\"Phantoms\",OFFSET(Phantoms!$L$2,ROW(F2),12),IF($F$1=\"Gators\",OFFSET(Gators!$L$2,ROW(F2),12),IF($F$1=\"Knights\",OFFSET(Knights!$L$2,ROW(F2),12),IF($F$1=\"Hornets\",OFFSET(Hornets!$L$2,ROW(F2),12),IF($F$1=\"Guardians\",OFFSET(Wolves!$L$2,ROW(F2),12),IF($F$1=\"Reds\",OFFSET(Comets!$L$2,ROW(F2),12),))))))))","v":"SS"},{"$f":"IF($F$1=\"Drillers\",OFFSET(Drillers!$L$2,ROW(F2),13),IF($F$1=\"Bulls\",OFFSET(Bulls!$L$2,ROW(F2),13),IF($F$1=\"Phantoms\",OFFSET(Phantoms!$L$2,ROW(F2),13),IF($F$1=\"Gators\",OFFSET(Gators!$L$2,ROW(F2),13),IF($F$1=\"Knights\",OFFSET(Knights!$L$2,ROW(F2),13),IF($F$1=\"Hornets\",OFFSET(Hornets!$L$2,ROW(F2),13),IF($F$1=\"Guardians\",OFFSET(Wolves!$L$2,ROW(F2),13),IF($F$1=\"Reds\",OFFSET(Comets!$L$2,ROW(F2),13),))))))))","v":0},{"$f":"IF($F$1=\"Drillers\",OFFSET(Drillers!$L$2,ROW(F2),14),IF($F$1=\"Bulls\",OFFSET(Bulls!$L$2,ROW(F2),14),IF($F$1=\"Phantoms\",OFFSET(Phantoms!$L$2,ROW(F2),14),IF($F$1=\"Gators\",OFFSET(Gators!$L$2,ROW(F2),14),IF($F$1=\"Knights\",OFFSET(Knights!$L$2,ROW(F2),14),IF($F$1=\"Hornets\",OFFSET(Hornets!$L$2,ROW(F2),14),IF($F$1=\"Guardians\",OFFSET(Wolves!$L$2,ROW(F2),14,),IF($F$1=\"Reds\",OFFSET(Comets!$L$2,ROW(F2),14)))))))))","v":3},{"$f":"IF($F$1=\"Drillers\",OFFSET(Drillers!$L$2,ROW(F2),15),IF($F$1=\"Bulls\",OFFSET(Bulls!$L$2,ROW(F2),15),IF($F$1=\"Phantoms\",OFFSET(Phantoms!$L$2,ROW(F2),15),IF($F$1=\"Gators\",OFFSET(Gators!$L$2,ROW(F2),15),IF($F$1=\"Knights\",OFFSET(Knights!$L$2,ROW(F2),15),IF($F$1=\"Hornets\",OFFSET(Hornets!$L$2,ROW(F2),15),IF($F$1=\"Guardians\",OFFSET(Wolves!$L$2,ROW(F2),15),IF($F$1=\"Reds\",OFFSET(Comets!$L$2,ROW(F2),15)))))))))","v":0},{"$f":"IF($F$1=\"Drillers\",OFFSET(Drillers!$L$2,ROW(F2),16),IF($F$1=\"Bulls\",OFFSET(Bulls!$L$2,ROW(F2),16),IF($F$1=\"Phantoms\",OFFSET(Phantoms!$L$2,ROW(F2),16),IF($F$1=\"Gators\",OFFSET(Gators!$L$2,ROW(F2),16),IF($F$1=\"Knights\",OFFSET(Knights!$L$2,ROW(F2),16),IF($F$1=\"Hornets\",OFFSET(Hornets!$L$2,ROW(F2),16),IF($F$1=\"Guardians\",OFFSET(Wolves!$L$2,ROW(F2),16),IF($F$1=\"Reds\",OFFSET(Comets!$L$2,ROW(F2),16)))))))))","v":0},{"$f":"IF($F$1=\"Drillers\",OFFSET(Drillers!$L$2,ROW($F2),17),IF($F$1=\"Bulls\",OFFSET(Bulls!$L$2,ROW($F2),17),IF($F$1=\"Phantoms\",OFFSET(Phantoms!$L$2,ROW($F2),17),IF($F$1=\"Gators\",OFFSET(Gators!$L$2,ROW($F2),17),IF($F$1=\"Knights\",OFFSET(Knights!$L$2,ROW($F2),17),IF($F$1=\"Hornets\",OFFSET(Hornets!$L$2,ROW($F2),17),IF($F$1=\"Guardians\",OFFSET(Wolves!$L$2,ROW($F2),17),IF($F$1=\"Reds\",OFFSET(Comets!$L$2,ROW($F2),17)))))))))","v":3},{"$nulls":7},2,{"$f":"IF($AE$1=\"Drillers\",OFFSET(Drillers!$L$2,ROW($AE2),1),IF($AE$1=\"Bulls\",OFFSET(Bulls!$L$2,ROW($AE2),1),IF($AE$1=\"Phantoms\",OFFSET(Phantoms!$L$2,ROW($AE2),1),IF($AE$1=\"Gators\",OFFSET(Gators!$L$2,ROW($AE2),1),IF($AE$1=\"Knights\",OFFSET(Knights!$L$2,ROW($AE2),1),IF($AE$1=\"Hornets\",OFFSET(Hornets!$L$2,ROW($AE2),1),IF($AE$1=\"Wolves\",OFFSET(Wolves!$L$2,ROW($AE2),1),IF(AE$1=\"Comets\",OFFSET(Comets!$L$2,ROW($AE2),1)))))))))","v":"Johnstone"},{"$f":"IF($AE$1=\"Drillers\",OFFSET(Drillers!$L$2,ROW($AF2),2),IF($AE$1=\"Bulls\",OFFSET(Bulls!$L$2,ROW($AF2),2),IF($AE$1=\"Phantoms\",OFFSET(Phantoms!$L$2,ROW($AF2),2),IF($AE$1=\"Gators\",OFFSET(Gators!$L$2,ROW($AF2),2),IF($AE$1=\"Knights\",OFFSET(Knights!$L$2,ROW($AF2),2),IF($AE$1=\"Hornets\",OFFSET(Hornets!$L$2,ROW($AF2),2),IF($AE$1=\"Wolves\",OFFSET(Wolves!$L$2,ROW($AF2),2),IF($AE$1=\"Comets\",OFFSET(Comets!$L$2,ROW($AF2),2)))))))))","v":"Dennis"},{"$f":"IF($AE$1=\"Drillers\",OFFSET(Drillers!$L$2,ROW($AE2),3),IF($AE$1=\"Bulls\",OFFSET(Bulls!$L$2,ROW($AE2),3),IF($AE$1=\"Phantoms\",OFFSET(Phantoms!$L$2,ROW($AE2),3),IF($AE$1=\"Gators\",OFFSET(Gators!$L$2,ROW($AE2),3),IF($AE$1=\"Knights\",OFFSET(Knights!$L$2,ROW($AE2),3),IF($AE$1=\"Hornets\",OFFSET(Hornets!$L$2,ROW($AE2),3),IF($AE$1=\"Wolves\",OFFSET(Wolves!$L$2,ROW($AE2),3),IF($AE$1=\"Comets\",OFFSET(Comets!$L$2,ROW($AE2),3)))))))))","v":"L"},{"$f":"IF($AE$1=\"Drillers\",OFFSET(Drillers!$L$2,ROW($AE2),4),IF($AE$1=\"Bulls\",OFFSET(Bulls!$L$2,ROW($AE2),4),IF($AE$1=\"Phantoms\",OFFSET(Phantoms!$L$2,ROW($AE2),4),IF($AE$1=\"Gators\",OFFSET(Gators!$L$2,ROW($AE2),4),IF($AE$1=\"Knights\",OFFSET(Knights!$L$2,ROW($AE2),4),IF($AE$1=\"Hornets\",OFFSET(Hornets!$L$2,ROW($AE2),4),IF($AE$1=\"Wolves\",OFFSET(Wolves!$L$2,ROW($AE2),4),IF($AE$1=\"Comets\",OFFSET(Comets!$L$2,ROW($AE2),4)))))))))","v":"DH"},{"$f":"IF($AE$1=\"Drillers\",OFFSET(Drillers!$L$2,ROW($AE2),5),IF($AE$1=\"Bulls\",OFFSET(Bulls!$L$2,ROW($AE2),5),IF($AE$1=\"Phantoms\",OFFSET(Phantoms!$L$2,ROW($AE2),5),IF($AE$1=\"Gators\",OFFSET(Gators!$L$2,ROW($AE2),5),IF($AE$1=\"Knights\",OFFSET(Knights!$L$2,ROW($AE2),5),IF($AE$1=\"Hornets\",OFFSET(Hornets!$L$2,ROW($AE2),5),IF($AE$1=\"Wolves\",OFFSET(Wolves!$L$2,ROW($AE2),5),IF($AE$1=\"Comets\",OFFSET(Comets!$L$2,ROW($AE2),5)))))))))","v":2},{"$f":"IF($AE$1=\"Drillers\",OFFSET(Drillers!$L$2,ROW($AE2),6),IF($AE$1=\"Bulls\",OFFSET(Bulls!$L$2,ROW($AE2),6),IF($AE$1=\"Phantoms\",OFFSET(Phantoms!$L$2,ROW($AE2),6),IF($AE$1=\"Gators\",OFFSET(Gators!$L$2,ROW($AE2),6),IF($AE$1=\"Knights\",OFFSET(Knights!$L$2,ROW($AE2),6),IF($AE$1=\"Hornets\",OFFSET(Hornets!$L$2,ROW($AE2),6),IF($AE$1=\"Wolves\",OFFSET(Wolves!$L$2,ROW($AE2),6),IF($AE$1=\"Comets\",OFFSET(Comets!$L$2,ROW($AE2),6)))))))))","v":3},{"$f":"IF($AE$1=\"Drillers\",OFFSET(Drillers!$L$2,ROW($AE2),7),IF($AE$1=\"Bulls\",OFFSET(Bulls!$L$2,ROW($AE2),7),IF($AE$1=\"Phantoms\",OFFSET(Phantoms!$L$2,ROW($AE2),7),IF($AE$1=\"Gators\",OFFSET(Gators!$L$2,ROW($AE2),7),IF($AE$1=\"Knights\",OFFSET(Knights!$L$2,ROW($AE2),7),IF($AE$1=\"Hornets\",OFFSET(Hornets!$L$2,ROW($AE2),7),IF($AE$1=\"Wolves\",OFFSET(Wolves!$L$2,ROW($AE2),7),IF($AE$1=\"Comets\",OFFSET(Comets!$L$2,ROW($AE2),7)))))))))","v":3},{"$f":"IF($AE$1=\"Drillers\",OFFSET(Drillers!$L$2,ROW($AE2),8),IF($AE$1=\"Bulls\",OFFSET(Bulls!$L$2,ROW($AE2),8),IF($AE$1=\"Phantoms\",OFFSET(Phantoms!$L$2,ROW($AE2),8),IF($AE$1=\"Gators\",OFFSET(Gators!$L$2,ROW($AE2),8),IF($AE$1=\"Knights\",OFFSET(Knights!$L$2,ROW($AE2),8),IF($AE$1=\"Hornets\",OFFSET(Hornets!$L$2,ROW($AE2),8),IF($AE$1=\"Wolves\",OFFSET(Wolves!$L$2,ROW($AE2),8),IF($AE$1=\"Comets\",OFFSET(Comets!$L$2,ROW($AE2),8)))))))))","v":4},{"$f":"IF($AE$1=\"Drillers\",OFFSET(Drillers!$L$2,ROW($AE2),9),IF($AE$1=\"Bulls\",OFFSET(Bulls!$L$2,ROW($AE2),9),IF($AE$1=\"Phantoms\",OFFSET(Phantoms!$L$2,ROW($AE2),9),IF($AE$1=\"Gators\",OFFSET(Gators!$L$2,ROW($AE2),9),IF($AE$1=\"Knights\",OFFSET(Knights!$L$2,ROW($AE2),9),IF($AE$1=\"Hornets\",OFFSET(Hornets!$L$2,ROW($AE2),9),IF($AE$1=\"Wolves\",OFFSET(Wolves!$L$2,ROW($AE2),9),IF($AE$1=\"Comets\",OFFSET(Comets!$L$2,ROW($AE2),9)))))))))","v":4},{"$f":"IF($AE$1=\"Drillers\",OFFSET(Drillers!$L$2,ROW($AE2),10),IF($AE$1=\"Bulls\",OFFSET(Bulls!$L$2,ROW($AE2),10),IF($AE$1=\"Phantoms\",OFFSET(Phantoms!$L$2,ROW($AE2),10),IF($AE$1=\"Gators\",OFFSET(Gators!$L$2,ROW($AE2),10),IF($AE$1=\"Knights\",OFFSET(Knights!$L$2,ROW($AE2),10),IF($AE$1=\"Hornets\",OFFSET(Hornets!$L$2,ROW($AE2),10),IF($AE$1=\"Wolves\",OFFSET(Wolves!$L$2,ROW($AE2),10),IF($AE$1=\"Comets\",OFFSET(Comets!$L$2,ROW($AE2),10)))))))))","v":2},{"$f":"IF($AE$1=\"Drillers\",OFFSET(Drillers!$L$2,ROW($AE2),11),IF($AE$1=\"Bulls\",OFFSET(Bulls!$L$2,ROW($AE2),11),IF($AE$1=\"Phantoms\",OFFSET(Phantoms!$L$2,ROW($AE2),11),IF($AE$1=\"Gators\",OFFSET(Gators!$L$2,ROW($AE2),11),IF($AE$1=\"Knights\",OFFSET(Knights!$L$2,ROW($AE2),11),IF($AE$1=\"Hornets\",OFFSET(Hornets!$L$2,ROW($AE2),11),IF($AE$1=\"Wolves\",OFFSET(Wolves!$L$2,ROW($AE2),11),IF($AE$1=\"Comets\",OFFSET(Comets!$L$2,ROW($AE2),11)))))))))","v":2},{"$f":"IF($AE$1=\"Drillers\",OFFSET(Drillers!$L$2,ROW($AE2),12),IF($AE$1=\"Bulls\",OFFSET(Bulls!$L$2,ROW($AE2),12),IF($AE$1=\"Phantoms\",OFFSET(Phantoms!$L$2,ROW($AE2),12),IF($AE$1=\"Gators\",OFFSET(Gators!$L$2,ROW($AE2),12),IF($AE$1=\"Knights\",OFFSET(Knights!$L$2,ROW($AE2),12),IF($AE$1=\"Hornets\",OFFSET(Hornets!$L$2,ROW($AE2),12),IF($AE$1=\"Wolves\",OFFSET(Wolves!$L$2,ROW($AE2),12),IF($AE$1=\"Comets\",OFFSET(Comets!$L$2,ROW($AE2),12)))))))))","v":"RF"},{"$f":"IF($AE$1=\"Drillers\",OFFSET(Drillers!$L$2,ROW($AE2),13),IF($AE$1=\"Bulls\",OFFSET(Bulls!$L$2,ROW($AE2),13),IF($AE$1=\"Phantoms\",OFFSET(Phantoms!$L$2,ROW($AE2),13),IF($AE$1=\"Gators\",OFFSET(Gators!$L$2,ROW($AE2),13),IF($AE$1=\"Knights\",OFFSET(Knights!$L$2,ROW($AE2),13),IF($AE$1=\"Hornets\",OFFSET(Hornets!$L$2,ROW($AE2),13),IF($AE$1=\"Wolves\",OFFSET(Wolves!$L$2,ROW($AE2),13),IF($AE$1=\"Comets\",OFFSET(Comets!$L$2,ROW($AE2),13)))))))))","v":0},{"$f":"IF($AE$1=\"Drillers\",OFFSET(Drillers!$L$2,ROW($AE2),14),IF($AE$1=\"Bulls\",OFFSET(Bulls!$L$2,ROW($AE2),14),IF($AE$1=\"Phantoms\",OFFSET(Phantoms!$L$2,ROW($AE2),14),IF($AE$1=\"Gators\",OFFSET(Gators!$L$2,ROW($AE2),14),IF($AE$1=\"Knights\",OFFSET(Knights!$L$2,ROW($AE2),14),IF($AE$1=\"Hornets\",OFFSET(Hornets!$L$2,ROW($AE2),14),IF($AE$1=\"Wolves\",OFFSET(Wolves!$L$2,ROW($AE2),14),IF($AE$1=\"Comets\",OFFSET(Comets!$L$2,ROW($AE2),14)))))))))","v":1},{"$f":"IF(AE$1=\"Drillers\",OFFSET(Drillers!$L$2,ROW(AE2),15),IF(AE$1=\"Bulls\",OFFSET(Bulls!$L$2,ROW(AE2),15),IF(AE$1=\"Phantoms\",OFFSET(Phantoms!$L$2,ROW(AE2),15),IF(AE$1=\"Gators\",OFFSET(Gators!$L$2,ROW(AE2),15),IF(AE$1=\"Knights\",OFFSET(Knights!$L$2,ROW(AE2),15),IF(AE$1=\"Hornets\",OFFSET(Hornets!$L$2,ROW(AE2),15),IF(AE$1=\"Wolves\",OFFSET(Wolves!$L$2,ROW(AE2),15),IF(AE$1=\"Comets\",OFFSET(Comets!$L$2,ROW(AE2),15)))))))))","v":0},{"$f":"IF($AE$1=\"Drillers\",OFFSET(Drillers!$L$2,ROW(AE2),16),IF($AE$1=\"Bulls\",OFFSET(Bulls!$L$2,ROW(AE2),16),IF($AE$1=\"Phantoms\",OFFSET(Phantoms!$L$2,ROW(AE2),16),IF($AE$1=\"Gators\",OFFSET(Gators!$L$2,ROW(AE2),16),IF($AE$1=\"Knights\",OFFSET(Knights!$L$2,ROW(AE2),16),IF($AE$1=\"Hornets\",OFFSET(Hornets!$L$2,ROW(AE2),16),IF($AE$1=\"Wolves\",OFFSET(Wolves!$L$2,ROW(AE2),16),IF($AE$1=\"Comets\",OFFSET(Comets!$L$2,ROW(AE2),16)))))))))","v":0},{"$f":"IF($AE$1=\"Drillers\",OFFSET(Drillers!$L$2,ROW($AE2),17),IF($AE$1=\"Bulls\",OFFSET(Bulls!$L$2,ROW($AE2),17),IF($AE$1=\"Phantoms\",OFFSET(Phantoms!$L$2,ROW($AE2),17),IF($AE$1=\"Gators\",OFFSET(Gators!$L$2,ROW($AE2),17),IF($AE$1=\"Knights\",OFFSET(Knights!$L$2,ROW($AE2),17),IF($AE$1=\"Hornets\",OFFSET(Hornets!$L$2,ROW($AE2),17),IF($AE$1=\"Wolves\",OFFSET(Wolves!$L$2,ROW($AE2),17),IF($AE$1=\"Comets\",OFFSET(Comets!$L$2,ROW($AE2),17)))))))))","v":1},{"$nulls":5},4,"Knights",{"$nulls":18},6]
[{"$nulls":4},3,{"$f":"IF($F$1=\"Drillers\",OFFSET(Drillers!$L$2,ROW($F3),1),IF($F$1=\"Bulls\",OFFSET(Bulls!$L$2,ROW($F3),1),IF($F$1=\"Phantoms\",OFFSET(Phantoms!$L$2,ROW($F3),1),IF($F$1=\"Gators\",OFFSET(Gators!$L$2,ROW($F3),1),IF($F$1=\"Knights\",OFFSET(Knights!$L$2,ROW($F3),1),IF($F$1=\"Hornets\",OFFSET(Hornets!$L$2,ROW($F3),1),IF($F$1=\"Reds\",OFFSET(Comets!$L$2,ROW($F3),1),IF($F$1=\"Guardians\",OFFSET(Wolves!$L$2,ROW($F3),1)))))))))","v":"Kemp"},{"$f":"IF($F$1=\"Drillers\",OFFSET(Drillers!$L$2,ROW($F3),2),IF($F$1=\"Bulls\",OFFSET(Bulls!$L$2,ROW($F3),2),IF($F$1=\"Phantoms\",OFFSET(Phantoms!$L$2,ROW($F3),2),IF($F$1=\"Gators\",OFFSET(Gators!$L$2,ROW($F3),2),IF($F$1=\"Knights\",OFFSET(Knights!$L$2,ROW($F3),2),IF($F$1=\"Hornets\",OFFSET(Hornets!$L$2,ROW($F3),2),IF($F$1=\"Reds\",OFFSET(Comets!$L$2,ROW($F3),2),IF($F$1=\"Guardians\",OFFSET(Wolves!$L$2,ROW($F3),2)))))))))","v":"Jay"},{"$f":"IF($F$1=\"Drillers\",OFFSET(Drillers!$L$2,ROW($F3),3),IF($F$1=\"Bulls\",OFFSET(Bulls!$L$2,ROW($F3),3),IF($F$1=\"Phantoms\",OFFSET(Phantoms!$L$2,ROW($F3),3),IF($F$1=\"Gators\",OFFSET(Gators!$L$2,ROW($F3),3),IF($F$1=\"Knights\",OFFSET(Knights!$L$2,ROW($F3),3),IF($F$1=\"Hornets\",OFFSET(Hornets!$L$2,ROW($F3),3),IF($F$1=\"Guardians\",OFFSET(Wolves!$L$2,ROW($F3),3),IF($F$1=\"Reds\",OFFSET(Comets!$L$2,ROW($F3),3)))))))))","v":"L"},{"$f":"IF($F$1=\"Drillers\",OFFSET(Drillers!$L$2,ROW($F3),4),IF($F$1=\"Bulls\",OFFSET(Bulls!$L$2,ROW($F3),4),IF($F$1=\"Phantoms\",OFFSET(Phantoms!$L$2,ROW($F3),4),IF($F$1=\"Gators\",OFFSET(Gators!$L$2,ROW($F3),4),IF($F$1=\"Knights\",OFFSET(Knights!$L$2,ROW($F3),4),IF($F$1=\"Hornets\",OFFSET(Hornets!$L$2,ROW($F3),4),IF($F$1=\"Guardians\",OFFSET(Wolves!$L$2,ROW($F3),4),IF($F$1=\"Reds\",OFFSET(Comets!$L$2,ROW($F3),4)))))))))","v":"SS"},{"$f":"IF($F$1=\"Drillers\",OFFSET(Drillers!$L$2,ROW($F3),5),IF($F$1=\"Bulls\",OFFSET(Bulls!$L$2,ROW($F3),5),IF($F$1=\"Phantoms\",OFFSET(Phantoms!$L$2,ROW($F3),5),IF($F$1=\"Gators\",OFFSET(Gators!$L$2,ROW($F3),5),IF($F$1=\"Knights\",OFFSET(Knights!$L$2,ROW($F3),5),IF($F$1=\"Hornets\",OFFSET(Hornets!$L$2,ROW($F3),5),IF($F$1=\"Guardians\",OFFSET(Wolves!$L$2,ROW($F3),5),IF($F$1=\"Reds\",OFFSET(Comets!$L$2,ROW($F3),5)))))))))","v":4},{"$f":"IF($F$1=\"Drillers\",OFFSET(Drillers!$L$2,ROW($F3),6),IF($F$1=\"Bulls\",OFFSET(Bulls!$L$2,ROW($F3),6),IF($F$1=\"Phantoms\",OFFSET(Phantoms!$L$2,ROW($F3),6),IF($F$1=\"Gators\",OFFSET(Gators!$L$2,ROW($F3),6),IF($F$1=\"Knights\",OFFSET(Knights!$L$2,ROW($F3),6),IF($F$1=\"Hornets\",OFFSET(Hornets!$L$2,ROW($F3),6),IF($F$1=\"Guardians\",OFFSET(Wolves!$L$2,ROW($F3),6),IF($F$1=\"Reds\",OFFSET(Comets!$L$2,ROW($F3),6)))))))))","v":5},{"$f":"IF($F$1=\"Drillers\",OFFSET(Drillers!$L$2,ROW(F3),7),IF($F$1=\"Bulls\",OFFSET(Bulls!$L$2,ROW(F3),7),IF($F$1=\"Phantoms\",OFFSET(Phantoms!$L$2,ROW(F3),7),IF($F$1=\"Gators\",OFFSET(Gators!$L$2,ROW(F3),7),IF($F$1=\"Knights\",OFFSET(Knights!$L$2,ROW(F3),7),IF($F$1=\"Hornets\",OFFSET(Hornets!$L$2,ROW(F3),7),IF($F$1=\"Guardians\",OFFSET(Wolves!$L$2,ROW(F3),7),IF($F$1=\"Reds\",OFFSET(Comets!$L$2,ROW(F3),7),))))))))","v":2},{"$f":"IF($F$1=\"Drillers\",OFFSET(Drillers!$L$2,ROW(F3),8),IF($F$1=\"Bulls\",OFFSET(Bulls!$L$2,ROW(F3),8),IF($F$1=\"Phantoms\",OFFSET(Phantoms!$L$2,ROW(F3),8),IF($F$1=\"Gators\",OFFSET(Gators!$L$2,ROW(F3),8),IF($F$1=\"Knights\",OFFSET(Knights!$L$2,ROW(F3),8),IF($F$1=\"Hornets\",OFFSET(Hornets!$L$2,ROW(F3),8),IF($F$1=\"Guardians\",OFFSET(Wolves!$L$2,ROW(F3),8),IF($F$1=\"Reds\",OFFSET(Comets!$L$2,ROW(F3),8)))))))))","v":3},{"$f":"IF($F$1=\"Drillers\",OFFSET(Drillers!$L$2,ROW($F3),9),IF($F$1=\"Bulls\",OFFSET(Bulls!$L$2,ROW($F3),9),IF($F$1=\"Phantoms\",OFFSET(Phantoms!$L$2,ROW($F3),9),IF($F$1=\"Gators\",OFFSET(Gators!$L$2,ROW($F3),9),IF($F$1=\"Knights\",OFFSET(Knights!$L$2,ROW($F3),9),IF($F$1=\"Hornets\",OFFSET(Hornets!$L$2,ROW(F3),9),IF($F$1=\"Guardians\",OFFSET(Wolves!$L$2,ROW($F3),9),IF($F$1=\"Reds\",OFFSET(Comets!$L$2,ROW($F3),9)))))))))","v":2},{"$f":"IF($F$1=\"Drillers\",OFFSET(Drillers!$L$2,ROW(F3),10),IF($F$1=\"Bulls\",OFFSET(Bulls!$L$2,ROW(F3),10),IF($F$1=\"Phantoms\",OFFSET(Phantoms!$L$2,ROW(F3),10),IF($F$1=\"Gators\",OFFSET(Gators!$L$2,ROW(F3),10),IF($F$1=\"Knights\",OFFSET(Knights!$L$2,ROW(F3),10),IF($F$1=\"Hornets\",OFFSET(Hornets!$L$2,ROW(F3),10),IF($F$1=\"Guardians\",OFFSET(Wolves!$L$2,ROW(F3),10),IF($F$1=\"Reds\",OFFSET(Comets!$L$2,ROW(F3),10)))))))))","v":5},{"$f":"IF($F$1=\"Drillers\",OFFSET(Drillers!$L$2,ROW(F3),11),IF($F$1=\"Bulls\",OFFSET(Bulls!$L$2,ROW(F3),11),IF($F$1=\"Phantoms\",OFFSET(Phantoms!$L$2,ROW(F3),11),IF($F$1=\"Gators\",OFFSET(Gators!$L$2,ROW(F3),11),IF($F$1=\"Knights\",OFFSET(Knights!$L$2,ROW(F3),11),IF($F$1=\"Hornets\",OFFSET(Hornets!$L$2,ROW(F3),11),IF($F$1=\"Guardians\",OFFSET(Wolves!$L$2,ROW(F3),11),IF($F$1=\"Drillers\",OFFSET(Drillers!$L$2,ROW(F3),11),IF($F$1=\"Reds\",OFFSET(Comets!$L$2,ROW(F3),11))))))))))","v":1},{"$f":"IF($F$1=\"Drillers\",OFFSET(Drillers!$L$2,ROW(F3),12),IF($F$1=\"Bulls\",OFFSET(Bulls!$L$2,ROW(F3),12),IF($F$1=\"Phantoms\",OFFSET(Phantoms!$L$2,ROW(F3),12),IF($F$1=\"Gators\",OFFSET(Gators!$L$2,ROW(F3),12),IF($F$1=\"Knights\",OFFSET(Knights!$L$2,ROW(F3),12),IF($F$1=\"Hornets\",OFFSET(Hornets!$L$2,ROW(F3),12),IF($F$1=\"Guardians\",OFFSET(Wolves!$L$2,ROW(F3),12),IF($F$1=\"Reds\",OFFSET(Comets!$L$2,ROW(F3),12),))))))))","v":"3B"},{"$f":"IF($F$1=\"Drillers\",OFFSET(Drillers!$L$2,ROW(F3),13),IF($F$1=\"Bulls\",OFFSET(Bulls!$L$2,ROW(F3),13),IF($F$1=\"Phantoms\",OFFSET(Phantoms!$L$2,ROW(F3),13),IF($F$1=\"Gators\",OFFSET(Gators!$L$2,ROW(F3),13),IF($F$1=\"Knights\",OFFSET(Knights!$L$2,ROW(F3),13),IF($F$1=\"Hornets\",OFFSET(Hornets!$L$2,ROW(F3),13),IF($F$1=\"Guardians\",OFFSET(Wolves!$L$2,ROW(F3),13),IF($F$1=\"Reds\",OFFSET(Comets!$L$2,ROW(F3),13),))))))))","v":0},{"$f":"IF($F$1=\"Drillers\",OFFSET(Drillers!$L$2,ROW(F3),14),IF($F$1=\"Bulls\",OFFSET(Bulls!$L$2,ROW(F3),14),IF($F$1=\"Phantoms\",OFFSET(Phantoms!$L$2,ROW(F3),14),IF($F$1=\"Gators\",OFFSET(Gators!$L$2,ROW(F3),14),IF($F$1=\"Knights\",OFFSET(Knights!$L$2,ROW(F3),14),IF($F$1=\"Hornets\",OFFSET(Hornets!$L$2,ROW(F3),14),IF($F$1=\"Guardians\",OFFSET(Wolves!$L$2,ROW(F3),14,),IF($F$1=\"Reds\",OFFSET(Comets!$L$2,ROW(F3),14)))))))))","v":3},{"$f":"IF($F$1=\"Drillers\",OFFSET(Drillers!$L$2,ROW(F3),15),IF($F$1=\"Bulls\",OFFSET(Bulls!$L$2,ROW(F3),15),IF($F$1=\"Phantoms\",OFFSET(Phantoms!$L$2,ROW(F3),15),IF($F$1=\"Gators\",OFFSET(Gators!$L$2,ROW(F3),15),IF($F$1=\"Knights\",OFFSET(Knights!$L$2,ROW(F3),15),IF($F$1=\"Hornets\",OFFSET(Hornets!$L$2,ROW(F3),15),IF($F$1=\"Guardians\",OFFSET(Wolves!$L$2,ROW(F3),15),IF($F$1=\"Reds\",OFFSET(Comets!$L$2,ROW(F3),15)))))))))","v":0},{"$f":"IF($F$1=\"Drillers\",OFFSET(Drillers!$L$2,ROW(F3),16),IF($F$1=\"Bulls\",OFFSET(Bulls!$L$2,ROW(F3),16),IF($F$1=\"Phantoms\",OFFSET(Phantoms!$L$2,ROW(F3),16),IF($F$1=\"Gators\",OFFSET(Gators!$L$2,ROW(F3),16),IF($F$1=\"Knights\",OFFSET(Knights!$L$2,ROW(F3),16),IF($F$1=\"Hornets\",OFFSET(Hornets!$L$2,ROW(F3),16),IF($F$1=\"Guardians\",OFFSET(Wolves!$L$2,ROW(F3),16),IF($F$1=\"Reds\",OFFSET(Comets!$L$2,ROW(F3),16)))))))))","v":0},{"$f":"IF($F$1=\"Drillers\",OFFSET(Drillers!$L$2,ROW($F3),17),IF($F$1=\"Bulls\",OFFSET(Bulls!$L$2,ROW($F3),17),IF($F$1=\"Phantoms\",OFFSET(Phantoms!$L$2,ROW($F3),17),IF($F$1=\"Gators\",OFFSET(Gators!$L$2,ROW($F3),17),IF($F$1=\"Knights\",OFFSET(Knights!$L$2,ROW($F3),17),IF($F$1=\"Hornets\",OFFSET(Hornets!$L$2,ROW($F3),17),IF($F$1=\"Guardians\",OFFSET(Wolves!$L$2,ROW($F3),17),IF($F$1=\"Reds\",OFFSET(Comets!$L$2,ROW($F3),17)))))))))","v":4},{"$nulls":7},3,{"$f":"IF($AE$1=\"Drillers\",OFFSET(Drillers!$L$2,ROW($AE3),1),IF($AE$1=\"Bulls\",OFFSET(Bulls!$L$2,ROW($AE3),1),IF($AE$1=\"Phantoms\",OFFSET(Phantoms!$L$2,ROW($AE3),1),IF($AE$1=\"Gators\",OFFSET(Gators!$L$2,ROW($AE3),1),IF($AE$1=\"Knights\",OFFSET(Knights!$L$2,ROW($AE3),1),IF($AE$1=\"Hornets\",OFFSET(Hornets!$L$2,ROW($AE3),1),IF($AE$1=\"Wolves\",OFFSET(Wolves!$L$2,ROW($AE3),1),IF(AE$1=\"Comets\",OFFSET(Comets!$L$2,ROW($AE3),1)))))))))","v":"O'Sheehan"},{"$f":"IF($AE$1=\"Drillers\",OFFSET(Drillers!$L$2,ROW($AF3),2),IF($AE$1=\"Bulls\",OFFSET(Bulls!$L$2,ROW($AF3),2),IF($AE$1=\"Phantoms\",OFFSET(Phantoms!$L$2,ROW($AF3),2),IF($AE$1=\"Gators\",OFFSET(Gators!$L$2,ROW($AF3),2),IF($AE$1=\"Knights\",OFFSET(Knights!$L$2,ROW($AF3),2),IF($AE$1=\"Hornets\",OFFSET(Hornets!$L$2,ROW($AF3),2),IF($AE$1=\"Wolves\",OFFSET(Wolves!$L$2,ROW($AF3),2),IF($AE$1=\"Comets\",OFFSET(Comets!$L$2,ROW($AF3),2)))))))))","v":"Bill"},{"$f":"IF($AE$1=\"Drillers\",OFFSET(Drillers!$L$2,ROW($AE3),3),IF($AE$1=\"Bulls\",OFFSET(Bulls!$L$2,ROW($AE3),3),IF($AE$1=\"Phantoms\",OFFSET(Phantoms!$L$2,ROW($AE3),3),IF($AE$1=\"Gators\",OFFSET(Gators!$L$2,ROW($AE3),3),IF($AE$1=\"Knights\",OFFSET(Knights!$L$2,ROW($AE3),3),IF($AE$1=\"Hornets\",OFFSET(Hornets!$L$2,ROW($AE3),3),IF($AE$1=\"Wolves\",OFFSET(Wolves!$L$2,ROW($AE3),3),IF($AE$1=\"Comets\",OFFSET(Comets!$L$2,ROW($AE3),3)))))))))","v":"R"},{"$f":"IF($AE$1=\"Drillers\",OFFSET(Drillers!$L$2,ROW($AE3),4),IF($AE$1=\"Bulls\",OFFSET(Bulls!$L$2,ROW($AE3),4),IF($AE$1=\"Phantoms\",OFFSET(Phantoms!$L$2,ROW($AE3),4),IF($AE$1=\"Gators\",OFFSET(Gators!$L$2,ROW($AE3),4),IF($AE$1=\"Knights\",OFFSET(Knights!$L$2,ROW($AE3),4),IF($AE$1=\"Hornets\",OFFSET(Hornets!$L$2,ROW($AE3),4),IF($AE$1=\"Wolves\",OFFSET(Wolves!$L$2,ROW($AE3),4),IF($AE$1=\"Comets\",OFFSET(Comets!$L$2,ROW($AE3),4)))))))))","v":"2B"},{"$f":"IF($AE$1=\"Drillers\",OFFSET(Drillers!$L$2,ROW($AE3),5),IF($AE$1=\"Bulls\",OFFSET(Bulls!$L$2,ROW($AE3),5),IF($AE$1=\"Phantoms\",OFFSET(Phantoms!$L$2,ROW($AE3),5),IF($AE$1=\"Gators\",OFFSET(Gators!$L$2,ROW($AE3),5),IF($AE$1=\"Knights\",OFFSET(Knights!$L$2,ROW($AE3),5),IF($AE$1=\"Hornets\",OFFSET(Hornets!$L$2,ROW($AE3),5),IF($AE$1=\"Wolves\",OFFSET(Wolves!$L$2,ROW($AE3),5),IF($AE$1=\"Comets\",OFFSET(Comets!$L$2,ROW($AE3),5)))))))))","v":4},{"$f":"IF($AE$1=\"Drillers\",OFFSET(Drillers!$L$2,ROW($AE3),6),IF($AE$1=\"Bulls\",OFFSET(Bulls!$L$2,ROW($AE3),6),IF($AE$1=\"Phantoms\",OFFSET(Phantoms!$L$2,ROW($AE3),6),IF($AE$1=\"Gators\",OFFSET(Gators!$L$2,ROW($AE3),6),IF($AE$1=\"Knights\",OFFSET(Knights!$L$2,ROW($AE3),6),IF($AE$1=\"Hornets\",OFFSET(Hornets!$L$2,ROW($AE3),6),IF($AE$1=\"Wolves\",OFFSET(Wolves!$L$2,ROW($AE3),6),IF($AE$1=\"Comets\",OFFSET(Comets!$L$2,ROW($AE3),6)))))))))","v":3},{"$f":"IF($AE$1=\"Drillers\",OFFSET(Drillers!$L$2,ROW($AE3),7),IF($AE$1=\"Bulls\",OFFSET(Bulls!$L$2,ROW($AE3),7),IF($AE$1=\"Phantoms\",OFFSET(Phantoms!$L$2,ROW($AE3),7),IF($AE$1=\"Gators\",OFFSET(Gators!$L$2,ROW($AE3),7),IF($AE$1=\"Knights\",OFFSET(Knights!$L$2,ROW($AE3),7),IF($AE$1=\"Hornets\",OFFSET(Hornets!$L$2,ROW($AE3),7),IF($AE$1=\"Wolves\",OFFSET(Wolves!$L$2,ROW($AE3),7),IF($AE$1=\"Comets\",OFFSET(Comets!$L$2,ROW($AE3),7)))))))))","v":1},{"$f":"IF($AE$1=\"Drillers\",OFFSET(Drillers!$L$2,ROW($AE3),8),IF($AE$1=\"Bulls\",OFFSET(Bulls!$L$2,ROW($AE3),8),IF($AE$1=\"Phantoms\",OFFSET(Phantoms!$L$2,ROW($AE3),8),IF($AE$1=\"Gators\",OFFSET(Gators!$L$2,ROW($AE3),8),IF($AE$1=\"Knights\",OFFSET(Knights!$L$2,ROW($AE3),8),IF($AE$1=\"Hornets\",OFFSET(Hornets!$L$2,ROW($AE3),8),IF($AE$1=\"Wolves\",OFFSET(Wolves!$L$2,ROW($AE3),8),IF($AE$1=\"Comets\",OFFSET(Comets!$L$2,ROW($AE3),8)))))))))","v":3},{"$f":"IF($AE$1=\"Drillers\",OFFSET(Drillers!$L$2,ROW($AE3),9),IF($AE$1=\"Bulls\",OFFSET(Bulls!$L$2,ROW($AE3),9),IF($AE$1=\"Phantoms\",OFFSET(Phantoms!$L$2,ROW($AE3),9),IF($AE$1=\"Gators\",OFFSET(Gators!$L$2,ROW($AE3),9),IF($AE$1=\"Knights\",OFFSET(Knights!$L$2,ROW($AE3),9),IF($AE$1=\"Hornets\",OFFSET(Hornets!$L$2,ROW($AE3),9),IF($AE$1=\"Wolves\",OFFSET(Wolves!$L$2,ROW($AE3),9),IF($AE$1=\"Comets\",OFFSET(Comets!$L$2,ROW($AE3),9)))))))))","v":5},{"$f":"IF($AE$1=\"Drillers\",OFFSET(Drillers!$L$2,ROW($AE3),10),IF($AE$1=\"Bulls\",OFFSET(Bulls!$L$2,ROW($AE3),10),IF($AE$1=\"Phantoms\",OFFSET(Phantoms!$L$2,ROW($AE3),10),IF($AE$1=\"Gators\",OFFSET(Gators!$L$2,ROW($AE3),10),IF($AE$1=\"Knights\",OFFSET(Knights!$L$2,ROW($AE3),10),IF($AE$1=\"Hornets\",OFFSET(Hornets!$L$2,ROW($AE3),10),IF($AE$1=\"Wolves\",OFFSET(Wolves!$L$2,ROW($AE3),10),IF($AE$1=\"Comets\",OFFSET(Comets!$L$2,ROW($AE3),10)))))))))","v":4},{"$f":"IF($AE$1=\"Drillers\",OFFSET(Drillers!$L$2,ROW($AE3),11),IF($AE$1=\"Bulls\",OFFSET(Bulls!$L$2,ROW($AE3),11),IF($AE$1=\"Phantoms\",OFFSET(Phantoms!$L$2,ROW($AE3),11),IF($AE$1=\"Gators\",OFFSET(Gators!$L$2,ROW($AE3),11),IF($AE$1=\"Knights\",OFFSET(Knights!$L$2,ROW($AE3),11),IF($AE$1=\"Hornets\",OFFSET(Hornets!$L$2,ROW($AE3),11),IF($AE$1=\"Wolves\",OFFSET(Wolves!$L$2,ROW($AE3),11),IF($AE$1=\"Comets\",OFFSET(Comets!$L$2,ROW($AE3),11)))))))))","v":3},{"$f":"IF($AE$1=\"Drillers\",OFFSET(Drillers!$L$2,ROW($AE3),12),IF($AE$1=\"Bulls\",OFFSET(Bulls!$L$2,ROW($AE3),12),IF($AE$1=\"Phantoms\",OFFSET(Phantoms!$L$2,ROW($AE3),12),IF($AE$1=\"Gators\",OFFSET(Gators!$L$2,ROW($AE3),12),IF($AE$1=\"Knights\",OFFSET(Knights!$L$2,ROW($AE3),12),IF($AE$1=\"Hornets\",OFFSET(Hornets!$L$2,ROW($AE3),12),IF($AE$1=\"Wolves\",OFFSET(Wolves!$L$2,ROW($AE3),12),IF($AE$1=\"Comets\",OFFSET(Comets!$L$2,ROW($AE3),12)))))))))","v":"SS"},{"$f":"IF($AE$1=\"Drillers\",OFFSET(Drillers!$L$2,ROW($AE3),13),IF($AE$1=\"Bulls\",OFFSET(Bulls!$L$2,ROW($AE3),13),IF($AE$1=\"Phantoms\",OFFSET(Phantoms!$L$2,ROW($AE3),13),IF($AE$1=\"Gators\",OFFSET(Gators!$L$2,ROW($AE3),13),IF($AE$1=\"Knights\",OFFSET(Knights!$L$2,ROW($AE3),13),IF($AE$1=\"Hornets\",OFFSET(Hornets!$L$2,ROW($AE3),13),IF($AE$1=\"Wolves\",OFFSET(Wolves!$L$2,ROW($AE3),13),IF($AE$1=\"Comets\",OFFSET(Comets!$L$2,ROW($AE3),13)))))))))","v":0},{"$f":"IF($AE$1=\"Drillers\",OFFSET(Drillers!$L$2,ROW($AE3),14),IF($AE$1=\"Bulls\",OFFSET(Bulls!$L$2,ROW($AE3),14),IF($AE$1=\"Phantoms\",OFFSET(Phantoms!$L$2,ROW($AE3),14),IF($AE$1=\"Gators\",OFFSET(Gators!$L$2,ROW($AE3),14),IF($AE$1=\"Knights\",OFFSET(Knights!$L$2,ROW($AE3),14),IF($AE$1=\"Hornets\",OFFSET(Hornets!$L$2,ROW($AE3),14),IF($AE$1=\"Wolves\",OFFSET(Wolves!$L$2,ROW($AE3),14),IF($AE$1=\"Comets\",OFFSET(Comets!$L$2,ROW($AE3),14)))))))))","v":3},{"$f":"IF(AE$1=\"Drillers\",OFFSET(Drillers!$L$2,ROW(AE3),15),IF(AE$1=\"Bulls\",OFFSET(Bulls!$L$2,ROW(AE3),15),IF(AE$1=\"Phantoms\",OFFSET(Phantoms!$L$2,ROW(AE3),15),IF(AE$1=\"Gators\",OFFSET(Gators!$L$2,ROW(AE3),15),IF(AE$1=\"Knights\",OFFSET(Knights!$L$2,ROW(AE3),15),IF(AE$1=\"Hornets\",OFFSET(Hornets!$L$2,ROW(AE3),15),IF(AE$1=\"Wolves\",OFFSET(Wolves!$L$2,ROW(AE3),15),IF(AE$1=\"Comets\",OFFSET(Comets!$L$2,ROW(AE3),15)))))))))","v":0},{"$f":"IF($AE$1=\"Drillers\",OFFSET(Drillers!$L$2,ROW(AE3),16),IF($AE$1=\"Bulls\",OFFSET(Bulls!$L$2,ROW(AE3),16),IF($AE$1=\"Phantoms\",OFFSET(Phantoms!$L$2,ROW(AE3),16),IF($AE$1=\"Gators\",OFFSET(Gators!$L$2,ROW(AE3),16),IF($AE$1=\"Knights\",OFFSET(Knights!$L$2,ROW(AE3),16),IF($AE$1=\"Hornets\",OFFSET(Hornets!$L$2,ROW(AE3),16),IF($AE$1=\"Wolves\",OFFSET(Wolves!$L$2,ROW(AE3),16),IF($AE$1=\"Comets\",OFFSET(Comets!$L$2,ROW(AE3),16)))))))))","v":0},{"$f":"IF($AE$1=\"Drillers\",OFFSET(Drillers!$L$2,ROW($AE3),17),IF($AE$1=\"Bulls\",OFFSET(Bulls!$L$2,ROW($AE3),17),IF($AE$1=\"Phantoms\",OFFSET(Phantoms!$L$2,ROW($AE3),17),IF($AE$1=\"Gators\",OFFSET(Gators!$L$2,ROW($AE3),17),IF($AE$1=\"Knights\",OFFSET(Knights!$L$2,ROW($AE3),17),IF($AE$1=\"Hornets\",OFFSET(Hornets!$L$2,ROW($AE3),17),IF($AE$1=\"Wolves\",OFFSET(Wolves!$L$2,ROW($AE3),17),IF($AE$1=\"Comets\",OFFSET(Comets!$L$2,ROW($AE3),17)))))))))","v":2},{"$nulls":5},5,"Drillers",{"$nulls":18},7]
[{"$nulls":4},4,{"$f":"IF($F$1=\"Drillers\",OFFSET(Drillers!$L$2,ROW($F4),1),IF($F$1=\"Bulls\",OFFSET(Bulls!$L$2,ROW($F4),1),IF($F$1=\"Phantoms\",OFFSET(Phantoms!$L$2,ROW($F4),1),IF($F$1=\"Gators\",OFFSET(Gators!$L$2,ROW($F4),1),IF($F$1=\"Knights\",OFFSET(Knights!$L$2,ROW($F4),1),IF($F$1=\"Hornets\",OFFSET(Hornets!$L$2,ROW($F4),1),IF($F$1=\"Reds\",OFFSET(Comets!$L$2,ROW($F4),1),IF($F$1=\"Guardians\",OFFSET(Wolves!$L$2,ROW($F4),1)))))))))","v":"Holley"},{"$f":"IF($F$1=\"Drillers\",OFFSET(Drillers!$L$2,ROW($F4),2),IF($F$1=\"Bulls\",OFFSET(Bulls!$L$2,ROW($F4),2),IF($F$1=\"Phantoms\",OFFSET(Phantoms!$L$2,ROW($F4),2),IF($F$1=\"Gators\",OFFSET(Gators!$L$2,ROW($F4),2),IF($F$1=\"Knights\",OFFSET(Knights!$L$2,ROW($F4),2),IF($F$1=\"Hornets\",OFFSET(Hornets!$L$2,ROW($F4),2),IF($F$1=\"Reds\",OFFSET(Comets!$L$2,ROW($F4),2),IF($F$1=\"Guardians\",OFFSET(Wolves!$L$2,ROW($F4),2)))))))))","v":"Howard"},{"$f":"IF($F$1=\"Drillers\",OFFSET(Drillers!$L$2,ROW($F4),3),IF($F$1=\"Bulls\",OFFSET(Bulls!$L$2,ROW($F4),3),IF($F$1=\"Phantoms\",OFFSET(Phantoms!$L$2,ROW($F4),3),IF($F$1=\"Gators\",OFFSET(Gators!$L$2,ROW($F4),3),IF($F$1=\"Knights\",OFFSET(Knights!$L$2,ROW($F4),3),IF($F$1=\"Hornets\",OFFSET(Hornets!$L$2,ROW($F4),3),IF($F$1=\"Guardians\",OFFSET(Wolves!$L$2,ROW($F4),3),IF($F$1=\"Reds\",OFFSET(Comets!$L$2,ROW($F4),3)))))))))","v":"L"},{"$f":"IF($F$1=\"Drillers\",OFFSET(Drillers!$L$2,ROW($F4),4),IF($F$1=\"Bulls\",OFFSET(Bulls!$L$2,ROW($F4),4),IF($F$1=\"Phantoms\",OFFSET(Phantoms!$L$2,ROW($F4),4),IF($F$1=\"Gators\",OFFSET(Gators!$L$2,ROW($F4),4),IF($F$1=\"Knights\",OFFSET(Knights!$L$2,ROW($F4),4),IF($F$1=\"Hornets\",OFFSET(Hornets!$L$2,ROW($F4),4),IF($F$1=\"Guardians\",OFFSET(Wolves!$L$2,ROW($F4),4),IF($F$1=\"Reds\",OFFSET(Comets!$L$2,ROW($F4),4)))))))))","v":"LF"},{"$f":"IF($F$1=\"Drillers\",OFFSET(Drillers!$L$2,ROW($F4),5),IF($F$1=\"Bulls\",OFFSET(Bulls!$L$2,ROW($F4),5),IF($F$1=\"Phantoms\",OFFSET(Phantoms!$L$2,ROW($F4),5),IF($F$1=\"Gators\",OFFSET(Gators!$L$2,ROW($F4),5),IF($F$1=\"Knights\",OFFSET(Knights!$L$2,ROW($F4),5),IF($F$1=\"Hornets\",OFFSET(Hornets!$L$2,ROW($F4),5),IF($F$1=\"Guardians\",OFFSET(Wolves!$L$2,ROW($F4),5),IF($F$1=\"Reds\",OFFSET(Comets!$L$2,ROW($F4),5)))))))))","v":3},{"$f":"IF($F$1=\"Drillers\",OFFSET(Drillers!$L$2,ROW($F4),6),IF($F$1=\"Bulls\",OFFSET(Bulls!$L$2,ROW($F4),6),IF($F$1=\"Phantoms\",OFFSET(Phantoms!$L$2,ROW($F4),6),IF($F$1=\"Gators\",OFFSET(Gators!$L$2,ROW($F4),6),IF($F$1=\"Knights\",OFFSET(Knights!$L$2,ROW($F4),6),IF($F$1=\"Hornets\",OFFSET(Hornets!$L$2,ROW($F4),6),IF($F$1=\"Guardians\",OFFSET(Wolves!$L$2,ROW($F4),6),IF($F$1=\"Reds\",OFFSET(Comets!$L$2,ROW($F4),6)))))))))","v":4},{"$f":"IF($F$1=\"Drillers\",OFFSET(Drillers!$L$2,ROW(F4),7),IF($F$1=\"Bulls\",OFFSET(Bulls!$L$2,ROW(F4),7),IF($F$1=\"Phantoms\",OFFSET(Phantoms!$L$2,ROW(F4),7),IF($F$1=\"Gators\",OFFSET(Gators!$L$2,ROW(F4),7),IF($F$1=\"Knights\",OFFSET(Knights!$L$2,ROW(F4),7),IF($F$1=\"Hornets\",OFFSET(Hornets!$L$2,ROW(F4),7),IF($F$1=\"Guardians\",OFFSET(Wolves!$L$2,ROW(F4),7),IF($F$1=\"Reds\",OFFSET(Comets!$L$2,ROW(F4),7),))))))))","v":1},{"$f":"IF($F$1=\"Drillers\",OFFSET(Drillers!$L$2,ROW(F4),8),IF($F$1=\"Bulls\",OFFSET(Bulls!$L$2,ROW(F4),8),IF($F$1=\"Phantoms\",OFFSET(Phantoms!$L$2,ROW(F4),8),IF($F$1=\"Gators\",OFFSET(Gators!$L$2,ROW(F4),8),IF($F$1=\"Knights\",OFFSET(Knights!$L$2,ROW(F4),8),IF($F$1=\"Hornets\",OFFSET(Hornets!$L$2,ROW(F4),8),IF($F$1=\"Guardians\",OFFSET(Wolves!$L$2,ROW(F4),8),IF($F$1=\"Reds\",OFFSET(Comets!$L$2,ROW(F4),8)))))))))","v":3},{"$f":"IF($F$1=\"Drillers\",OFFSET(Drillers!$L$2,ROW($F4),9),IF($F$1=\"Bulls\",OFFSET(Bulls!$L$2,ROW($F4),9),IF($F$1=\"Phantoms\",OFFSET(Phantoms!$L$2,ROW($F4),9),IF($F$1=\"Gators\",OFFSET(Gators!$L$2,ROW($F4),9),IF($F$1=\"Knights\",OFFSET(Knights!$L$2,ROW($F4),9),IF($F$1=\"Hornets\",OFFSET(Hornets!$L$2,ROW(F4),9),IF($F$1=\"Guardians\",OFFSET(Wolves!$L$2,ROW($F4),9),IF($F$1=\"Reds\",OFFSET(Comets!$L$2,ROW($F4),9)))))))))","v":2},{"$f":"IF($F$1=\"Drillers\",OFFSET(Drillers!$L$2,ROW(F4),10),IF($F$1=\"Bulls\",OFFSET(Bulls!$L$2,ROW(F4),10),IF($F$1=\"Phantoms\",OFFSET(Phantoms!$L$2,ROW(F4),10),IF($F$1=\"Gators\",OFFSET(Gators!$L$2,ROW(F4),10),IF($F$1=\"Knights\",OFFSET(Knights!$L$2,ROW(F4),10),IF($F$1=\"Hornets\",OFFSET(Hornets!$L$2,ROW(F4),10),IF($F$1=\"Guardians\",OFFSET(Wolves!$L$2,ROW(F4),10),IF($F$1=\"Reds\",OFFSET(Comets!$L$2,ROW(F4),10)))))))))","v":4},{"$f":"IF($F$1=\"Drillers\",OFFSET(Drillers!$L$2,ROW(F4),11),IF($F$1=\"Bulls\",OFFSET(Bulls!$L$2,ROW(F4),11),IF($F$1=\"Phantoms\",OFFSET(Phantoms!$L$2,ROW(F4),11),IF($F$1=\"Gators\",OFFSET(Gators!$L$2,ROW(F4),11),IF($F$1=\"Knights\",OFFSET(Knights!$L$2,ROW(F4),11),IF($F$1=\"Hornets\",OFFSET(Hornets!$L$2,ROW(F4),11),IF($F$1=\"Guardians\",OFFSET(Wolves!$L$2,ROW(F4),11),IF($F$1=\"Drillers\",OFFSET(Drillers!$L$2,ROW(F4),11),IF($F$1=\"Reds\",OFFSET(Comets!$L$2,ROW(F4),11))))))))))","v":3},{"$f":"IF($F$1=\"Drillers\",OFFSET(Drillers!$L$2,ROW(F4),12),IF($F$1=\"Bulls\",OFFSET(Bulls!$L$2,ROW(F4),12),IF($F$1=\"Phantoms\",OFFSET(Phantoms!$L$2,ROW(F4),12),IF($F$1=\"Gators\",OFFSET(Gators!$L$2,ROW(F4),12),IF($F$1=\"Knights\",OFFSET(Knights!$L$2,ROW(F4),12),IF($F$1=\"Hornets\",OFFSET(Hornets!$L$2,ROW(F4),12),IF($F$1=\"Guardians\",OFFSET(Wolves!$L$2,ROW(F4),12),IF($F$1=\"Reds\",OFFSET(Comets!$L$2,ROW(F4),12),))))))))","v":"RF"},{"$f":"IF($F$1=\"Drillers\",OFFSET(Drillers!$L$2,ROW(F4),13),IF($F$1=\"Bulls\",OFFSET(Bulls!$L$2,ROW(F4),13),IF($F$1=\"Phantoms\",OFFSET(Phantoms!$L$2,ROW(F4),13),IF($F$1=\"Gators\",OFFSET(Gators!$L$2,ROW(F4),13),IF($F$1=\"Knights\",OFFSET(Knights!$L$2,ROW(F4),13),IF($F$1=\"Hornets\",OFFSET(Hornets!$L$2,ROW(F4),13),IF($F$1=\"Guardians\",OFFSET(Wolves!$L$2,ROW(F4),13),IF($F$1=\"Reds\",OFFSET(Comets!$L$2,ROW(F4),13),))))))))","v":0},{"$f":"IF($F$1=\"Drillers\",OFFSET(Drillers!$L$2,ROW(F4),14),IF($F$1=\"Bulls\",OFFSET(Bulls!$L$2,ROW(F4),14),IF($F$1=\"Phantoms\",OFFSET(Phantoms!$L$2,ROW(F4),14),IF($F$1=\"Gators\",OFFSET(Gators!$L$2,ROW(F4),14),IF($F$1=\"Knights\",OFFSET(Knights!$L$2,ROW(F4),14),IF($F$1=\"Hornets\",OFFSET(Hornets!$L$2,ROW(F4),14),IF($F$1=\"Guardians\",OFFSET(Wolves!$L$2,ROW(F4),14,),IF($F$1=\"Reds\",OFFSET(Comets!$L$2,ROW(F4),14)))))))))","v":2},{"$f":"IF($F$1=\"Drillers\",OFFSET(Drillers!$L$2,ROW(F4),15),IF($F$1=\"Bulls\",OFFSET(Bulls!$L$2,ROW(F4),15),IF($F$1=\"Phantoms\",OFFSET(Phantoms!$L$2,ROW(F4),15),IF($F$1=\"Gators\",OFFSET(Gators!$L$2,ROW(F4),15),IF($F$1=\"Knights\",OFFSET(Knights!$L$2,ROW(F4),15),IF($F$1=\"Hornets\",OFFSET(Hornets!$L$2,ROW(F4),15),IF($F$1=\"Guardians\",OFFSET(Wolves!$L$2,ROW(F4),15),IF($F$1=\"Reds\",OFFSET(Comets!$L$2,ROW(F4),15)))))))))","v":0},{"$f":"IF($F$1=\"Drillers\",OFFSET(Drillers!$L$2,ROW(F4),16),IF($F$1=\"Bulls\",OFFSET(Bulls!$L$2,ROW(F4),16),IF($F$1=\"Phantoms\",OFFSET(Phantoms!$L$2,ROW(F4),16),IF($F$1=\"Gators\",OFFSET(Gators!$L$2,ROW(F4),16),IF($F$1=\"Knights\",OFFSET(Knights!$L$2,ROW(F4),16),IF($F$1=\"Hornets\",OFFSET(Hornets!$L$2,ROW(F4),16),IF($F$1=\"Guardians\",OFFSET(Wolves!$L$2,ROW(F4),16),IF($F$1=\"Reds\",OFFSET(Comets!$L$2,ROW(F4),16)))))))))","v":0},{"$f":"IF($F$1=\"Drillers\",OFFSET(Drillers!$L$2,ROW($F4),17),IF($F$1=\"Bulls\",OFFSET(Bulls!$L$2,ROW($F4),17),IF($F$1=\"Phantoms\",OFFSET(Phantoms!$L$2,ROW($F4),17),IF($F$1=\"Gators\",OFFSET(Gators!$L$2,ROW($F4),17),IF($F$1=\"Knights\",OFFSET(Knights!$L$2,ROW($F4),17),IF($F$1=\"Hornets\",OFFSET(Hornets!$L$2,ROW($F4),17),IF($F$1=\"Guardians\",OFFSET(Wolves!$L$2,ROW($F4),17),IF($F$1=\"Reds\",OFFSET(Comets!$L$2,ROW($F4),17)))))))))","v":4},{"$nulls":7},4,{"$f":"IF($AE$1=\"Drillers\",OFFSET(Drillers!$L$2,ROW($AE4),1),IF($AE$1=\"Bulls\",OFFSET(Bulls!$L$2,ROW($AE4),1),IF($AE$1=\"Phantoms\",OFFSET(Phantoms!$L$2,ROW($AE4),1),IF($AE$1=\"Gators\",OFFSET(Gators!$L$2,ROW($AE4),1),IF($AE$1=\"Knights\",OFFSET(Knights!$L$2,ROW($AE4),1),IF($AE$1=\"Hornets\",OFFSET(Hornets!$L$2,ROW($AE4),1),IF($AE$1=\"Wolves\",OFFSET(Wolves!$L$2,ROW($AE4),1),IF(AE$1=\"Comets\",OFFSET(Comets!$L$2,ROW($AE4),1)))))))))","v":"Rhodes"},{"$f":"IF($AE$1=\"Drillers\",OFFSET(Drillers!$L$2,ROW($AF4),2),IF($AE$1=\"Bulls\",OFFSET(Bulls!$L$2,ROW($AF4),2),IF($AE$1=\"Phantoms\",OFFSET(Phantoms!$L$2,ROW($AF4),2),IF($AE$1=\"Gators\",OFFSET(Gators!$L$2,ROW($AF4),2),IF($AE$1=\"Knights\",OFFSET(Knights!$L$2,ROW($AF4),2),IF($AE$1=\"Hornets\",OFFSET(Hornets!$L$2,ROW($AF4),2),IF($AE$1=\"Wolves\",OFFSET(Wolves!$L$2,ROW($AF4),2),IF($AE$1=\"Comets\",OFFSET(Comets!$L$2,ROW($AF4),2)))))))))","v":"John"},{"$f":"IF($AE$1=\"Drillers\",OFFSET(Drillers!$L$2,ROW($AE4),3),IF($AE$1=\"Bulls\",OFFSET(Bulls!$L$2,ROW($AE4),3),IF($AE$1=\"Phantoms\",OFFSET(Phantoms!$L$2,ROW($AE4),3),IF($AE$1=\"Gators\",OFFSET(Gators!$L$2,ROW($AE4),3),IF($AE$1=\"Knights\",OFFSET(Knights!$L$2,ROW($AE4),3),IF($AE$1=\"Hornets\",OFFSET(Hornets!$L$2,ROW($AE4),3),IF($AE$1=\"Wolves\",OFFSET(Wolves!$L$2,ROW($AE4),3),IF($AE$1=\"Comets\",OFFSET(Comets!$L$2,ROW($AE4),3)))))))))","v":"R"},{"$f":"IF($AE$1=\"Drillers\",OFFSET(Drillers!$L$2,ROW($AE4),4),IF($AE$1=\"Bulls\",OFFSET(Bulls!$L$2,ROW($AE4),4),IF($AE$1=\"Phantoms\",OFFSET(Phantoms!$L$2,ROW($AE4),4),IF($AE$1=\"Gators\",OFFSET(Gators!$L$2,ROW($AE4),4),IF($AE$1=\"Knights\",OFFSET(Knights!$L$2,ROW($AE4),4),IF($AE$1=\"Hornets\",OFFSET(Hornets!$L$2,ROW($AE4),4),IF($AE$1=\"Wolves\",OFFSET(Wolves!$L$2,ROW($AE4),4),IF($AE$1=\"Comets\",OFFSET(Comets!$L$2,ROW($AE4),4)))))))))","v":"3B"},{"$f":"IF($AE$1=\"Drillers\",OFFSET(Drillers!$L$2,ROW($AE4),5),IF($AE$1=\"Bulls\",OFFSET(Bulls!$L$2,ROW($AE4),5),IF($AE$1=\"Phantoms\",OFFSET(Phantoms!$L$2,ROW($AE4),5),IF($AE$1=\"Gators\",OFFSET(Gators!$L$2,ROW($AE4),5),IF($AE$1=\"Knights\",OFFSET(Knights!$L$2,ROW($AE4),5),IF($AE$1=\"Hornets\",OFFSET(Hornets!$L$2,ROW($AE4),5),IF($AE$1=\"Wolves\",OFFSET(Wolves!$L$2,ROW($AE4),5),IF($AE$1=\"Comets\",OFFSET(Comets!$L$2,ROW($AE4),5)))))))))","v":3},{"$f":"IF($AE$1=\"Drillers\",OFFSET(Drillers!$L$2,ROW($AE4),6),IF($AE$1=\"Bulls\",OFFSET(Bulls!$L$2,ROW($AE4),6),IF($AE$1=\"Phantoms\",OFFSET(Phantoms!$L$2,ROW($AE4),6),IF($AE$1=\"Gators\",OFFSET(Gators!$L$2,ROW($AE4),6),IF($AE$1=\"Knights\",OFFSET(Knights!$L$2,ROW($AE4),6),IF($AE$1=\"Hornets\",OFFSET(Hornets!$L$2,ROW($AE4),6),IF($AE$1=\"Wolves\",OFFSET(Wolves!$L$2,ROW($AE4),6),IF($AE$1=\"Comets\",OFFSET(Comets!$L$2,ROW($AE4),6)))))))))","v":4},{"$f":"IF($AE$1=\"Drillers\",OFFSET(Drillers!$L$2,ROW($AE4),7),IF($AE$1=\"Bulls\",OFFSET(Bulls!$L$2,ROW($AE4),7),IF($AE$1=\"Phantoms\",OFFSET(Phantoms!$L$2,ROW($AE4),7),IF($AE$1=\"Gators\",OFFSET(Gators!$L$2,ROW($AE4),7),IF($AE$1=\"Knights\",OFFSET(Knights!$L$2,ROW($AE4),7),IF($AE$1=\"Hornets\",OFFSET(Hornets!$L$2,ROW($AE4),7),IF($AE$1=\"Wolves\",OFFSET(Wolves!$L$2,ROW($AE4),7),IF($AE$1=\"Comets\",OFFSET(Comets!$L$2,ROW($AE4),7)))))))))","v":1},{"$f":"IF($AE$1=\"Drillers\",OFFSET(Drillers!$L$2,ROW($AE4),8),IF($AE$1=\"Bulls\",OFFSET(Bulls!$L$2,ROW($AE4),8),IF($AE$1=\"Phantoms\",OFFSET(Phantoms!$L$2,ROW($AE4),8),IF($AE$1=\"Gators\",OFFSET(Gators!$L$2,ROW($AE4),8),IF($AE$1=\"Knights\",OFFSET(Knights!$L$2,ROW($AE4),8),IF($AE$1=\"Hornets\",OFFSET(Hornets!$L$2,ROW($AE4),8),IF($AE$1=\"Wolves\",OFFSET(Wolves!$L$2,ROW($AE4),8),IF($AE$1=\"Comets\",OFFSET(Comets!$L$2,ROW($AE4),8)))))))))","v":1},{"$f":"IF($AE$1=\"Drillers\",OFFSET(Drillers!$L$2,ROW($AE4),9),IF($AE$1=\"Bulls\",OFFSET(Bulls!$L$2,ROW($AE4),9),IF($AE$1=\"Phantoms\",OFFSET(Phantoms!$L$2,ROW($AE4),9),IF($AE$1=\"Gators\",OFFSET(Gators!$L$2,ROW($AE4),9),IF($AE$1=\"Knights\",OFFSET(Knights!$L$2,ROW($AE4),9),IF($AE$1=\"Hornets\",OFFSET(Hornets!$L$2,ROW($AE4),9),IF($AE$1=\"Wolves\",OFFSET(Wolves!$L$2,ROW($AE4),9),IF($AE$1=\"Comets\",OFFSET(Comets!$L$2,ROW($AE4),9)))))))))","v":2},{"$f":"IF($AE$1=\"Drillers\",OFFSET(Drillers!$L$2,ROW($AE4),10),IF($AE$1=\"Bulls\",OFFSET(Bulls!$L$2,ROW($AE4),10),IF($AE$1=\"Phantoms\",OFFSET(Phantoms!$L$2,ROW($AE4),10),IF($AE$1=\"Gators\",OFFSET(Gators!$L$2,ROW($AE4),10),IF($AE$1=\"Knights\",OFFSET(Knights!$L$2,ROW($AE4),10),IF($AE$1=\"Hornets\",OFFSET(Hornets!$L$2,ROW($AE4),10),IF($AE$1=\"Wolves\",OFFSET(Wolves!$L$2,ROW($AE4),10),IF($AE$1=\"Comets\",OFFSET(Comets!$L$2,ROW($AE4),10)))))))))","v":2},{"$f":"IF($AE$1=\"Drillers\",OFFSET(Drillers!$L$2,ROW($AE4),11),IF($AE$1=\"Bulls\",OFFSET(Bulls!$L$2,ROW($AE4),11),IF($AE$1=\"Phantoms\",OFFSET(Phantoms!$L$2,ROW($AE4),11),IF($AE$1=\"Gators\",OFFSET(Gators!$L$2,ROW($AE4),11),IF($AE$1=\"Knights\",OFFSET(Knights!$L$2,ROW($AE4),11),IF($AE$1=\"Hornets\",OFFSET(Hornets!$L$2,ROW($AE4),11),IF($AE$1=\"Wolves\",OFFSET(Wolves!$L$2,ROW($AE4),11),IF($AE$1=\"Comets\",OFFSET(Comets!$L$2,ROW($AE4),11)))))))))","v":2},{"$f":"IF($AE$1=\"Drillers\",OFFSET(Drillers!$L$2,ROW($AE4),12),IF($AE$1=\"Bulls\",OFFSET(Bulls!$L$2,ROW($AE4),12),IF($AE$1=\"Phantoms\",OFFSET(Phantoms!$L$2,ROW($AE4),12),IF($AE$1=\"Gators\",OFFSET(Gators!$L$2,ROW($AE4),12),IF($AE$1=\"Knights\",OFFSET(Knights!$L$2,ROW($AE4),12),IF($AE$1=\"Hornets\",OFFSET(Hornets!$L$2,ROW($AE4),12),IF($AE$1=\"Wolves\",OFFSET(Wolves!$L$2,ROW($AE4),12),IF($AE$1=\"Comets\",OFFSET(Comets!$L$2,ROW($AE4),12)))))))))","v":"1B"},{"$f":"IF($AE$1=\"Drillers\",OFFSET(Drillers!$L$2,ROW($AE4),13),IF($AE$1=\"Bulls\",OFFSET(Bulls!$L$2,ROW($AE4),13),IF($AE$1=\"Phantoms\",OFFSET(Phantoms!$L$2,ROW($AE4),13),IF($AE$1=\"Gators\",OFFSET(Gators!$L$2,ROW($AE4),13),IF($AE$1=\"Knights\",OFFSET(Knights!$L$2,ROW($AE4),13),IF($AE$1=\"Hornets\",OFFSET(Hornets!$L$2,ROW($AE4),13),IF($AE$1=\"Wolves\",OFFSET(Wolves!$L$2,ROW($AE4),13),IF($AE$1=\"Comets\",OFFSET(Comets!$L$2,ROW($AE4),13)))))))))","v":0},{"$f":"IF($AE$1=\"Drillers\",OFFSET(Drillers!$L$2,ROW($AE4),14),IF($AE$1=\"Bulls\",OFFSET(Bulls!$L$2,ROW($AE4),14),IF($AE$1=\"Phantoms\",OFFSET(Phantoms!$L$2,ROW($AE4),14),IF($AE$1=\"Gators\",OFFSET(Gators!$L$2,ROW($AE4),14),IF($AE$1=\"Knights\",OFFSET(Knights!$L$2,ROW($AE4),14),IF($AE$1=\"Hornets\",OFFSET(Hornets!$L$2,ROW($AE4),14),IF($AE$1=\"Wolves\",OFFSET(Wolves!$L$2,ROW($AE4),14),IF($AE$1=\"Comets\",OFFSET(Comets!$L$2,ROW($AE4),14)))))))))","v":1},{"$f":"IF(AE$1=\"Drillers\",OFFSET(Drillers!$L$2,ROW(AE4),15),IF(AE$1=\"Bulls\",OFFSET(Bulls!$L$2,ROW(AE4),15),IF(AE$1=\"Phantoms\",OFFSET(Phantoms!$L$2,ROW(AE4),15),IF(AE$1=\"Gators\",OFFSET(Gators!$L$2,ROW(AE4),15),IF(AE$1=\"Knights\",OFFSET(Knights!$L$2,ROW(AE4),15),IF(AE$1=\"Hornets\",OFFSET(Hornets!$L$2,ROW(AE4),15),IF(AE$1=\"Wolves\",OFFSET(Wolves!$L$2,ROW(AE4),15),IF(AE$1=\"Comets\",OFFSET(Comets!$L$2,ROW(AE4),15)))))))))","v":0},{"$f":"IF($AE$1=\"Drillers\",OFFSET(Drillers!$L$2,ROW(AE4),16),IF($AE$1=\"Bulls\",OFFSET(Bulls!$L$2,ROW(AE4),16),IF($AE$1=\"Phantoms\",OFFSET(Phantoms!$L$2,ROW(AE4),16),IF($AE$1=\"Gators\",OFFSET(Gators!$L$2,ROW(AE4),16),IF($AE$1=\"Knights\",OFFSET(Knights!$L$2,ROW(AE4),16),IF($AE$1=\"Hornets\",OFFSET(Hornets!$L$2,ROW(AE4),16),IF($AE$1=\"Wolves\",OFFSET(Wolves!$L$2,ROW(AE4),16),IF($AE$1=\"Comets\",OFFSET(Comets!$L$2,ROW(AE4),16)))))))))","v":0},{"$f":"IF($AE$1=\"Drillers\",OFFSET(Drillers!$L$2,ROW($AE4),17),IF($AE$1=\"Bulls\",OFFSET(Bulls!$L$2,ROW($AE4),17),IF($AE$1=\"Phantoms\",OFFSET(Phantoms!$L$2,ROW($AE4),17),IF($AE$1=\"Gators\",OFFSET(Gators!$L$2,ROW($AE4),17),IF($AE$1=\"Knights\",OFFSET(Knights!$L$2,ROW($AE4),17),IF($AE$1=\"Hornets\",OFFSET(Hornets!$L$2,ROW($AE4),17),IF($AE$1=\"Wolves\",OFFSET(Wolves!$L$2,ROW($AE4),17),IF($AE$1=\"Comets\",OFFSET(Comets!$L$2,ROW($AE4),17)))))))))","v":5},{"$nulls":5},6,"Hornets",{"$nulls":18},8]
[{"$nulls":4},5,{"$f":"IF($F$1=\"Drillers\",OFFSET(Drillers!$L$2,ROW($F5),1),IF($F$1=\"Bulls\",OFFSET(Bulls!$L$2,ROW($F5),1),IF($F$1=\"Phantoms\",OFFSET(Phantoms!$L$2,ROW($F5),1),IF($F$1=\"Gators\",OFFSET(Gators!$L$2,ROW($F5),1),IF($F$1=\"Knights\",OFFSET(Knights!$L$2,ROW($F5),1),IF($F$1=\"Hornets\",OFFSET(Hornets!$L$2,ROW($F5),1),IF($F$1=\"Reds\",OFFSET(Comets!$L$2,ROW($F5),1),IF($F$1=\"Guardians\",OFFSET(Wolves!$L$2,ROW($F5),1)))))))))","v":"Moran"},{"$f":"IF($F$1=\"Drillers\",OFFSET(Drillers!$L$2,ROW($F5),2),IF($F$1=\"Bulls\",OFFSET(Bulls!$L$2,ROW($F5),2),IF($F$1=\"Phantoms\",OFFSET(Phantoms!$L$2,ROW($F5),2),IF($F$1=\"Gators\",OFFSET(Gators!$L$2,ROW($F5),2),IF($F$1=\"Knights\",OFFSET(Knights!$L$2,ROW($F5),2),IF($F$1=\"Hornets\",OFFSET(Hornets!$L$2,ROW($F5),2),IF($F$1=\"Reds\",OFFSET(Comets!$L$2,ROW($F5),2),IF($F$1=\"Guardians\",OFFSET(Wolves!$L$2,ROW($F5),2)))))))))","v":"Octavio"},{"$f":"IF($F$1=\"Drillers\",OFFSET(Drillers!$L$2,ROW($F5),3),IF($F$1=\"Bulls\",OFFSET(Bulls!$L$2,ROW($F5),3),IF($F$1=\"Phantoms\",OFFSET(Phantoms!$L$2,ROW($F5),3),IF($F$1=\"Gators\",OFFSET(Gators!$L$2,ROW($F5),3),IF($F$1=\"Knights\",OFFSET(Knights!$L$2,ROW($F5),3),IF($F$1=\"Hornets\",OFFSET(Hornets!$L$2,ROW($F5),3),IF($F$1=\"Guardians\",OFFSET(Wolves!$L$2,ROW($F5),3),IF($F$1=\"Reds\",OFFSET(Comets!$L$2,ROW($F5),3)))))))))","v":"R"},{"$f":"IF($F$1=\"Drillers\",OFFSET(Drillers!$L$2,ROW($F5),4),IF($F$1=\"Bulls\",OFFSET(Bulls!$L$2,ROW($F5),4),IF($F$1=\"Phantoms\",OFFSET(Phantoms!$L$2,ROW($F5),4),IF($F$1=\"Gators\",OFFSET(Gators!$L$2,ROW($F5),4),IF($F$1=\"Knights\",OFFSET(Knights!$L$2,ROW($F5),4),IF($F$1=\"Hornets\",OFFSET(Hornets!$L$2,ROW($F5),4),IF($F$1=\"Guardians\",OFFSET(Wolves!$L$2,ROW($F5),4),IF($F$1=\"Reds\",OFFSET(Comets!$L$2,ROW($F5),4)))))))))","v":"C"},{"$f":"IF($F$1=\"Drillers\",OFFSET(Drillers!$L$2,ROW($F5),5),IF($F$1=\"Bulls\",OFFSET(Bulls!$L$2,ROW($F5),5),IF($F$1=\"Phantoms\",OFFSET(Phantoms!$L$2,ROW($F5),5),IF($F$1=\"Gators\",OFFSET(Gators!$L$2,ROW($F5),5),IF($F$1=\"Knights\",OFFSET(Knights!$L$2,ROW($F5),5),IF($F$1=\"Hornets\",OFFSET(Hornets!$L$2,ROW($F5),5),IF($F$1=\"Guardians\",OFFSET(Wolves!$L$2,ROW($F5),5),IF($F$1=\"Reds\",OFFSET(Comets!$L$2,ROW($F5),5)))))))))","v":3},{"$f":"IF($F$1=\"Drillers\",OFFSET(Drillers!$L$2,ROW($F5),6),IF($F$1=\"Bulls\",OFFSET(Bulls!$L$2,ROW($F5),6),IF($F$1=\"Phantoms\",OFFSET(Phantoms!$L$2,ROW($F5),6),IF($F$1=\"Gators\",OFFSET(Gators!$L$2,ROW($F5),6),IF($F$1=\"Knights\",OFFSET(Knights!$L$2,ROW($F5),6),IF($F$1=\"Hornets\",OFFSET(Hornets!$L$2,ROW($F5),6),IF($F$1=\"Guardians\",OFFSET(Wolves!$L$2,ROW($F5),6),IF($F$1=\"Reds\",OFFSET(Comets!$L$2,ROW($F5),6)))))))))","v":2},{"$f":"IF($F$1=\"Drillers\",OFFSET(Drillers!$L$2,ROW(F5),7),IF($F$1=\"Bulls\",OFFSET(Bulls!$L$2,ROW(F5),7),IF($F$1=\"Phantoms\",OFFSET(Phantoms!$L$2,ROW(F5),7),IF($F$1=\"Gators\",OFFSET(Gators!$L$2,ROW(F5),7),IF($F$1=\"Knights\",OFFSET(Knights!$L$2,ROW(F5),7),IF($F$1=\"Hornets\",OFFSET(Hornets!$L$2,ROW(F5),7),IF($F$1=\"Guardians\",OFFSET(Wolves!$L$2,ROW(F5),7),IF($F$1=\"Reds\",OFFSET(Comets!$L$2,ROW(F5),7),))))))))","v":2},{"$f":"IF($F$1=\"Drillers\",OFFSET(Drillers!$L$2,ROW(F5),8),IF($F$1=\"Bulls\",OFFSET(Bulls!$L$2,ROW(F5),8),IF($F$1=\"Phantoms\",OFFSET(Phantoms!$L$2,ROW(F5),8),IF($F$1=\"Gators\",OFFSET(Gators!$L$2,ROW(F5),8),IF($F$1=\"Knights\",OFFSET(Knights!$L$2,ROW(F5),8),IF($F$1=\"Hornets\",OFFSET(Hornets!$L$2,ROW(F5),8),IF($F$1=\"Guardians\",OFFSET(Wolves!$L$2,ROW(F5),8),IF($F$1=\"Reds\",OFFSET(Comets!$L$2,ROW(F5),8)))))))))","v":2},{"$f":"IF($F$1=\"Drillers\",OFFSET(Drillers!$L$2,ROW($F5),9),IF($F$1=\"Bulls\",OFFSET(Bulls!$L$2,ROW($F5),9),IF($F$1=\"Phantoms\",OFFSET(Phantoms!$L$2,ROW($F5),9),IF($F$1=\"Gators\",OFFSET(Gators!$L$2,ROW($F5),9),IF($F$1=\"Knights\",OFFSET(Knights!$L$2,ROW($F5),9),IF($F$1=\"Hornets\",OFFSET(Hornets!$L$2,ROW(F5),9),IF($F$1=\"Guardians\",OFFSET(Wolves!$L$2,ROW($F5),9),IF($F$1=\"Reds\",OFFSET(Comets!$L$2,ROW($F5),9)))))))))","v":2},{"$f":"IF($F$1=\"Drillers\",OFFSET(Drillers!$L$2,ROW(F5),10),IF($F$1=\"Bulls\",OFFSET(Bulls!$L$2,ROW(F5),10),IF($F$1=\"Phantoms\",OFFSET(Phantoms!$L$2,ROW(F5),10),IF($F$1=\"Gators\",OFFSET(Gators!$L$2,ROW(F5),10),IF($F$1=\"Knights\",OFFSET(Knights!$L$2,ROW(F5),10),IF($F$1=\"Hornets\",OFFSET(Hornets!$L$2,ROW(F5),10),IF($F$1=\"Guardians\",OFFSET(Wolves!$L$2,ROW(F5),10),IF($F$1=\"Reds\",OFFSET(Comets!$L$2,ROW(F5),10)))))))))","v":5},{"$f":"IF($F$1=\"Drillers\",OFFSET(Drillers!$L$2,ROW(F5),11),IF($F$1=\"Bulls\",OFFSET(Bulls!$L$2,ROW(F5),11),IF($F$1=\"Phantoms\",OFFSET(Phantoms!$L$2,ROW(F5),11),IF($F$1=\"Gators\",OFFSET(Gators!$L$2,ROW(F5),11),IF($F$1=\"Knights\",OFFSET(Knights!$L$2,ROW(F5),11),IF($F$1=\"Hornets\",OFFSET(Hornets!$L$2,ROW(F5),11),IF($F$1=\"Guardians\",OFFSET(Wolves!$L$2,ROW(F5),11),IF($F$1=\"Drillers\",OFFSET(Drillers!$L$2,ROW(F5),11),IF($F$1=\"Reds\",OFFSET(Comets!$L$2,ROW(F5),11))))))))))","v":3},{"$f":"IF($F$1=\"Drillers\",OFFSET(Drillers!$L$2,ROW(F5),12),IF($F$1=\"Bulls\",OFFSET(Bulls!$L$2,ROW(F5),12),IF($F$1=\"Phantoms\",OFFSET(Phantoms!$L$2,ROW(F5),12),IF($F$1=\"Gators\",OFFSET(Gators!$L$2,ROW(F5),12),IF($F$1=\"Knights\",OFFSET(Knights!$L$2,ROW(F5),12),IF($F$1=\"Hornets\",OFFSET(Hornets!$L$2,ROW(F5),12),IF($F$1=\"Guardians\",OFFSET(Wolves!$L$2,ROW(F5),12),IF($F$1=\"Reds\",OFFSET(Comets!$L$2,ROW(F5),12),))))))))","v":"3B"},{"$f":"IF($F$1=\"Drillers\",OFFSET(Drillers!$L$2,ROW(F5),13),IF($F$1=\"Bulls\",OFFSET(Bulls!$L$2,ROW(F5),13),IF($F$1=\"Phantoms\",OFFSET(Phantoms!$L$2,ROW(F5),13),IF($F$1=\"Gators\",OFFSET(Gators!$L$2,ROW(F5),13),IF($F$1=\"Knights\",OFFSET(Knights!$L$2,ROW(F5),13),IF($F$1=\"Hornets\",OFFSET(Hornets!$L$2,ROW(F5),13),IF($F$1=\"Guardians\",OFFSET(Wolves!$L$2,ROW(F5),13),IF($F$1=\"Reds\",OFFSET(Comets!$L$2,ROW(F5),13),))))))))","v":"1B"},{"$f":"IF($F$1=\"Drillers\",OFFSET(Drillers!$L$2,ROW(F5),14),IF($F$1=\"Bulls\",OFFSET(Bulls!$L$2,ROW(F5),14),IF($F$1=\"Phantoms\",OFFSET(Phantoms!$L$2,ROW(F5),14),IF($F$1=\"Gators\",OFFSET(Gators!$L$2,ROW(F5),14),IF($F$1=\"Knights\",OFFSET(Knights!$L$2,ROW(F5),14),IF($F$1=\"Hornets\",OFFSET(Hornets!$L$2,ROW(F5),14),IF($F$1=\"Guardians\",OFFSET(Wolves!$L$2,ROW(F5),14,),IF($F$1=\"Reds\",OFFSET(Comets!$L$2,ROW(F5),14)))))))))","v":2},{"$f":"IF($F$1=\"Drillers\",OFFSET(Drillers!$L$2,ROW(F5),15),IF($F$1=\"Bulls\",OFFSET(Bulls!$L$2,ROW(F5),15),IF($F$1=\"Phantoms\",OFFSET(Phantoms!$L$2,ROW(F5),15),IF($F$1=\"Gators\",OFFSET(Gators!$L$2,ROW(F5),15),IF($F$1=\"Knights\",OFFSET(Knights!$L$2,ROW(F5),15),IF($F$1=\"Hornets\",OFFSET(Hornets!$L$2,ROW(F5),15),IF($F$1=\"Guardians\",OFFSET(Wolves!$L$2,ROW(F5),15),IF($F$1=\"Reds\",OFFSET(Comets!$L$2,ROW(F5),15)))))))))","v":0},{"$f":"IF($F$1=\"Drillers\",OFFSET(Drillers!$L$2,ROW(F5),16),IF($F$1=\"Bulls\",OFFSET(Bulls!$L$2,ROW(F5),16),IF($F$1=\"Phantoms\",OFFSET(Phantoms!$L$2,ROW(F5),16),IF($F$1=\"Gators\",OFFSET(Gators!$L$2,ROW(F5),16),IF($F$1=\"Knights\",OFFSET(Knights!$L$2,ROW(F5),16),IF($F$1=\"Hornets\",OFFSET(Hornets!$L$2,ROW(F5),16),IF($F$1=\"Guardians\",OFFSET(Wolves!$L$2,ROW(F5),16),IF($F$1=\"Reds\",OFFSET(Comets!$L$2,ROW(F5),16)))))))))","v":0},{"$f":"IF($F$1=\"Drillers\",OFFSET(Drillers!$L$2,ROW($F5),17),IF($F$1=\"Bulls\",OFFSET(Bulls!$L$2,ROW($F5),17),IF($F$1=\"Phantoms\",OFFSET(Phantoms!$L$2,ROW($F5),17),IF($F$1=\"Gators\",OFFSET(Gators!$L$2,ROW($F5),17),IF($F$1=\"Knights\",OFFSET(Knights!$L$2,ROW($F5),17),IF($F$1=\"Hornets\",OFFSET(Hornets!$L$2,ROW($F5),17),IF($F$1=\"Guardians\",OFFSET(Wolves!$L$2,ROW($F5),17),IF($F$1=\"Reds\",OFFSET(Comets!$L$2,ROW($F5),17)))))))))","v":3},{"$nulls":7},5,{"$f":"IF($AE$1=\"Drillers\",OFFSET(Drillers!$L$2,ROW($AE5),1),IF($AE$1=\"Bulls\",OFFSET(Bulls!$L$2,ROW($AE5),1),IF($AE$1=\"Phantoms\",OFFSET(Phantoms!$L$2,ROW($AE5),1),IF($AE$1=\"Gators\",OFFSET(Gators!$L$2,ROW($AE5),1),IF($AE$1=\"Knights\",OFFSET(Knights!$L$2,ROW($AE5),1),IF($AE$1=\"Hornets\",OFFSET(Hornets!$L$2,ROW($AE5),1),IF($AE$1=\"Wolves\",OFFSET(Wolves!$L$2,ROW($AE5),1),IF(AE$1=\"Comets\",OFFSET(Comets!$L$2,ROW($AE5),1)))))))))","v":"Shelton"},{"$f":"IF($AE$1=\"Drillers\",OFFSET(Drillers!$L$2,ROW($AF5),2),IF($AE$1=\"Bulls\",OFFSET(Bulls!$L$2,ROW($AF5),2),IF($AE$1=\"Phantoms\",OFFSET(Phantoms!$L$2,ROW($AF5),2),IF($AE$1=\"Gators\",OFFSET(Gators!$L$2,ROW($AF5),2),IF($AE$1=\"Knights\",OFFSET(Knights!$L$2,ROW($AF5),2),IF($AE$1=\"Hornets\",OFFSET(Hornets!$L$2,ROW($AF5),2),IF($AE$1=\"Wolves\",OFFSET(Wolves!$L$2,ROW($AF5),2),IF($AE$1=\"Comets\",OFFSET(Comets!$L$2,ROW($AF5),2)))))))))","v":"Bill"},{"$f":"IF($AE$1=\"Drillers\",OFFSET(Drillers!$L$2,ROW($AE5),3),IF($AE$1=\"Bulls\",OFFSET(Bulls!$L$2,ROW($AE5),3),IF($AE$1=\"Phantoms\",OFFSET(Phantoms!$L$2,ROW($AE5),3),IF($AE$1=\"Gators\",OFFSET(Gators!$L$2,ROW($AE5),3),IF($AE$1=\"Knights\",OFFSET(Knights!$L$2,ROW($AE5),3),IF($AE$1=\"Hornets\",OFFSET(Hornets!$L$2,ROW($AE5),3),IF($AE$1=\"Wolves\",OFFSET(Wolves!$L$2,ROW($AE5),3),IF($AE$1=\"Comets\",OFFSET(Comets!$L$2,ROW($AE5),3)))))))))","v":"B"},{"$f":"IF($AE$1=\"Drillers\",OFFSET(Drillers!$L$2,ROW($AE5),4),IF($AE$1=\"Bulls\",OFFSET(Bulls!$L$2,ROW($AE5),4),IF($AE$1=\"Phantoms\",OFFSET(Phantoms!$L$2,ROW($AE5),4),IF($AE$1=\"Gators\",OFFSET(Gators!$L$2,ROW($AE5),4),IF($AE$1=\"Knights\",OFFSET(Knights!$L$2,ROW($AE5),4),IF($AE$1=\"Hornets\",OFFSET(Hornets!$L$2,ROW($AE5),4),IF($AE$1=\"Wolves\",OFFSET(Wolves!$L$2,ROW($AE5),4),IF($AE$1=\"Comets\",OFFSET(Comets!$L$2,ROW($AE5),4)))))))))","v":"1B"},{"$f":"IF($AE$1=\"Drillers\",OFFSET(Drillers!$L$2,ROW($AE5),5),IF($AE$1=\"Bulls\",OFFSET(Bulls!$L$2,ROW($AE5),5),IF($AE$1=\"Phantoms\",OFFSET(Phantoms!$L$2,ROW($AE5),5),IF($AE$1=\"Gators\",OFFSET(Gators!$L$2,ROW($AE5),5),IF($AE$1=\"Knights\",OFFSET(Knights!$L$2,ROW($AE5),5),IF($AE$1=\"Hornets\",OFFSET(Hornets!$L$2,ROW($AE5),5),IF($AE$1=\"Wolves\",OFFSET(Wolves!$L$2,ROW($AE5),5),IF($AE$1=\"Comets\",OFFSET(Comets!$L$2,ROW($AE5),5)))))))))","v":2},{"$f":"IF($AE$1=\"Drillers\",OFFSET(Drillers!$L$2,ROW($AE5),6),IF($AE$1=\"Bulls\",OFFSET(Bulls!$L$2,ROW($AE5),6),IF($AE$1=\"Phantoms\",OFFSET(Phantoms!$L$2,ROW($AE5),6),IF($AE$1=\"Gators\",OFFSET(Gators!$L$2,ROW($AE5),6),IF($AE$1=\"Knights\",OFFSET(Knights!$L$2,ROW($AE5),6),IF($AE$1=\"Hornets\",OFFSET(Hornets!$L$2,ROW($AE5),6),IF($AE$1=\"Wolves\",OFFSET(Wolves!$L$2,ROW($AE5),6),IF($AE$1=\"Comets\",OFFSET(Comets!$L$2,ROW($AE5),6)))))))))","v":1},{"$f":"IF($AE$1=\"Drillers\",OFFSET(Drillers!$L$2,ROW($AE5),7),IF($AE$1=\"Bulls\",OFFSET(Bulls!$L$2,ROW($AE5),7),IF($AE$1=\"Phantoms\",OFFSET(Phantoms!$L$2,ROW($AE5),7),IF($AE$1=\"Gators\",OFFSET(Gators!$L$2,ROW($AE5),7),IF($AE$1=\"Knights\",OFFSET(Knights!$L$2,ROW($AE5),7),IF($AE$1=\"Hornets\",OFFSET(Hornets!$L$2,ROW($AE5),7),IF($AE$1=\"Wolves\",OFFSET(Wolves!$L$2,ROW($AE5),7),IF($AE$1=\"Comets\",OFFSET(Comets!$L$2,ROW($AE5),7)))))))))","v":1},{"$f":"IF($AE$1=\"Drillers\",OFFSET(Drillers!$L$2,ROW($AE5),8),IF($AE$1=\"Bulls\",OFFSET(Bulls!$L$2,ROW($AE5),8),IF($AE$1=\"Phantoms\",OFFSET(Phantoms!$L$2,ROW($AE5),8),IF($AE$1=\"Gators\",OFFSET(Gators!$L$2,ROW($AE5),8),IF($AE$1=\"Knights\",OFFSET(Knights!$L$2,ROW($AE5),8),IF($AE$1=\"Hornets\",OFFSET(Hornets!$L$2,ROW($AE5),8),IF($AE$1=\"Wolves\",OFFSET(Wolves!$L$2,ROW($AE5),8),IF($AE$1=\"Comets\",OFFSET(Comets!$L$2,ROW($AE5),8)))))))))","v":2},{"$f":"IF($AE$1=\"Drillers\",OFFSET(Drillers!$L$2,ROW($AE5),9),IF($AE$1=\"Bulls\",OFFSET(Bulls!$L$2,ROW($AE5),9),IF($AE$1=\"Phantoms\",OFFSET(Phantoms!$L$2,ROW($AE5),9),IF($AE$1=\"Gators\",OFFSET(Gators!$L$2,ROW($AE5),9),IF($AE$1=\"Knights\",OFFSET(Knights!$L$2,ROW($AE5),9),IF($AE$1=\"Hornets\",OFFSET(Hornets!$L$2,ROW($AE5),9),IF($AE$1=\"Wolves\",OFFSET(Wolves!$L$2,ROW($AE5),9),IF($AE$1=\"Comets\",OFFSET(Comets!$L$2,ROW($AE5),9)))))))))","v":2},{"$f":"IF($AE$1=\"Drillers\",OFFSET(Drillers!$L$2,ROW($AE5),10),IF($AE$1=\"Bulls\",OFFSET(Bulls!$L$2,ROW($AE5),10),IF($AE$1=\"Phantoms\",OFFSET(Phantoms!$L$2,ROW($AE5),10),IF($AE$1=\"Gators\",OFFSET(Gators!$L$2,ROW($AE5),10),IF($AE$1=\"Knights\",OFFSET(Knights!$L$2,ROW($AE5),10),IF($AE$1=\"Hornets\",OFFSET(Hornets!$L$2,ROW($AE5),10),IF($AE$1=\"Wolves\",OFFSET(Wolves!$L$2,ROW($AE5),10),IF($AE$1=\"Comets\",OFFSET(Comets!$L$2,ROW($AE5),10)))))))))","v":3},{"$f":"IF($AE$1=\"Drillers\",OFFSET(Drillers!$L$2,ROW($AE5),11),IF($AE$1=\"Bulls\",OFFSET(Bulls!$L$2,ROW($AE5),11),IF($AE$1=\"Phantoms\",OFFSET(Phantoms!$L$2,ROW($AE5),11),IF($AE$1=\"Gators\",OFFSET(Gators!$L$2,ROW($AE5),11),IF($AE$1=\"Knights\",OFFSET(Knights!$L$2,ROW($AE5),11),IF($AE$1=\"Hornets\",OFFSET(Hornets!$L$2,ROW($AE5),11),IF($AE$1=\"Wolves\",OFFSET(Wolves!$L$2,ROW($AE5),11),IF($AE$1=\"Comets\",OFFSET(Comets!$L$2,ROW($AE5),11)))))))))","v":2},{"$f":"IF($AE$1=\"Drillers\",OFFSET(Drillers!$L$2,ROW($AE5),12),IF($AE$1=\"Bulls\",OFFSET(Bulls!$L$2,ROW($AE5),12),IF($AE$1=\"Phantoms\",OFFSET(Phantoms!$L$2,ROW($AE5),12),IF($AE$1=\"Gators\",OFFSET(Gators!$L$2,ROW($AE5),12),IF($AE$1=\"Knights\",OFFSET(Knights!$L$2,ROW($AE5),12),IF($AE$1=\"Hornets\",OFFSET(Hornets!$L$2,ROW($AE5),12),IF($AE$1=\"Wolves\",OFFSET(Wolves!$L$2,ROW($AE5),12),IF($AE$1=\"Comets\",OFFSET(Comets!$L$2,ROW($AE5),12)))))))))","v":"3B"},{"$f":"IF($AE$1=\"Drillers\",OFFSET(Drillers!$L$2,ROW($AE5),13),IF($AE$1=\"Bulls\",OFFSET(Bulls!$L$2,ROW($AE5),13),IF($AE$1=\"Phantoms\",OFFSET(Phantoms!$L$2,ROW($AE5),13),IF($AE$1=\"Gators\",OFFSET(Gators!$L$2,ROW($AE5),13),IF($AE$1=\"Knights\",OFFSET(Knights!$L$2,ROW($AE5),13),IF($AE$1=\"Hornets\",OFFSET(Hornets!$L$2,ROW($AE5),13),IF($AE$1=\"Wolves\",OFFSET(Wolves!$L$2,ROW($AE5),13),IF($AE$1=\"Comets\",OFFSET(Comets!$L$2,ROW($AE5),13)))))))))","v":0},{"$f":"IF($AE$1=\"Drillers\",OFFSET(Drillers!$L$2,ROW($AE5),14),IF($AE$1=\"Bulls\",OFFSET(Bulls!$L$2,ROW($AE5),14),IF($AE$1=\"Phantoms\",OFFSET(Phantoms!$L$2,ROW($AE5),14),IF($AE$1=\"Gators\",OFFSET(Gators!$L$2,ROW($AE5),14),IF($AE$1=\"Knights\",OFFSET(Knights!$L$2,ROW($AE5),14),IF($AE$1=\"Hornets\",OFFSET(Hornets!$L$2,ROW($AE5),14),IF($AE$1=\"Wolves\",OFFSET(Wolves!$L$2,ROW($AE5),14),IF($AE$1=\"Comets\",OFFSET(Comets!$L$2,ROW($AE5),14)))))))))","v":1},{"$f":"IF(AE$1=\"Drillers\",OFFSET(Drillers!$L$2,ROW(AE5),15),IF(AE$1=\"Bulls\",OFFSET(Bulls!$L$2,ROW(AE5),15),IF(AE$1=\"Phantoms\",OFFSET(Phantoms!$L$2,ROW(AE5),15),IF(AE$1=\"Gators\",OFFSET(Gators!$L$2,ROW(AE5),15),IF(AE$1=\"Knights\",OFFSET(Knights!$L$2,ROW(AE5),15),IF(AE$1=\"Hornets\",OFFSET(Hornets!$L$2,ROW(AE5),15),IF(AE$1=\"Wolves\",OFFSET(Wolves!$L$2,ROW(AE5),15),IF(AE$1=\"Comets\",OFFSET(Comets!$L$2,ROW(AE5),15)))))))))","v":0},{"$f":"IF($AE$1=\"Drillers\",OFFSET(Drillers!$L$2,ROW(AE5),16),IF($AE$1=\"Bulls\",OFFSET(Bulls!$L$2,ROW(AE5),16),IF($AE$1=\"Phantoms\",OFFSET(Phantoms!$L$2,ROW(AE5),16),IF($AE$1=\"Gators\",OFFSET(Gators!$L$2,ROW(AE5),16),IF($AE$1=\"Knights\",OFFSET(Knights!$L$2,ROW(AE5),16),IF($AE$1=\"Hornets\",OFFSET(Hornets!$L$2,ROW(AE5),16),IF($AE$1=\"Wolves\",OFFSET(Wolves!$L$2,ROW(AE5),16),IF($AE$1=\"Comets\",OFFSET(Comets!$L$2,ROW(AE5),16)))))))))","v":0},{"$f":"IF($AE$1=\"Drillers\",OFFSET(Drillers!$L$2,ROW($AE5),17),IF($AE$1=\"Bulls\",OFFSET(Bulls!$L$2,ROW($AE5),17),IF($AE$1=\"Phantoms\",OFFSET(Phantoms!$L$2,ROW($AE5),17),IF($AE$1=\"Gators\",OFFSET(Gators!$L$2,ROW($AE5),17),IF($AE$1=\"Knights\",OFFSET(Knights!$L$2,ROW($AE5),17),IF($AE$1=\"Hornets\",OFFSET(Hornets!$L$2,ROW($AE5),17),IF($AE$1=\"Wolves\",OFFSET(Wolves!$L$2,ROW($AE5),17),IF($AE$1=\"Comets\",OFFSET(Comets!$L$2,ROW($AE5),17)))))))))","v":5},{"$nulls":5},7,"Wolves",{"$nulls":18},9]
[{"$nulls":4},6,{"$f":"IF($F$1=\"Drillers\",OFFSET(Drillers!$L$2,ROW($F6),1),IF($F$1=\"Bulls\",OFFSET(Bulls!$L$2,ROW($F6),1),IF($F$1=\"Phantoms\",OFFSET(Phantoms!$L$2,ROW($F6),1),IF($F$1=\"Gators\",OFFSET(Gators!$L$2,ROW($F6),1),IF($F$1=\"Knights\",OFFSET(Knights!$L$2,ROW($F6),1),IF($F$1=\"Hornets\",OFFSET(Hornets!$L$2,ROW($F6),1),IF($F$1=\"Reds\",OFFSET(Comets!$L$2,ROW($F6),1),IF($F$1=\"Guardians\",OFFSET(Wolves!$L$2,ROW($F6),1)))))))))","v":"Clark"},{"$f":"IF($F$1=\"Drillers\",OFFSET(Drillers!$L$2,ROW($F6),2),IF($F$1=\"Bulls\",OFFSET(Bulls!$L$2,ROW($F6),2),IF($F$1=\"Phantoms\",OFFSET(Phantoms!$L$2,ROW($F6),2),IF($F$1=\"Gators\",OFFSET(Gators!$L$2,ROW($F6),2),IF($F$1=\"Knights\",OFFSET(Knights!$L$2,ROW($F6),2),IF($F$1=\"Hornets\",OFFSET(Hornets!$L$2,ROW($F6),2),IF($F$1=\"Reds\",OFFSET(Comets!$L$2,ROW($F6),2),IF($F$1=\"Guardians\",OFFSET(Wolves!$L$2,ROW($F6),2)))))))))","v":"Randy"},{"$f":"IF($F$1=\"Drillers\",OFFSET(Drillers!$L$2,ROW($F6),3),IF($F$1=\"Bulls\",OFFSET(Bulls!$L$2,ROW($F6),3),IF($F$1=\"Phantoms\",OFFSET(Phantoms!$L$2,ROW($F6),3),IF($F$1=\"Gators\",OFFSET(Gators!$L$2,ROW($F6),3),IF($F$1=\"Knights\",OFFSET(Knights!$L$2,ROW($F6),3),IF($F$1=\"Hornets\",OFFSET(Hornets!$L$2,ROW($F6),3),IF($F$1=\"Guardians\",OFFSET(Wolves!$L$2,ROW($F6),3),IF($F$1=\"Reds\",OFFSET(Comets!$L$2,ROW($F6),3)))))))))","v":"R"},{"$f":"IF($F$1=\"Drillers\",OFFSET(Drillers!$L$2,ROW($F6),4),IF($F$1=\"Bulls\",OFFSET(Bulls!$L$2,ROW($F6),4),IF($F$1=\"Phantoms\",OFFSET(Phantoms!$L$2,ROW($F6),4),IF($F$1=\"Gators\",OFFSET(Gators!$L$2,ROW($F6),4),IF($F$1=\"Knights\",OFFSET(Knights!$L$2,ROW($F6),4),IF($F$1=\"Hornets\",OFFSET(Hornets!$L$2,ROW($F6),4),IF($F$1=\"Guardians\",OFFSET(Wolves!$L$2,ROW($F6),4),IF($F$1=\"Reds\",OFFSET(Comets!$L$2,ROW($F6),4)))))))))","v":"1B"},{"$f":"IF($F$1=\"Drillers\",OFFSET(Drillers!$L$2,ROW($F6),5),IF($F$1=\"Bulls\",OFFSET(Bulls!$L$2,ROW($F6),5),IF($F$1=\"Phantoms\",OFFSET(Phantoms!$L$2,ROW($F6),5),IF($F$1=\"Gators\",OFFSET(Gators!$L$2,ROW($F6),5),IF($F$1=\"Knights\",OFFSET(Knights!$L$2,ROW($F6),5),IF($F$1=\"Hornets\",OFFSET(Hornets!$L$2,ROW($F6),5),IF($F$1=\"Guardians\",OFFSET(Wolves!$L$2,ROW($F6),5),IF($F$1=\"Reds\",OFFSET(Comets!$L$2,ROW($F6),5)))))))))","v":3},{"$f":"IF($F$1=\"Drillers\",OFFSET(Drillers!$L$2,ROW($F6),6),IF($F$1=\"Bulls\",OFFSET(Bulls!$L$2,ROW($F6),6),IF($F$1=\"Phantoms\",OFFSET(Phantoms!$L$2,ROW($F6),6),IF($F$1=\"Gators\",OFFSET(Gators!$L$2,ROW($F6),6),IF($F$1=\"Knights\",OFFSET(Knights!$L$2,ROW($F6),6),IF($F$1=\"Hornets\",OFFSET(Hornets!$L$2,ROW($F6),6),IF($F$1=\"Guardians\",OFFSET(Wolves!$L$2,ROW($F6),6),IF($F$1=\"Reds\",OFFSET(Comets!$L$2,ROW($F6),6)))))))))","v":3},{"$f":"IF($F$1=\"Drillers\",OFFSET(Drillers!$L$2,ROW(F6),7),IF($F$1=\"Bulls\",OFFSET(Bulls!$L$2,ROW(F6),7),IF($F$1=\"Phantoms\",OFFSET(Phantoms!$L$2,ROW(F6),7),IF($F$1=\"Gators\",OFFSET(Gators!$L$2,ROW(F6),7),IF($F$1=\"Knights\",OFFSET(Knights!$L$2,ROW(F6),7),IF($F$1=\"Hornets\",OFFSET(Hornets!$L$2,ROW(F6),7),IF($F$1=\"Guardians\",OFFSET(Wolves!$L$2,ROW(F6),7),IF($F$1=\"Reds\",OFFSET(Comets!$L$2,ROW(F6),7),))))))))","v":2},{"$f":"IF($F$1=\"Drillers\",OFFSET(Drillers!$L$2,ROW(F6),8),IF($F$1=\"Bulls\",OFFSET(Bulls!$L$2,ROW(F6),8),IF($F$1=\"Phantoms\",OFFSET(Phantoms!$L$2,ROW(F6),8),IF($F$1=\"Gators\",OFFSET(Gators!$L$2,ROW(F6),8),IF($F$1=\"Knights\",OFFSET(Knights!$L$2,ROW(F6),8),IF($F$1=\"Hornets\",OFFSET(Hornets!$L$2,ROW(F6),8),IF($F$1=\"Guardians\",OFFSET(Wolves!$L$2,ROW(F6),8),IF($F$1=\"Reds\",OFFSET(Comets!$L$2,ROW(F6),8)))))))))","v":2},{"$f":"IF($F$1=\"Drillers\",OFFSET(Drillers!$L$2,ROW($F6),9),IF($F$1=\"Bulls\",OFFSET(Bulls!$L$2,ROW($F6),9),IF($F$1=\"Phantoms\",OFFSET(Phantoms!$L$2,ROW($F6),9),IF($F$1=\"Gators\",OFFSET(Gators!$L$2,ROW($F6),9),IF($F$1=\"Knights\",OFFSET(Knights!$L$2,ROW($F6),9),IF($F$1=\"Hornets\",OFFSET(Hornets!$L$2,ROW(F6),9),IF($F$1=\"Guardians\",OFFSET(Wolves!$L$2,ROW($F6),9),IF($F$1=\"Reds\",OFFSET(Comets!$L$2,ROW($F6),9)))))))))","v":2},{"$f":"IF($F$1=\"Drillers\",OFFSET(Drillers!$L$2,ROW(F6),10),IF($F$1=\"Bulls\",OFFSET(Bulls!$L$2,ROW(F6),10),IF($F$1=\"Phantoms\",OFFSET(Phantoms!$L$2,ROW(F6),10),IF($F$1=\"Gators\",OFFSET(Gators!$L$2,ROW(F6),10),IF($F$1=\"Knights\",OFFSET(Knights!$L$2,ROW(F6),10),IF($F$1=\"Hornets\",OFFSET(Hornets!$L$2,ROW(F6),10),IF($F$1=\"Guardians\",OFFSET(Wolves!$L$2,ROW(F6),10),IF($F$1=\"Reds\",OFFSET(Comets!$L$2,ROW(F6),10)))))))))","v":5},{"$f":"IF($F$1=\"Drillers\",OFFSET(Drillers!$L$2,ROW(F6),11),IF($F$1=\"Bulls\",OFFSET(Bulls!$L$2,ROW(F6),11),IF($F$1=\"Phantoms\",OFFSET(Phantoms!$L$2,ROW(F6),11),IF($F$1=\"Gators\",OFFSET(Gators!$L$2,ROW(F6),11),IF($F$1=\"Knights\",OFFSET(Knights!$L$2,ROW(F6),11),IF($F$1=\"Hornets\",OFFSET(Hornets!$L$2,ROW(F6),11),IF($F$1=\"Guardians\",OFFSET(Wolves!$L$2,ROW(F6),11),IF($F$1=\"Drillers\",OFFSET(Drillers!$L$2,ROW(F6),11),IF($F$1=\"Reds\",OFFSET(Comets!$L$2,ROW(F6),11))))))))))","v":2},{"$f":"IF($F$1=\"Drillers\",OFFSET(Drillers!$L$2,ROW(F6),12),IF($F$1=\"Bulls\",OFFSET(Bulls!$L$2,ROW(F6),12),IF($F$1=\"Phantoms\",OFFSET(Phantoms!$L$2,ROW(F6),12),IF($F$1=\"Gators\",OFFSET(Gators!$L$2,ROW(F6),12),IF($F$1=\"Knights\",OFFSET(Knights!$L$2,ROW(F6),12),IF($F$1=\"Hornets\",OFFSET(Hornets!$L$2,ROW(F6),12),IF($F$1=\"Guardians\",OFFSET(Wolves!$L$2,ROW(F6),12),IF($F$1=\"Reds\",OFFSET(Comets!$L$2,ROW(F6),12),))))))))","v":"3B"},{"$f":"IF($F$1=\"Drillers\",OFFSET(Drillers!$L$2,ROW(F6),13),IF($F$1=\"Bulls\",OFFSET(Bulls!$L$2,ROW(F6),13),IF($F$1=\"Phantoms\",OFFSET(Phantoms!$L$2,ROW(F6),13),IF($F$1=\"Gators\",OFFSET(Gators!$L$2,ROW(F6),13),IF($F$1=\"Knights\",OFFSET(Knights!$L$2,ROW(F6),13),IF($F$1=\"Hornets\",OFFSET(Hornets!$L$2,ROW(F6),13),IF($F$1=\"Guardians\",OFFSET(Wolves!$L$2,ROW(F6),13),IF($F$1=\"Reds\",OFFSET(Comets!$L$2,ROW(F6),13),))))))))","v":0},{"$f":"IF($F$1=\"Drillers\",OFFSET(Drillers!$L$2,ROW(F6),14),IF($F$1=\"Bulls\",OFFSET(Bulls!$L$2,ROW(F6),14),IF($F$1=\"Phantoms\",OFFSET(Phantoms!$L$2,ROW(F6),14),IF($F$1=\"Gators\",OFFSET(Gators!$L$2,ROW(F6),14),IF($F$1=\"Knights\",OFFSET(Knights!$L$2,ROW(F6),14),IF($F$1=\"Hornets\",OFFSET(Hornets!$L$2,ROW(F6),14),IF($F$1=\"Guardians\",OFFSET(Wolves!$L$2,ROW(F6),14,),IF($F$1=\"Reds\",OFFSET(Comets!$L$2,ROW(F6),14)))))))))","v":1},{"$f":"IF($F$1=\"Drillers\",OFFSET(Drillers!$L$2,ROW(F6),15),IF($F$1=\"Bulls\",OFFSET(Bulls!$L$2,ROW(F6),15),IF($F$1=\"Phantoms\",OFFSET(Phantoms!$L$2,ROW(F6),15),IF($F$1=\"Gators\",OFFSET(Gators!$L$2,ROW(F6),15),IF($F$1=\"Knights\",OFFSET(Knights!$L$2,ROW(F6),15),IF($F$1=\"Hornets\",OFFSET(Hornets!$L$2,ROW(F6),15),IF($F$1=\"Guardians\",OFFSET(Wolves!$L$2,ROW(F6),15),IF($F$1=\"Reds\",OFFSET(Comets!$L$2,ROW(F6),15)))))))))","v":0},{"$f":"IF($F$1=\"Drillers\",OFFSET(Drillers!$L$2,ROW(F6),16),IF($F$1=\"Bulls\",OFFSET(Bulls!$L$2,ROW(F6),16),IF($F$1=\"Phantoms\",OFFSET(Phantoms!$L$2,ROW(F6),16),IF($F$1=\"Gators\",OFFSET(Gators!$L$2,ROW(F6),16),IF($F$1=\"Knights\",OFFSET(Knights!$L$2,ROW(F6),16),IF($F$1=\"Hornets\",OFFSET(Hornets!$L$2,ROW(F6),16),IF($F$1=\"Guardians\",OFFSET(Wolves!$L$2,ROW(F6),16),IF($F$1=\"Reds\",OFFSET(Comets!$L$2,ROW(F6),16)))))))))","v":0},{"$f":"IF($F$1=\"Drillers\",OFFSET(Drillers!$L$2,ROW($F6),17),IF($F$1=\"Bulls\",OFFSET(Bulls!$L$2,ROW($F6),17),IF($F$1=\"Phantoms\",OFFSET(Phantoms!$L$2,ROW($F6),17),IF($F$1=\"Gators\",OFFSET(Gators!$L$2,ROW($F6),17),IF($F$1=\"Knights\",OFFSET(Knights!$L$2,ROW($F6),17),IF($F$1=\"Hornets\",OFFSET(Hornets!$L$2,ROW($F6),17),IF($F$1=\"Guardians\",OFFSET(Wolves!$L$2,ROW($F6),17),IF($F$1=\"Reds\",OFFSET(Comets!$L$2,ROW($F6),17)))))))))","v":3},{"$nulls":7},6,{"$f":"IF($AE$1=\"Drillers\",OFFSET(Drillers!$L$2,ROW($AE6),1),IF($AE$1=\"Bulls\",OFFSET(Bulls!$L$2,ROW($AE6),1),IF($AE$1=\"Phantoms\",OFFSET(Phantoms!$L$2,ROW($AE6),1),IF($AE$1=\"Gators\",OFFSET(Gators!$L$2,ROW($AE6),1),IF($AE$1=\"Knights\",OFFSET(Knights!$L$2,ROW($AE6),1),IF($AE$1=\"Hornets\",OFFSET(Hornets!$L$2,ROW($AE6),1),IF($AE$1=\"Wolves\",OFFSET(Wolves!$L$2,ROW($AE6),1),IF(AE$1=\"Comets\",OFFSET(Comets!$L$2,ROW($AE6),1)))))))))","v":"Callaway"},{"$f":"IF($AE$1=\"Drillers\",OFFSET(Drillers!$L$2,ROW($AF6),2),IF($AE$1=\"Bulls\",OFFSET(Bulls!$L$2,ROW($AF6),2),IF($AE$1=\"Phantoms\",OFFSET(Phantoms!$L$2,ROW($AF6),2),IF($AE$1=\"Gators\",OFFSET(Gators!$L$2,ROW($AF6),2),IF($AE$1=\"Knights\",OFFSET(Knights!$L$2,ROW($AF6),2),IF($AE$1=\"Hornets\",OFFSET(Hornets!$L$2,ROW($AF6),2),IF($AE$1=\"Wolves\",OFFSET(Wolves!$L$2,ROW($AF6),2),IF($AE$1=\"Comets\",OFFSET(Comets!$L$2,ROW($AF6),2)))))))))","v":"Daniel"},{"$f":"IF($AE$1=\"Drillers\",OFFSET(Drillers!$L$2,ROW($AE6),3),IF($AE$1=\"Bulls\",OFFSET(Bulls!$L$2,ROW($AE6),3),IF($AE$1=\"Phantoms\",OFFSET(Phantoms!$L$2,ROW($AE6),3),IF($AE$1=\"Gators\",OFFSET(Gators!$L$2,ROW($AE6),3),IF($AE$1=\"Knights\",OFFSET(Knights!$L$2,ROW($AE6),3),IF($AE$1=\"Hornets\",OFFSET(Hornets!$L$2,ROW($AE6),3),IF($AE$1=\"Wolves\",OFFSET(Wolves!$L$2,ROW($AE6),3),IF($AE$1=\"Comets\",OFFSET(Comets!$L$2,ROW($AE6),3)))))))))","v":"B"},{"$f":"IF($AE$1=\"Drillers\",OFFSET(Drillers!$L$2,ROW($AE6),4),IF($AE$1=\"Bulls\",OFFSET(Bulls!$L$2,ROW($AE6),4),IF($AE$1=\"Phantoms\",OFFSET(Phantoms!$L$2,ROW($AE6),4),IF($AE$1=\"Gators\",OFFSET(Gators!$L$2,ROW($AE6),4),IF($AE$1=\"Knights\",OFFSET(Knights!$L$2,ROW($AE6),4),IF($AE$1=\"Hornets\",OFFSET(Hornets!$L$2,ROW($AE6),4),IF($AE$1=\"Wolves\",OFFSET(Wolves!$L$2,ROW($AE6),4),IF($AE$1=\"Comets\",OFFSET(Comets!$L$2,ROW($AE6),4)))))))))","v":"CF"},{"$f":"IF($AE$1=\"Drillers\",OFFSET(Drillers!$L$2,ROW($AE6),5),IF($AE$1=\"Bulls\",OFFSET(Bulls!$L$2,ROW($AE6),5),IF($AE$1=\"Phantoms\",OFFSET(Phantoms!$L$2,ROW($AE6),5),IF($AE$1=\"Gators\",OFFSET(Gators!$L$2,ROW($AE6),5),IF($AE$1=\"Knights\",OFFSET(Knights!$L$2,ROW($AE6),5),IF($AE$1=\"Hornets\",OFFSET(Hornets!$L$2,ROW($AE6),5),IF($AE$1=\"Wolves\",OFFSET(Wolves!$L$2,ROW($AE6),5),IF($AE$1=\"Comets\",OFFSET(Comets!$L$2,ROW($AE6),5)))))))))","v":4},{"$f":"IF($AE$1=\"Drillers\",OFFSET(Drillers!$L$2,ROW($AE6),6),IF($AE$1=\"Bulls\",OFFSET(Bulls!$L$2,ROW($AE6),6),IF($AE$1=\"Phantoms\",OFFSET(Phantoms!$L$2,ROW($AE6),6),IF($AE$1=\"Gators\",OFFSET(Gators!$L$2,ROW($AE6),6),IF($AE$1=\"Knights\",OFFSET(Knights!$L$2,ROW($AE6),6),IF($AE$1=\"Hornets\",OFFSET(Hornets!$L$2,ROW($AE6),6),IF($AE$1=\"Wolves\",OFFSET(Wolves!$L$2,ROW($AE6),6),IF($AE$1=\"Comets\",OFFSET(Comets!$L$2,ROW($AE6),6)))))))))","v":3},{"$f":"IF($AE$1=\"Drillers\",OFFSET(Drillers!$L$2,ROW($AE6),7),IF($AE$1=\"Bulls\",OFFSET(Bulls!$L$2,ROW($AE6),7),IF($AE$1=\"Phantoms\",OFFSET(Phantoms!$L$2,ROW($AE6),7),IF($AE$1=\"Gators\",OFFSET(Gators!$L$2,ROW($AE6),7),IF($AE$1=\"Knights\",OFFSET(Knights!$L$2,ROW($AE6),7),IF($AE$1=\"Hornets\",OFFSET(Hornets!$L$2,ROW($AE6),7),IF($AE$1=\"Wolves\",OFFSET(Wolves!$L$2,ROW($AE6),7),IF($AE$1=\"Comets\",OFFSET(Comets!$L$2,ROW($AE6),7)))))))))","v":5},{"$f":"IF($AE$1=\"Drillers\",OFFSET(Drillers!$L$2,ROW($AE6),8),IF($AE$1=\"Bulls\",OFFSET(Bulls!$L$2,ROW($AE6),8),IF($AE$1=\"Phantoms\",OFFSET(Phantoms!$L$2,ROW($AE6),8),IF($AE$1=\"Gators\",OFFSET(Gators!$L$2,ROW($AE6),8),IF($AE$1=\"Knights\",OFFSET(Knights!$L$2,ROW($AE6),8),IF($AE$1=\"Hornets\",OFFSET(Hornets!$L$2,ROW($AE6),8),IF($AE$1=\"Wolves\",OFFSET(Wolves!$L$2,ROW($AE6),8),IF($AE$1=\"Comets\",OFFSET(Comets!$L$2,ROW($AE6),8)))))))))","v":4},{"$f":"IF($AE$1=\"Drillers\",OFFSET(Drillers!$L$2,ROW($AE6),9),IF($AE$1=\"Bulls\",OFFSET(Bulls!$L$2,ROW($AE6),9),IF($AE$1=\"Phantoms\",OFFSET(Phantoms!$L$2,ROW($AE6),9),IF($AE$1=\"Gators\",OFFSET(Gators!$L$2,ROW($AE6),9),IF($AE$1=\"Knights\",OFFSET(Knights!$L$2,ROW($AE6),9),IF($AE$1=\"Hornets\",OFFSET(Hornets!$L$2,ROW($AE6),9),IF($AE$1=\"Wolves\",OFFSET(Wolves!$L$2,ROW($AE6),9),IF($AE$1=\"Comets\",OFFSET(Comets!$L$2,ROW($AE6),9)))))))))","v":4},{"$f":"IF($AE$1=\"Drillers\",OFFSET(Drillers!$L$2,ROW($AE6),10),IF($AE$1=\"Bulls\",OFFSET(Bulls!$L$2,ROW($AE6),10),IF($AE$1=\"Phantoms\",OFFSET(Phantoms!$L$2,ROW($AE6),10),IF($AE$1=\"Gators\",OFFSET(Gators!$L$2,ROW($AE6),10),IF($AE$1=\"Knights\",OFFSET(Knights!$L$2,ROW($AE6),10),IF($AE$1=\"Hornets\",OFFSET(Hornets!$L$2,ROW($AE6),10),IF($AE$1=\"Wolves\",OFFSET(Wolves!$L$2,ROW($AE6),10),IF($AE$1=\"Comets\",OFFSET(Comets!$L$2,ROW($AE6),10)))))))))","v":5},{"$f":"IF($AE$1=\"Drillers\",OFFSET(Drillers!$L$2,ROW($AE6),11),IF($AE$1=\"Bulls\",OFFSET(Bulls!$L$2,ROW($AE6),11),IF($AE$1=\"Phantoms\",OFFSET(Phantoms!$L$2,ROW($AE6),11),IF($AE$1=\"Gators\",OFFSET(Gators!$L$2,ROW($AE6),11),IF($AE$1=\"Knights\",OFFSET(Knights!$L$2,ROW($AE6),11),IF($AE$1=\"Hornets\",OFFSET(Hornets!$L$2,ROW($AE6),11),IF($AE$1=\"Wolves\",OFFSET(Wolves!$L$2,ROW($AE6),11),IF($AE$1=\"Comets\",OFFSET(Comets!$L$2,ROW($AE6),11)))))))))","v":4},{"$f":"IF($AE$1=\"Drillers\",OFFSET(Drillers!$L$2,ROW($AE6),12),IF($AE$1=\"Bulls\",OFFSET(Bulls!$L$2,ROW($AE6),12),IF($AE$1=\"Phantoms\",OFFSET(Phantoms!$L$2,ROW($AE6),12),IF($AE$1=\"Gators\",OFFSET(Gators!$L$2,ROW($AE6),12),IF($AE$1=\"Knights\",OFFSET(Knights!$L$2,ROW($AE6),12),IF($AE$1=\"Hornets\",OFFSET(Hornets!$L$2,ROW($AE6),12),IF($AE$1=\"Wolves\",OFFSET(Wolves!$L$2,ROW($AE6),12),IF($AE$1=\"Comets\",OFFSET(Comets!$L$2,ROW($AE6),12)))))))))","v":"LF"},{"$f":"IF($AE$1=\"Drillers\",OFFSET(Drillers!$L$2,ROW($AE6),13),IF($AE$1=\"Bulls\",OFFSET(Bulls!$L$2,ROW($AE6),13),IF($AE$1=\"Phantoms\",OFFSET(Phantoms!$L$2,ROW($AE6),13),IF($AE$1=\"Gators\",OFFSET(Gators!$L$2,ROW($AE6),13),IF($AE$1=\"Knights\",OFFSET(Knights!$L$2,ROW($AE6),13),IF($AE$1=\"Hornets\",OFFSET(Hornets!$L$2,ROW($AE6),13),IF($AE$1=\"Wolves\",OFFSET(Wolves!$L$2,ROW($AE6),13),IF($AE$1=\"Comets\",OFFSET(Comets!$L$2,ROW($AE6),13)))))))))","v":"RF"},{"$f":"IF($AE$1=\"Drillers\",OFFSET(Drillers!$L$2,ROW($AE6),14),IF($AE$1=\"Bulls\",OFFSET(Bulls!$L$2,ROW($AE6),14),IF($AE$1=\"Phantoms\",OFFSET(Phantoms!$L$2,ROW($AE6),14),IF($AE$1=\"Gators\",OFFSET(Gators!$L$2,ROW($AE6),14),IF($AE$1=\"Knights\",OFFSET(Knights!$L$2,ROW($AE6),14),IF($AE$1=\"Hornets\",OFFSET(Hornets!$L$2,ROW($AE6),14),IF($AE$1=\"Wolves\",OFFSET(Wolves!$L$2,ROW($AE6),14),IF($AE$1=\"Comets\",OFFSET(Comets!$L$2,ROW($AE6),14)))))))))","v":3},{"$f":"IF(AE$1=\"Drillers\",OFFSET(Drillers!$L$2,ROW(AE6),15),IF(AE$1=\"Bulls\",OFFSET(Bulls!$L$2,ROW(AE6),15),IF(AE$1=\"Phantoms\",OFFSET(Phantoms!$L$2,ROW(AE6),15),IF(AE$1=\"Gators\",OFFSET(Gators!$L$2,ROW(AE6),15),IF(AE$1=\"Knights\",OFFSET(Knights!$L$2,ROW(AE6),15),IF(AE$1=\"Hornets\",OFFSET(Hornets!$L$2,ROW(AE6),15),IF(AE$1=\"Wolves\",OFFSET(Wolves!$L$2,ROW(AE6),15),IF(AE$1=\"Comets\",OFFSET(Comets!$L$2,ROW(AE6),15)))))))))","v":0},{"$f":"IF($AE$1=\"Drillers\",OFFSET(Drillers!$L$2,ROW(AE6),16),IF($AE$1=\"Bulls\",OFFSET(Bulls!$L$2,ROW(AE6),16),IF($AE$1=\"Phantoms\",OFFSET(Phantoms!$L$2,ROW(AE6),16),IF($AE$1=\"Gators\",OFFSET(Gators!$L$2,ROW(AE6),16),IF($AE$1=\"Knights\",OFFSET(Knights!$L$2,ROW(AE6),16),IF($AE$1=\"Hornets\",OFFSET(Hornets!$L$2,ROW(AE6),16),IF($AE$1=\"Wolves\",OFFSET(Wolves!$L$2,ROW(AE6),16),IF($AE$1=\"Comets\",OFFSET(Comets!$L$2,ROW(AE6),16)))))))))","v":0},{"$f":"IF($AE$1=\"Drillers\",OFFSET(Drillers!$L$2,ROW($AE6),17),IF($AE$1=\"Bulls\",OFFSET(Bulls!$L$2,ROW($AE6),17),IF($AE$1=\"Phantoms\",OFFSET(Phantoms!$L$2,ROW($AE6),17),IF($AE$1=\"Gators\",OFFSET(Gators!$L$2,ROW($AE6),17),IF($AE$1=\"Knights\",OFFSET(Knights!$L$2,ROW($AE6),17),IF($AE$1=\"Hornets\",OFFSET(Hornets!$L$2,ROW($AE6),17),IF($AE$1=\"Wolves\",OFFSET(Wolves!$L$2,ROW($AE6),17),IF($AE$1=\"Comets\",OFFSET(Comets!$L$2,ROW($AE6),17)))))))))","v":3},{"$nulls":5},8,"Comets",{"$nulls":18},10]
[{"$nulls":4},7,{"$f":"IF($F$1=\"Drillers\",OFFSET(Drillers!$L$2,ROW($F7),1),IF($F$1=\"Bulls\",OFFSET(Bulls!$L$2,ROW($F7),1),IF($F$1=\"Phantoms\",OFFSET(Phantoms!$L$2,ROW($F7),1),IF($F$1=\"Gators\",OFFSET(Gators!$L$2,ROW($F7),1),IF($F$1=\"Knights\",OFFSET(Knights!$L$2,ROW($F7),1),IF($F$1=\"Hornets\",OFFSET(Hornets!$L$2,ROW($F7),1),IF($F$1=\"Reds\",OFFSET(Comets!$L$2,ROW($F7),1),IF($F$1=\"Guardians\",OFFSET(Wolves!$L$2,ROW($F7),1)))))))))","v":"Gomez"},{"$f":"IF($F$1=\"Drillers\",OFFSET(Drillers!$L$2,ROW($F7),2),IF($F$1=\"Bulls\",OFFSET(Bulls!$L$2,ROW($F7),2),IF($F$1=\"Phantoms\",OFFSET(Phantoms!$L$2,ROW($F7),2),IF($F$1=\"Gators\",OFFSET(Gators!$L$2,ROW($F7),2),IF($F$1=\"Knights\",OFFSET(Knights!$L$2,ROW($F7),2),IF($F$1=\"Hornets\",OFFSET(Hornets!$L$2,ROW($F7),2),IF($F$1=\"Reds\",OFFSET(Comets!$L$2,ROW($F7),2),IF($F$1=\"Guardians\",OFFSET(Wolves!$L$2,ROW($F7),2)))))))))","v":"Augusto"},{"$f":"IF($F$1=\"Drillers\",OFFSET(Drillers!$L$2,ROW($F7),3),IF($F$1=\"Bulls\",OFFSET(Bulls!$L$2,ROW($F7),3),IF($F$1=\"Phantoms\",OFFSET(Phantoms!$L$2,ROW($F7),3),IF($F$1=\"Gators\",OFFSET(Gators!$L$2,ROW($F7),3),IF($F$1=\"Knights\",OFFSET(Knights!$L$2,ROW($F7),3),IF($F$1=\"Hornets\",OFFSET(Hornets!$L$2,ROW($F7),3),IF($F$1=\"Guardians\",OFFSET(Wolves!$L$2,ROW($F7),3),IF($F$1=\"Reds\",OFFSET(Comets!$L$2,ROW($F7),3)))))))))","v":"B"},{"$f":"IF($F$1=\"Drillers\",OFFSET(Drillers!$L$2,ROW($F7),4),IF($F$1=\"Bulls\",OFFSET(Bulls!$L$2,ROW($F7),4),IF($F$1=\"Phantoms\",OFFSET(Phantoms!$L$2,ROW($F7),4),IF($F$1=\"Gators\",OFFSET(Gators!$L$2,ROW($F7),4),IF($F$1=\"Knights\",OFFSET(Knights!$L$2,ROW($F7),4),IF($F$1=\"Hornets\",OFFSET(Hornets!$L$2,ROW($F7),4),IF($F$1=\"Guardians\",OFFSET(Wolves!$L$2,ROW($F7),4),IF($F$1=\"Reds\",OFFSET(Comets!$L$2,ROW($F7),4)))))))))","v":"3B"},{"$f":"IF($F$1=\"Drillers\",OFFSET(Drillers!$L$2,ROW($F7),5),IF($F$1=\"Bulls\",OFFSET(Bulls!$L$2,ROW($F7),5),IF($F$1=\"Phantoms\",OFFSET(Phantoms!$L$2,ROW($F7),5),IF($F$1=\"Gators\",OFFSET(Gators!$L$2,ROW($F7),5),IF($F$1=\"Knights\",OFFSET(Knights!$L$2,ROW($F7),5),IF($F$1=\"Hornets\",OFFSET(Hornets!$L$2,ROW($F7),5),IF($F$1=\"Guardians\",OFFSET(Wolves!$L$2,ROW($F7),5),IF($F$1=\"Reds\",OFFSET(Comets!$L$2,ROW($F7),5)))))))))","v":3},{"$f":"IF($F$1=\"Drillers\",OFFSET(Drillers!$L$2,ROW($F7),6),IF($F$1=\"Bulls\",OFFSET(Bulls!$L$2,ROW($F7),6),IF($F$1=\"Phantoms\",OFFSET(Phantoms!$L$2,ROW($F7),6),IF($F$1=\"Gators\",OFFSET(Gators!$L$2,ROW($F7),6),IF($F$1=\"Knights\",OFFSET(Knights!$L$2,ROW($F7),6),IF($F$1=\"Hornets\",OFFSET(Hornets!$L$2,ROW($F7),6),IF($F$1=\"Guardians\",OFFSET(Wolves!$L$2,ROW($F7),6),IF($F$1=\"Reds\",OFFSET(Comets!$L$2,ROW($F7),6)))))))))","v":3},{"$f":"IF($F$1=\"Drillers\",OFFSET(Drillers!$L$2,ROW(F7),7),IF($F$1=\"Bulls\",OFFSET(Bulls!$L$2,ROW(F7),7),IF($F$1=\"Phantoms\",OFFSET(Phantoms!$L$2,ROW(F7),7),IF($F$1=\"Gators\",OFFSET(Gators!$L$2,ROW(F7),7),IF($F$1=\"Knights\",OFFSET(Knights!$L$2,ROW(F7),7),IF($F$1=\"Hornets\",OFFSET(Hornets!$L$2,ROW(F7),7),IF($F$1=\"Guardians\",OFFSET(Wolves!$L$2,ROW(F7),7),IF($F$1=\"Reds\",OFFSET(Comets!$L$2,ROW(F7),7),))))))))","v":2},{"$f":"IF($F$1=\"Drillers\",OFFSET(Drillers!$L$2,ROW(F7),8),IF($F$1=\"Bulls\",OFFSET(Bulls!$L$2,ROW(F7),8),IF($F$1=\"Phantoms\",OFFSET(Phantoms!$L$2,ROW(F7),8),IF($F$1=\"Gators\",OFFSET(Gators!$L$2,ROW(F7),8),IF($F$1=\"Knights\",OFFSET(Knights!$L$2,ROW(F7),8),IF($F$1=\"Hornets\",OFFSET(Hornets!$L$2,ROW(F7),8),IF($F$1=\"Guardians\",OFFSET(Wolves!$L$2,ROW(F7),8),IF($F$1=\"Reds\",OFFSET(Comets!$L$2,ROW(F7),8)))))))))","v":3},{"$f":"IF($F$1=\"Drillers\",OFFSET(Drillers!$L$2,ROW($F7),9),IF($F$1=\"Bulls\",OFFSET(Bulls!$L$2,ROW($F7),9),IF($F$1=\"Phantoms\",OFFSET(Phantoms!$L$2,ROW($F7),9),IF($F$1=\"Gators\",OFFSET(Gators!$L$2,ROW($F7),9),IF($F$1=\"Knights\",OFFSET(Knights!$L$2,ROW($F7),9),IF($F$1=\"Hornets\",OFFSET(Hornets!$L$2,ROW(F7),9),IF($F$1=\"Guardians\",OFFSET(Wolves!$L$2,ROW($F7),9),IF($F$1=\"Reds\",OFFSET(Comets!$L$2,ROW($F7),9)))))))))","v":2},{"$f":"IF($F$1=\"Drillers\",OFFSET(Drillers!$L$2,ROW(F7),10),IF($F$1=\"Bulls\",OFFSET(Bulls!$L$2,ROW(F7),10),IF($F$1=\"Phantoms\",OFFSET(Phantoms!$L$2,ROW(F7),10),IF($F$1=\"Gators\",OFFSET(Gators!$L$2,ROW(F7),10),IF($F$1=\"Knights\",OFFSET(Knights!$L$2,ROW(F7),10),IF($F$1=\"Hornets\",OFFSET(Hornets!$L$2,ROW(F7),10),IF($F$1=\"Guardians\",OFFSET(Wolves!$L$2,ROW(F7),10),IF($F$1=\"Reds\",OFFSET(Comets!$L$2,ROW(F7),10)))))))))","v":5},{"$f":"IF($F$1=\"Drillers\",OFFSET(Drillers!$L$2,ROW(F7),11),IF($F$1=\"Bulls\",OFFSET(Bulls!$L$2,ROW(F7),11),IF($F$1=\"Phantoms\",OFFSET(Phantoms!$L$2,ROW(F7),11),IF($F$1=\"Gators\",OFFSET(Gators!$L$2,ROW(F7),11),IF($F$1=\"Knights\",OFFSET(Knights!$L$2,ROW(F7),11),IF($F$1=\"Hornets\",OFFSET(Hornets!$L$2,ROW(F7),11),IF($F$1=\"Guardians\",OFFSET(Wolves!$L$2,ROW(F7),11),IF($F$1=\"Drillers\",OFFSET(Drillers!$L$2,ROW(F7),11),IF($F$1=\"Reds\",OFFSET(Comets!$L$2,ROW(F7),11))))))))))","v":3},{"$f":"IF($F$1=\"Drillers\",OFFSET(Drillers!$L$2,ROW(F7),12),IF($F$1=\"Bulls\",OFFSET(Bulls!$L$2,ROW(F7),12),IF($F$1=\"Phantoms\",OFFSET(Phantoms!$L$2,ROW(F7),12),IF($F$1=\"Gators\",OFFSET(Gators!$L$2,ROW(F7),12),IF($F$1=\"Knights\",OFFSET(Knights!$L$2,ROW(F7),12),IF($F$1=\"Hornets\",OFFSET(Hornets!$L$2,ROW(F7),12),IF($F$1=\"Guardians\",OFFSET(Wolves!$L$2,ROW(F7),12),IF($F$1=\"Reds\",OFFSET(Comets!$L$2,ROW(F7),12),))))))))","v":"SS"},{"$f":"IF($F$1=\"Drillers\",OFFSET(Drillers!$L$2,ROW(F7),13),IF($F$1=\"Bulls\",OFFSET(Bulls!$L$2,ROW(F7),13),IF($F$1=\"Phantoms\",OFFSET(Phantoms!$L$2,ROW(F7),13),IF($F$1=\"Gators\",OFFSET(Gators!$L$2,ROW(F7),13),IF($F$1=\"Knights\",OFFSET(Knights!$L$2,ROW(F7),13),IF($F$1=\"Hornets\",OFFSET(Hornets!$L$2,ROW(F7),13),IF($F$1=\"Guardians\",OFFSET(Wolves!$L$2,ROW(F7),13),IF($F$1=\"Reds\",OFFSET(Comets!$L$2,ROW(F7),13),))))))))","v":0},{"$f":"IF($F$1=\"Drillers\",OFFSET(Drillers!$L$2,ROW(F7),14),IF($F$1=\"Bulls\",OFFSET(Bulls!$L$2,ROW(F7),14),IF($F$1=\"Phantoms\",OFFSET(Phantoms!$L$2,ROW(F7),14),IF($F$1=\"Gators\",OFFSET(Gators!$L$2,ROW(F7),14),IF($F$1=\"Knights\",OFFSET(Knights!$L$2,ROW(F7),14),IF($F$1=\"Hornets\",OFFSET(Hornets!$L$2,ROW(F7),14),IF($F$1=\"Guardians\",OFFSET(Wolves!$L$2,ROW(F7),14,),IF($F$1=\"Reds\",OFFSET(Comets!$L$2,ROW(F7),14)))))))))","v":2},{"$f":"IF($F$1=\"Drillers\",OFFSET(Drillers!$L$2,ROW(F7),15),IF($F$1=\"Bulls\",OFFSET(Bulls!$L$2,ROW(F7),15),IF($F$1=\"Phantoms\",OFFSET(Phantoms!$L$2,ROW(F7),15),IF($F$1=\"Gators\",OFFSET(Gators!$L$2,ROW(F7),15),IF($F$1=\"Knights\",OFFSET(Knights!$L$2,ROW(F7),15),IF($F$1=\"Hornets\",OFFSET(Hornets!$L$2,ROW(F7),15),IF($F$1=\"Guardians\",OFFSET(Wolves!$L$2,ROW(F7),15),IF($F$1=\"Reds\",OFFSET(Comets!$L$2,ROW(F7),15)))))))))","v":0},{"$f":"IF($F$1=\"Drillers\",OFFSET(Drillers!$L$2,ROW(F7),16),IF($F$1=\"Bulls\",OFFSET(Bulls!$L$2,ROW(F7),16),IF($F$1=\"Phantoms\",OFFSET(Phantoms!$L$2,ROW(F7),16),IF($F$1=\"Gators\",OFFSET(Gators!$L$2,ROW(F7),16),IF($F$1=\"Knights\",OFFSET(Knights!$L$2,ROW(F7),16),IF($F$1=\"Hornets\",OFFSET(Hornets!$L$2,ROW(F7),16),IF($F$1=\"Guardians\",OFFSET(Wolves!$L$2,ROW(F7),16),IF($F$1=\"Reds\",OFFSET(Comets!$L$2,ROW(F7),16)))))))))","v":0},{"$f":"IF($F$1=\"Drillers\",OFFSET(Drillers!$L$2,ROW($F7),17),IF($F$1=\"Bulls\",OFFSET(Bulls!$L$2,ROW($F7),17),IF($F$1=\"Phantoms\",OFFSET(Phantoms!$L$2,ROW($F7),17),IF($F$1=\"Gators\",OFFSET(Gators!$L$2,ROW($F7),17),IF($F$1=\"Knights\",OFFSET(Knights!$L$2,ROW($F7),17),IF($F$1=\"Hornets\",OFFSET(Hornets!$L$2,ROW($F7),17),IF($F$1=\"Guardians\",OFFSET(Wolves!$L$2,ROW($F7),17),IF($F$1=\"Reds\",OFFSET(Comets!$L$2,ROW($F7),17)))))))))","v":3},{"$nulls":7},7,{"$f":"IF($AE$1=\"Drillers\",OFFSET(Drillers!$L$2,ROW($AE7),1),IF($AE$1=\"Bulls\",OFFSET(Bulls!$L$2,ROW($AE7),1),IF($AE$1=\"Phantoms\",OFFSET(Phantoms!$L$2,ROW($AE7),1),IF($AE$1=\"Gators\",OFFSET(Gators!$L$2,ROW($AE7),1),IF($AE$1=\"Knights\",OFFSET(Knights!$L$2,ROW($AE7),1),IF($AE$1=\"Hornets\",OFFSET(Hornets!$L$2,ROW($AE7),1),IF($AE$1=\"Wolves\",OFFSET(Wolves!$L$2,ROW($AE7),1),IF(AE$1=\"Comets\",OFFSET(Comets!$L$2,ROW($AE7),1)))))))))","v":"Rosas"},{"$f":"IF($AE$1=\"Drillers\",OFFSET(Drillers!$L$2,ROW($AF7),2),IF($AE$1=\"Bulls\",OFFSET(Bulls!$L$2,ROW($AF7),2),IF($AE$1=\"Phantoms\",OFFSET(Phantoms!$L$2,ROW($AF7),2),IF($AE$1=\"Gators\",OFFSET(Gators!$L$2,ROW($AF7),2),IF($AE$1=\"Knights\",OFFSET(Knights!$L$2,ROW($AF7),2),IF($AE$1=\"Hornets\",OFFSET(Hornets!$L$2,ROW($AF7),2),IF($AE$1=\"Wolves\",OFFSET(Wolves!$L$2,ROW($AF7),2),IF($AE$1=\"Comets\",OFFSET(Comets!$L$2,ROW($AF7),2)))))))))","v":"Orlando"},{"$f":"IF($AE$1=\"Drillers\",OFFSET(Drillers!$L$2,ROW($AE7),3),IF($AE$1=\"Bulls\",OFFSET(Bulls!$L$2,ROW($AE7),3),IF($AE$1=\"Phantoms\",OFFSET(Phantoms!$L$2,ROW($AE7),3),IF($AE$1=\"Gators\",OFFSET(Gators!$L$2,ROW($AE7),3),IF($AE$1=\"Knights\",OFFSET(Knights!$L$2,ROW($AE7),3),IF($AE$1=\"Hornets\",OFFSET(Hornets!$L$2,ROW($AE7),3),IF($AE$1=\"Wolves\",OFFSET(Wolves!$L$2,ROW($AE7),3),IF($AE$1=\"Comets\",OFFSET(Comets!$L$2,ROW($AE7),3)))))))))","v":"L"},{"$f":"IF($AE$1=\"Drillers\",OFFSET(Drillers!$L$2,ROW($AE7),4),IF($AE$1=\"Bulls\",OFFSET(Bulls!$L$2,ROW($AE7),4),IF($AE$1=\"Phantoms\",OFFSET(Phantoms!$L$2,ROW($AE7),4),IF($AE$1=\"Gators\",OFFSET(Gators!$L$2,ROW($AE7),4),IF($AE$1=\"Knights\",OFFSET(Knights!$L$2,ROW($AE7),4),IF($AE$1=\"Hornets\",OFFSET(Hornets!$L$2,ROW($AE7),4),IF($AE$1=\"Wolves\",OFFSET(Wolves!$L$2,ROW($AE7),4),IF($AE$1=\"Comets\",OFFSET(Comets!$L$2,ROW($AE7),4)))))))))","v":"LF"},{"$f":"IF($AE$1=\"Drillers\",OFFSET(Drillers!$L$2,ROW($AE7),5),IF($AE$1=\"Bulls\",OFFSET(Bulls!$L$2,ROW($AE7),5),IF($AE$1=\"Phantoms\",OFFSET(Phantoms!$L$2,ROW($AE7),5),IF($AE$1=\"Gators\",OFFSET(Gators!$L$2,ROW($AE7),5),IF($AE$1=\"Knights\",OFFSET(Knights!$L$2,ROW($AE7),5),IF($AE$1=\"Hornets\",OFFSET(Hornets!$L$2,ROW($AE7),5),IF($AE$1=\"Wolves\",OFFSET(Wolves!$L$2,ROW($AE7),5),IF($AE$1=\"Comets\",OFFSET(Comets!$L$2,ROW($AE7),5)))))))))","v":4},{"$f":"IF($AE$1=\"Drillers\",OFFSET(Drillers!$L$2,ROW($AE7),6),IF($AE$1=\"Bulls\",OFFSET(Bulls!$L$2,ROW($AE7),6),IF($AE$1=\"Phantoms\",OFFSET(Phantoms!$L$2,ROW($AE7),6),IF($AE$1=\"Gators\",OFFSET(Gators!$L$2,ROW($AE7),6),IF($AE$1=\"Knights\",OFFSET(Knights!$L$2,ROW($AE7),6),IF($AE$1=\"Hornets\",OFFSET(Hornets!$L$2,ROW($AE7),6),IF($AE$1=\"Wolves\",OFFSET(Wolves!$L$2,ROW($AE7),6),IF($AE$1=\"Comets\",OFFSET(Comets!$L$2,ROW($AE7),6)))))))))","v":3},{"$f":"IF($AE$1=\"Drillers\",OFFSET(Drillers!$L$2,ROW($AE7),7),IF($AE$1=\"Bulls\",OFFSET(Bulls!$L$2,ROW($AE7),7),IF($AE$1=\"Phantoms\",OFFSET(Phantoms!$L$2,ROW($AE7),7),IF($AE$1=\"Gators\",OFFSET(Gators!$L$2,ROW($AE7),7),IF($AE$1=\"Knights\",OFFSET(Knights!$L$2,ROW($AE7),7),IF($AE$1=\"Hornets\",OFFSET(Hornets!$L$2,ROW($AE7),7),IF($AE$1=\"Wolves\",OFFSET(Wolves!$L$2,ROW($AE7),7),IF($AE$1=\"Comets\",OFFSET(Comets!$L$2,ROW($AE7),7)))))))))","v":3},{"$f":"IF($AE$1=\"Drillers\",OFFSET(Drillers!$L$2,ROW($AE7),8),IF($AE$1=\"Bulls\",OFFSET(Bulls!$L$2,ROW($AE7),8),IF($AE$1=\"Phantoms\",OFFSET(Phantoms!$L$2,ROW($AE7),8),IF($AE$1=\"Gators\",OFFSET(Gators!$L$2,ROW($AE7),8),IF($AE$1=\"Knights\",OFFSET(Knights!$L$2,ROW($AE7),8),IF($AE$1=\"Hornets\",OFFSET(Hornets!$L$2,ROW($AE7),8),IF($AE$1=\"Wolves\",OFFSET(Wolves!$L$2,ROW($AE7),8),IF($AE$1=\"Comets\",OFFSET(Comets!$L$2,ROW($AE7),8)))))))))","v":4},{"$f":"IF($AE$1=\"Drillers\",OFFSET(Drillers!$L$2,ROW($AE7),9),IF($AE$1=\"Bulls\",OFFSET(Bulls!$L$2,ROW($AE7),9),IF($AE$1=\"Phantoms\",OFFSET(Phantoms!$L$2,ROW($AE7),9),IF($AE$1=\"Gators\",OFFSET(Gators!$L$2,ROW($AE7),9),IF($AE$1=\"Knights\",OFFSET(Knights!$L$2,ROW($AE7),9),IF($AE$1=\"Hornets\",OFFSET(Hornets!$L$2,ROW($AE7),9),IF($AE$1=\"Wolves\",OFFSET(Wolves!$L$2,ROW($AE7),9),IF($AE$1=\"Comets\",OFFSET(Comets!$L$2,ROW($AE7),9)))))))))","v":3},{"$f":"IF($AE$1=\"Drillers\",OFFSET(Drillers!$L$2,ROW($AE7),10),IF($AE$1=\"Bulls\",OFFSET(Bulls!$L$2,ROW($AE7),10),IF($AE$1=\"Phantoms\",OFFSET(Phantoms!$L$2,ROW($AE7),10),IF($AE$1=\"Gators\",OFFSET(Gators!$L$2,ROW($AE7),10),IF($AE$1=\"Knights\",OFFSET(Knights!$L$2,ROW($AE7),10),IF($AE$1=\"Hornets\",OFFSET(Hornets!$L$2,ROW($AE7),10),IF($AE$1=\"Wolves\",OFFSET(Wolves!$L$2,ROW($AE7),10),IF($AE$1=\"Comets\",OFFSET(Comets!$L$2,ROW($AE7),10)))))))))","v":4},{"$f":"IF($AE$1=\"Drillers\",OFFSET(Drillers!$L$2,ROW($AE7),11),IF($AE$1=\"Bulls\",OFFSET(Bulls!$L$2,ROW($AE7),11),IF($AE$1=\"Phantoms\",OFFSET(Phantoms!$L$2,ROW($AE7),11),IF($AE$1=\"Gators\",OFFSET(Gators!$L$2,ROW($AE7),11),IF($AE$1=\"Knights\",OFFSET(Knights!$L$2,ROW($AE7),11),IF($AE$1=\"Hornets\",OFFSET(Hornets!$L$2,ROW($AE7),11),IF($AE$1=\"Wolves\",OFFSET(Wolves!$L$2,ROW($AE7),11),IF($AE$1=\"Comets\",OFFSET(Comets!$L$2,ROW($AE7),11)))))))))","v":3},{"$f":"IF($AE$1=\"Drillers\",OFFSET(Drillers!$L$2,ROW($AE7),12),IF($AE$1=\"Bulls\",OFFSET(Bulls!$L$2,ROW($AE7),12),IF($AE$1=\"Phantoms\",OFFSET(Phantoms!$L$2,ROW($AE7),12),IF($AE$1=\"Gators\",OFFSET(Gators!$L$2,ROW($AE7),12),IF($AE$1=\"Knights\",OFFSET(Knights!$L$2,ROW($AE7),12),IF($AE$1=\"Hornets\",OFFSET(Hornets!$L$2,ROW($AE7),12),IF($AE$1=\"Wolves\",OFFSET(Wolves!$L$2,ROW($AE7),12),IF($AE$1=\"Comets\",OFFSET(Comets!$L$2,ROW($AE7),12)))))))))","v":"CF"},{"$f":"IF($AE$1=\"Drillers\",OFFSET(Drillers!$L$2,ROW($AE7),13),IF($AE$1=\"Bulls\",OFFSET(Bulls!$L$2,ROW($AE7),13),IF($AE$1=\"Phantoms\",OFFSET(Phantoms!$L$2,ROW($AE7),13),IF($AE$1=\"Gators\",OFFSET(Gators!$L$2,ROW($AE7),13),IF($AE$1=\"Knights\",OFFSET(Knights!$L$2,ROW($AE7),13),IF($AE$1=\"Hornets\",OFFSET(Hornets!$L$2,ROW($AE7),13),IF($AE$1=\"Wolves\",OFFSET(Wolves!$L$2,ROW($AE7),13),IF($AE$1=\"Comets\",OFFSET(Comets!$L$2,ROW($AE7),13)))))))))","v":0},{"$f":"IF($AE$1=\"Drillers\",OFFSET(Drillers!$L$2,ROW($AE7),14),IF($AE$1=\"Bulls\",OFFSET(Bulls!$L$2,ROW($AE7),14),IF($AE$1=\"Phantoms\",OFFSET(Phantoms!$L$2,ROW($AE7),14),IF($AE$1=\"Gators\",OFFSET(Gators!$L$2,ROW($AE7),14),IF($AE$1=\"Knights\",OFFSET(Knights!$L$2,ROW($AE7),14),IF($AE$1=\"Hornets\",OFFSET(Hornets!$L$2,ROW($AE7),14),IF($AE$1=\"Wolves\",OFFSET(Wolves!$L$2,ROW($AE7),14),IF($AE$1=\"Comets\",OFFSET(Comets!$L$2,ROW($AE7),14)))))))))","v":2},{"$f":"IF(AE$1=\"Drillers\",OFFSET(Drillers!$L$2,ROW(AE7),15),IF(AE$1=\"Bulls\",OFFSET(Bulls!$L$2,ROW(AE7),15),IF(AE$1=\"Phantoms\",OFFSET(Phantoms!$L$2,ROW(AE7),15),IF(AE$1=\"Gators\",OFFSET(Gators!$L$2,ROW(AE7),15),IF(AE$1=\"Knights\",OFFSET(Knights!$L$2,ROW(AE7),15),IF(AE$1=\"Hornets\",OFFSET(Hornets!$L$2,ROW(AE7),15),IF(AE$1=\"Wolves\",OFFSET(Wolves!$L$2,ROW(AE7),15),IF(AE$1=\"Comets\",OFFSET(Comets!$L$2,ROW(AE7),15)))))))))","v":0},{"$f":"IF($AE$1=\"Drillers\",OFFSET(Drillers!$L$2,ROW(AE7),16),IF($AE$1=\"Bulls\",OFFSET(Bulls!$L$2,ROW(AE7),16),IF($AE$1=\"Phantoms\",OFFSET(Phantoms!$L$2,ROW(AE7),16),IF($AE$1=\"Gators\",OFFSET(Gators!$L$2,ROW(AE7),16),IF($AE$1=\"Knights\",OFFSET(Knights!$L$2,ROW(AE7),16),IF($AE$1=\"Hornets\",OFFSET(Hornets!$L$2,ROW(AE7),16),IF($AE$1=\"Wolves\",OFFSET(Wolves!$L$2,ROW(AE7),16),IF($AE$1=\"Comets\",OFFSET(Comets!$L$2,ROW(AE7),16)))))))))","v":0},{"$f":"IF($AE$1=\"Drillers\",OFFSET(Drillers!$L$2,ROW($AE7),17),IF($AE$1=\"Bulls\",OFFSET(Bulls!$L$2,ROW($AE7),17),IF($AE$1=\"Phantoms\",OFFSET(Phantoms!$L$2,ROW($AE7),17),IF($AE$1=\"Gators\",OFFSET(Gators!$L$2,ROW($AE7),17),IF($AE$1=\"Knights\",OFFSET(Knights!$L$2,ROW($AE7),17),IF($AE$1=\"Hornets\",OFFSET(Hornets!$L$2,ROW($AE7),17),IF($AE$1=\"Wolves\",OFFSET(Wolves!$L$2,ROW($AE7),17),IF($AE$1=\"Comets\",OFFSET(Comets!$L$2,ROW($AE7),17)))))))))","v":2}]
[{"$nulls":4},8,{"$f":"IF($F$1=\"Drillers\",OFFSET(Drillers!$L$2,ROW($F8),1),IF($F$1=\"Bulls\",OFFSET(Bulls!$L$2,ROW($F8),1),IF($F$1=\"Phantoms\",OFFSET(Phantoms!$L$2,ROW($F8),1),IF($F$1=\"Gators\",OFFSET(Gators!$L$2,ROW($F8),1),IF($F$1=\"Knights\",OFFSET(Knights!$L$2,ROW($F8),1),IF($F$1=\"Hornets\",OFFSET(Hornets!$L$2,ROW($F8),1),IF($F$1=\"Reds\",OFFSET(Comets!$L$2,ROW($F8),1),IF($F$1=\"Guardians\",OFFSET(Wolves!$L$2,ROW($F8),1)))))))))","v":"Metcalf"},{"$f":"IF($F$1=\"Drillers\",OFFSET(Drillers!$L$2,ROW($F8),2),IF($F$1=\"Bulls\",OFFSET(Bulls!$L$2,ROW($F8),2),IF($F$1=\"Phantoms\",OFFSET(Phantoms!$L$2,ROW($F8),2),IF($F$1=\"Gators\",OFFSET(Gators!$L$2,ROW($F8),2),IF($F$1=\"Knights\",OFFSET(Knights!$L$2,ROW($F8),2),IF($F$1=\"Hornets\",OFFSET(Hornets!$L$2,ROW($F8),2),IF($F$1=\"Reds\",OFFSET(Comets!$L$2,ROW($F8),2),IF($F$1=\"Guardians\",OFFSET(Wolves!$L$2,ROW($F8),2)))))))))","v":"Jon"},{"$f":"IF($F$1=\"Drillers\",OFFSET(Drillers!$L$2,ROW($F8),3),IF($F$1=\"Bulls\",OFFSET(Bulls!$L$2,ROW($F8),3),IF($F$1=\"Phantoms\",OFFSET(Phantoms!$L$2,ROW($F8),3),IF($F$1=\"Gators\",OFFSET(Gators!$L$2,ROW($F8),3),IF($F$1=\"Knights\",OFFSET(Knights!$L$2,ROW($F8),3),IF($F$1=\"Hornets\",OFFSET(Hornets!$L$2,ROW($F8),3),IF($F$1=\"Guardians\",OFFSET(Wolves!$L$2,ROW($F8),3),IF($F$1=\"Reds\",OFFSET(Comets!$L$2,ROW($F8),3)))))))))","v":"R"},{"$f":"IF($F$1=\"Drillers\",OFFSET(Drillers!$L$2,ROW($F8),4),IF($F$1=\"Bulls\",OFFSET(Bulls!$L$2,ROW($F8),4),IF($F$1=\"Phantoms\",OFFSET(Phantoms!$L$2,ROW($F8),4),IF($F$1=\"Gators\",OFFSET(Gators!$L$2,ROW($F8),4),IF($F$1=\"Knights\",OFFSET(Knights!$L$2,ROW($F8),4),IF($F$1=\"Hornets\",OFFSET(Hornets!$L$2,ROW($F8),4),IF($F$1=\"Guardians\",OFFSET(Wolves!$L$2,ROW($F8),4),IF($F$1=\"Reds\",OFFSET(Comets!$L$2,ROW($F8),4)))))))))","v":"DH"},{"$f":"IF($F$1=\"Drillers\",OFFSET(Drillers!$L$2,ROW($F8),5),IF($F$1=\"Bulls\",OFFSET(Bulls!$L$2,ROW($F8),5),IF($F$1=\"Phantoms\",OFFSET(Phantoms!$L$2,ROW($F8),5),IF($F$1=\"Gators\",OFFSET(Gators!$L$2,ROW($F8),5),IF($F$1=\"Knights\",OFFSET(Knights!$L$2,ROW($F8),5),IF($F$1=\"Hornets\",OFFSET(Hornets!$L$2,ROW($F8),5),IF($F$1=\"Guardians\",OFFSET(Wolves!$L$2,ROW($F8),5),IF($F$1=\"Reds\",OFFSET(Comets!$L$2,ROW($F8),5)))))))))","v":4},{"$f":"IF($F$1=\"Drillers\",OFFSET(Drillers!$L$2,ROW($F8),6),IF($F$1=\"Bulls\",OFFSET(Bulls!$L$2,ROW($F8),6),IF($F$1=\"Phantoms\",OFFSET(Phantoms!$L$2,ROW($F8),6),IF($F$1=\"Gators\",OFFSET(Gators!$L$2,ROW($F8),6),IF($F$1=\"Knights\",OFFSET(Knights!$L$2,ROW($F8),6),IF($F$1=\"Hornets\",OFFSET(Hornets!$L$2,ROW($F8),6),IF($F$1=\"Guardians\",OFFSET(Wolves!$L$2,ROW($F8),6),IF($F$1=\"Reds\",OFFSET(Comets!$L$2,ROW($F8),6)))))))))","v":2},{"$f":"IF($F$1=\"Drillers\",OFFSET(Drillers!$L$2,ROW(F8),7),IF($F$1=\"Bulls\",OFFSET(Bulls!$L$2,ROW(F8),7),IF($F$1=\"Phantoms\",OFFSET(Phantoms!$L$2,ROW(F8),7),IF($F$1=\"Gators\",OFFSET(Gators!$L$2,ROW(F8),7),IF($F$1=\"Knights\",OFFSET(Knights!$L$2,ROW(F8),7),IF($F$1=\"Hornets\",OFFSET(Hornets!$L$2,ROW(F8),7),IF($F$1=\"Guardians\",OFFSET(Wolves!$L$2,ROW(F8),7),IF($F$1=\"Reds\",OFFSET(Comets!$L$2,ROW(F8),7),))))))))","v":4},{"$f":"IF($F$1=\"Drillers\",OFFSET(Drillers!$L$2,ROW(F8),8),IF($F$1=\"Bulls\",OFFSET(Bulls!$L$2,ROW(F8),8),IF($F$1=\"Phantoms\",OFFSET(Phantoms!$L$2,ROW(F8),8),IF($F$1=\"Gators\",OFFSET(Gators!$L$2,ROW(F8),8),IF($F$1=\"Knights\",OFFSET(Knights!$L$2,ROW(F8),8),IF($F$1=\"Hornets\",OFFSET(Hornets!$L$2,ROW(F8),8),IF($F$1=\"Guardians\",OFFSET(Wolves!$L$2,ROW(F8),8),IF($F$1=\"Reds\",OFFSET(Comets!$L$2,ROW(F8),8)))))))))","v":4},{"$f":"IF($F$1=\"Drillers\",OFFSET(Drillers!$L$2,ROW($F8),9),IF($F$1=\"Bulls\",OFFSET(Bulls!$L$2,ROW($F8),9),IF($F$1=\"Phantoms\",OFFSET(Phantoms!$L$2,ROW($F8),9),IF($F$1=\"Gators\",OFFSET(Gators!$L$2,ROW($F8),9),IF($F$1=\"Knights\",OFFSET(Knights!$L$2,ROW($F8),9),IF($F$1=\"Hornets\",OFFSET(Hornets!$L$2,ROW(F8),9),IF($F$1=\"Guardians\",OFFSET(Wolves!$L$2,ROW($F8),9),IF($F$1=\"Reds\",OFFSET(Comets!$L$2,ROW($F8),9)))))))))","v":3},{"$f":"IF($F$1=\"Drillers\",OFFSET(Drillers!$L$2,ROW(F8),10),IF($F$1=\"Bulls\",OFFSET(Bulls!$L$2,ROW(F8),10),IF($F$1=\"Phantoms\",OFFSET(Phantoms!$L$2,ROW(F8),10),IF($F$1=\"Gators\",OFFSET(Gators!$L$2,ROW(F8),10),IF($F$1=\"Knights\",OFFSET(Knights!$L$2,ROW(F8),10),IF($F$1=\"Hornets\",OFFSET(Hornets!$L$2,ROW(F8),10),IF($F$1=\"Guardians\",OFFSET(Wolves!$L$2,ROW(F8),10),IF($F$1=\"Reds\",OFFSET(Comets!$L$2,ROW(F8),10)))))))))","v":4},{"$f":"IF($F$1=\"Drillers\",OFFSET(Drillers!$L$2,ROW(F8),11),IF($F$1=\"Bulls\",OFFSET(Bulls!$L$2,ROW(F8),11),IF($F$1=\"Phantoms\",OFFSET(Phantoms!$L$2,ROW(F8),11),IF($F$1=\"Gators\",OFFSET(Gators!$L$2,ROW(F8),11),IF($F$1=\"Knights\",OFFSET(Knights!$L$2,ROW(F8),11),IF($F$1=\"Hornets\",OFFSET(Hornets!$L$2,ROW(F8),11),IF($F$1=\"Guardians\",OFFSET(Wolves!$L$2,ROW(F8),11),IF($F$1=\"Drillers\",OFFSET(Drillers!$L$2,ROW(F8),11),IF($F$1=\"Reds\",OFFSET(Comets!$L$2,ROW(F8),11))))))))))","v":2},{"$f":"IF($F$1=\"Drillers\",OFFSET(Drillers!$L$2,ROW(F8),12),IF($F$1=\"Bulls\",OFFSET(Bulls!$L$2,ROW(F8),12),IF($F$1=\"Phantoms\",OFFSET(Phantoms!$L$2,ROW(F8),12),IF($F$1=\"Gators\",OFFSET(Gators!$L$2,ROW(F8),12),IF($F$1=\"Knights\",OFFSET(Knights!$L$2,ROW(F8),12),IF($F$1=\"Hornets\",OFFSET(Hornets!$L$2,ROW(F8),12),IF($F$1=\"Guardians\",OFFSET(Wolves!$L$2,ROW(F8),12),IF($F$1=\"Reds\",OFFSET(Comets!$L$2,ROW(F8),12),))))))))","v":"LF"},{"$f":"IF($F$1=\"Drillers\",OFFSET(Drillers!$L$2,ROW(F8),13),IF($F$1=\"Bulls\",OFFSET(Bulls!$L$2,ROW(F8),13),IF($F$1=\"Phantoms\",OFFSET(Phantoms!$L$2,ROW(F8),13),IF($F$1=\"Gators\",OFFSET(Gators!$L$2,ROW(F8),13),IF($F$1=\"Knights\",OFFSET(Knights!$L$2,ROW(F8),13),IF($F$1=\"Hornets\",OFFSET(Hornets!$L$2,ROW(F8),13),IF($F$1=\"Guardians\",OFFSET(Wolves!$L$2,ROW(F8),13),IF($F$1=\"Reds\",OFFSET(Comets!$L$2,ROW(F8),13),))))))))","v":0},{"$f":"IF($F$1=\"Drillers\",OFFSET(Drillers!$L$2,ROW(F8),14),IF($F$1=\"Bulls\",OFFSET(Bulls!$L$2,ROW(F8),14),IF($F$1=\"Phantoms\",OFFSET(Phantoms!$L$2,ROW(F8),14),IF($F$1=\"Gators\",OFFSET(Gators!$L$2,ROW(F8),14),IF($F$1=\"Knights\",OFFSET(Knights!$L$2,ROW(F8),14),IF($F$1=\"Hornets\",OFFSET(Hornets!$L$2,ROW(F8),14),IF($F$1=\"Guardians\",OFFSET(Wolves!$L$2,ROW(F8),14,),IF($F$1=\"Reds\",OFFSET(Comets!$L$2,ROW(F8),14)))))))))","v":3},{"$f":"IF($F$1=\"Drillers\",OFFSET(Drillers!$L$2,ROW(F8),15),IF($F$1=\"Bulls\",OFFSET(Bulls!$L$2,ROW(F8),15),IF($F$1=\"Phantoms\",OFFSET(Phantoms!$L$2,ROW(F8),15),IF($F$1=\"Gators\",OFFSET(Gators!$L$2,ROW(F8),15),IF($F$1=\"Knights\",OFFSET(Knights!$L$2,ROW(F8),15),IF($F$1=\"Hornets\",OFFSET(Hornets!$L$2,ROW(F8),15),IF($F$1=\"Guardians\",OFFSET(Wolves!$L$2,ROW(F8),15),IF($F$1=\"Reds\",OFFSET(Comets!$L$2,ROW(F8),15)))))))))","v":0},{"$f":"IF($F$1=\"Drillers\",OFFSET(Drillers!$L$2,ROW(F8),16),IF($F$1=\"Bulls\",OFFSET(Bulls!$L$2,ROW(F8),16),IF($F$1=\"Phantoms\",OFFSET(Phantoms!$L$2,ROW(F8),16),IF($F$1=\"Gators\",OFFSET(Gators!$L$2,ROW(F8),16),IF($F$1=\"Knights\",OFFSET(Knights!$L$2,ROW(F8),16),IF($F$1=\"Hornets\",OFFSET(Hornets!$L$2,ROW(F8),16),IF($F$1=\"Guardians\",OFFSET(Wolves!$L$2,ROW(F8),16),IF($F$1=\"Reds\",OFFSET(Comets!$L$2,ROW(F8),16)))))))))","v":0},{"$f":"IF($F$1=\"Drillers\",OFFSET(Drillers!$L$2,ROW($F8),17),IF($F$1=\"Bulls\",OFFSET(Bulls!$L$2,ROW($F8),17),IF($F$1=\"Phantoms\",OFFSET(Phantoms!$L$2,ROW($F8),17),IF($F$1=\"Gators\",OFFSET(Gators!$L$2,ROW($F8),17),IF($F$1=\"Knights\",OFFSET(Knights!$L$2,ROW($F8),17),IF($F$1=\"Hornets\",OFFSET(Hornets!$L$2,ROW($F8),17),IF($F$1=\"Guardians\",OFFSET(Wolves!$L$2,ROW($F8),17),IF($F$1=\"Reds\",OFFSET(Comets!$L$2,ROW($F8),17)))))))))","v":2},{"$nulls":7},8,{"$f":"IF($AE$1=\"Drillers\",OFFSET(Drillers!$L$2,ROW($AE8),1),IF($AE$1=\"Bulls\",OFFSET(Bulls!$L$2,ROW($AE8),1),IF($AE$1=\"Phantoms\",OFFSET(Phantoms!$L$2,ROW($AE8),1),IF($AE$1=\"Gators\",OFFSET(Gators!$L$2,ROW($AE8),1),IF($AE$1=\"Knights\",OFFSET(Knights!$L$2,ROW($AE8),1),IF($AE$1=\"Hornets\",OFFSET(Hornets!$L$2,ROW($AE8),1),IF($AE$1=\"Wolves\",OFFSET(Wolves!$L$2,ROW($AE8),1),IF(AE$1=\"Comets\",OFFSET(Comets!$L$2,ROW($AE8),1)))))))))","v":"Villarreal"},{"$f":"IF($AE$1=\"Drillers\",OFFSET(Drillers!$L$2,ROW($AF8),2),IF($AE$1=\"Bulls\",OFFSET(Bulls!$L$2,ROW($AF8),2),IF($AE$1=\"Phantoms\",OFFSET(Phantoms!$L$2,ROW($AF8),2),IF($AE$1=\"Gators\",OFFSET(Gators!$L$2,ROW($AF8),2),IF($AE$1=\"Knights\",OFFSET(Knights!$L$2,ROW($AF8),2),IF($AE$1=\"Hornets\",OFFSET(Hornets!$L$2,ROW($AF8),2),IF($AE$1=\"Wolves\",OFFSET(Wolves!$L$2,ROW($AF8),2),IF($AE$1=\"Comets\",OFFSET(Comets!$L$2,ROW($AF8),2)))))))))","v":"Tony"},{"$f":"IF($AE$1=\"Drillers\",OFFSET(Drillers!$L$2,ROW($AE8),3),IF($AE$1=\"Bulls\",OFFSET(Bulls!$L$2,ROW($AE8),3),IF($AE$1=\"Phantoms\",OFFSET(Phantoms!$L$2,ROW($AE8),3),IF($AE$1=\"Gators\",OFFSET(Gators!$L$2,ROW($AE8),3),IF($AE$1=\"Knights\",OFFSET(Knights!$L$2,ROW($AE8),3),IF($AE$1=\"Hornets\",OFFSET(Hornets!$L$2,ROW($AE8),3),IF($AE$1=\"Wolves\",OFFSET(Wolves!$L$2,ROW($AE8),3),IF($AE$1=\"Comets\",OFFSET(Comets!$L$2,ROW($AE8),3)))))))))","v":"R"},{"$f":"IF($AE$1=\"Drillers\",OFFSET(Drillers!$L$2,ROW($AE8),4),IF($AE$1=\"Bulls\",OFFSET(Bulls!$L$2,ROW($AE8),4),IF($AE$1=\"Phantoms\",OFFSET(Phantoms!$L$2,ROW($AE8),4),IF($AE$1=\"Gators\",OFFSET(Gators!$L$2,ROW($AE8),4),IF($AE$1=\"Knights\",OFFSET(Knights!$L$2,ROW($AE8),4),IF($AE$1=\"Hornets\",OFFSET(Hornets!$L$2,ROW($AE8),4),IF($AE$1=\"Wolves\",OFFSET(Wolves!$L$2,ROW($AE8),4),IF($AE$1=\"Comets\",OFFSET(Comets!$L$2,ROW($AE8),4)))))))))","v":"LF"},{"$f":"IF($AE$1=\"Drillers\",OFFSET(Drillers!$L$2,ROW($AE8),5),IF($AE$1=\"Bulls\",OFFSET(Bulls!$L$2,ROW($AE8),5),IF($AE$1=\"Phantoms\",OFFSET(Phantoms!$L$2,ROW($AE8),5),IF($AE$1=\"Gators\",OFFSET(Gators!$L$2,ROW($AE8),5),IF($AE$1=\"Knights\",OFFSET(Knights!$L$2,ROW($AE8),5),IF($AE$1=\"Hornets\",OFFSET(Hornets!$L$2,ROW($AE8),5),IF($AE$1=\"Wolves\",OFFSET(Wolves!$L$2,ROW($AE8),5),IF($AE$1=\"Comets\",OFFSET(Comets!$L$2,ROW($AE8),5)))))))))","v":2},{"$f":"IF($AE$1=\"Drillers\",OFFSET(Drillers!$L$2,ROW($AE8),6),IF($AE$1=\"Bulls\",OFFSET(Bulls!$L$2,ROW($AE8),6),IF($AE$1=\"Phantoms\",OFFSET(Phantoms!$L$2,ROW($AE8),6),IF($AE$1=\"Gators\",OFFSET(Gators!$L$2,ROW($AE8),6),IF($AE$1=\"Knights\",OFFSET(Knights!$L$2,ROW($AE8),6),IF($AE$1=\"Hornets\",OFFSET(Hornets!$L$2,ROW($AE8),6),IF($AE$1=\"Wolves\",OFFSET(Wolves!$L$2,ROW($AE8),6),IF($AE$1=\"Comets\",OFFSET(Comets!$L$2,ROW($AE8),6)))))))))","v":3},{"$f":"IF($AE$1=\"Drillers\",OFFSET(Drillers!$L$2,ROW($AE8),7),IF($AE$1=\"Bulls\",OFFSET(Bulls!$L$2,ROW($AE8),7),IF($AE$1=\"Phantoms\",OFFSET(Phantoms!$L$2,ROW($AE8),7),IF($AE$1=\"Gators\",OFFSET(Gators!$L$2,ROW($AE8),7),IF($AE$1=\"Knights\",OFFSET(Knights!$L$2,ROW($AE8),7),IF($AE$1=\"Hornets\",OFFSET(Hornets!$L$2,ROW($AE8),7),IF($AE$1=\"Wolves\",OFFSET(Wolves!$L$2,ROW($AE8),7),IF($AE$1=\"Comets\",OFFSET(Comets!$L$2,ROW($AE8),7)))))))))","v":2},{"$f":"IF($AE$1=\"Drillers\",OFFSET(Drillers!$L$2,ROW($AE8),8),IF($AE$1=\"Bulls\",OFFSET(Bulls!$L$2,ROW($AE8),8),IF($AE$1=\"Phantoms\",OFFSET(Phantoms!$L$2,ROW($AE8),8),IF($AE$1=\"Gators\",OFFSET(Gators!$L$2,ROW($AE8),8),IF($AE$1=\"Knights\",OFFSET(Knights!$L$2,ROW($AE8),8),IF($AE$1=\"Hornets\",OFFSET(Hornets!$L$2,ROW($AE8),8),IF($AE$1=\"Wolves\",OFFSET(Wolves!$L$2,ROW($AE8),8),IF($AE$1=\"Comets\",OFFSET(Comets!$L$2,ROW($AE8),8)))))))))","v":4},{"$f":"IF($AE$1=\"Drillers\",OFFSET(Drillers!$L$2,ROW($AE8),9),IF($AE$1=\"Bulls\",OFFSET(Bulls!$L$2,ROW($AE8),9),IF($AE$1=\"Phantoms\",OFFSET(Phantoms!$L$2,ROW($AE8),9),IF($AE$1=\"Gators\",OFFSET(Gators!$L$2,ROW($AE8),9),IF($AE$1=\"Knights\",OFFSET(Knights!$L$2,ROW($AE8),9),IF($AE$1=\"Hornets\",OFFSET(Hornets!$L$2,ROW($AE8),9),IF($AE$1=\"Wolves\",OFFSET(Wolves!$L$2,ROW($AE8),9),IF($AE$1=\"Comets\",OFFSET(Comets!$L$2,ROW($AE8),9)))))))))","v":3},{"$f":"IF($AE$1=\"Drillers\",OFFSET(Drillers!$L$2,ROW($AE8),10),IF($AE$1=\"Bulls\",OFFSET(Bulls!$L$2,ROW($AE8),10),IF($AE$1=\"Phantoms\",OFFSET(Phantoms!$L$2,ROW($AE8),10),IF($AE$1=\"Gators\",OFFSET(Gators!$L$2,ROW($AE8),10),IF($AE$1=\"Knights\",OFFSET(Knights!$L$2,ROW($AE8),10),IF($AE$1=\"Hornets\",OFFSET(Hornets!$L$2,ROW($AE8),10),IF($AE$1=\"Wolves\",OFFSET(Wolves!$L$2,ROW($AE8),10),IF($AE$1=\"Comets\",OFFSET(Comets!$L$2,ROW($AE8),10)))))))))","v":4},{"$f":"IF($AE$1=\"Drillers\",OFFSET(Drillers!$L$2,ROW($AE8),11),IF($AE$1=\"Bulls\",OFFSET(Bulls!$L$2,ROW($AE8),11),IF($AE$1=\"Phantoms\",OFFSET(Phantoms!$L$2,ROW($AE8),11),IF($AE$1=\"Gators\",OFFSET(Gators!$L$2,ROW($AE8),11),IF($AE$1=\"Knights\",OFFSET(Knights!$L$2,ROW($AE8),11),IF($AE$1=\"Hornets\",OFFSET(Hornets!$L$2,ROW($AE8),11),IF($AE$1=\"Wolves\",OFFSET(Wolves!$L$2,ROW($AE8),11),IF($AE$1=\"Comets\",OFFSET(Comets!$L$2,ROW($AE8),11)))))))))","v":2},{"$f":"IF($AE$1=\"Drillers\",OFFSET(Drillers!$L$2,ROW($AE8),12),IF($AE$1=\"Bulls\",OFFSET(Bulls!$L$2,ROW($AE8),12),IF($AE$1=\"Phantoms\",OFFSET(Phantoms!$L$2,ROW($AE8),12),IF($AE$1=\"Gators\",OFFSET(Gators!$L$2,ROW($AE8),12),IF($AE$1=\"Knights\",OFFSET(Knights!$L$2,ROW($AE8),12),IF($AE$1=\"Hornets\",OFFSET(Hornets!$L$2,ROW($AE8),12),IF($AE$1=\"Wolves\",OFFSET(Wolves!$L$2,ROW($AE8),12),IF($AE$1=\"Comets\",OFFSET(Comets!$L$2,ROW($AE8),12)))))))))","v":"RF"},{"$f":"IF($AE$1=\"Drillers\",OFFSET(Drillers!$L$2,ROW($AE8),13),IF($AE$1=\"Bulls\",OFFSET(Bulls!$L$2,ROW($AE8),13),IF($AE$1=\"Phantoms\",OFFSET(Phantoms!$L$2,ROW($AE8),13),IF($AE$1=\"Gators\",OFFSET(Gators!$L$2,ROW($AE8),13),IF($AE$1=\"Knights\",OFFSET(Knights!$L$2,ROW($AE8),13),IF($AE$1=\"Hornets\",OFFSET(Hornets!$L$2,ROW($AE8),13),IF($AE$1=\"Wolves\",OFFSET(Wolves!$L$2,ROW($AE8),13),IF($AE$1=\"Comets\",OFFSET(Comets!$L$2,ROW($AE8),13)))))))))","v":0},{"$f":"IF($AE$1=\"Drillers\",OFFSET(Drillers!$L$2,ROW($AE8),14),IF($AE$1=\"Bulls\",OFFSET(Bulls!$L$2,ROW($AE8),14),IF($AE$1=\"Phantoms\",OFFSET(Phantoms!$L$2,ROW($AE8),14),IF($AE$1=\"Gators\",OFFSET(Gators!$L$2,ROW($AE8),14),IF($AE$1=\"Knights\",OFFSET(Knights!$L$2,ROW($AE8),14),IF($AE$1=\"Hornets\",OFFSET(Hornets!$L$2,ROW($AE8),14),IF($AE$1=\"Wolves\",OFFSET(Wolves!$L$2,ROW($AE8),14),IF($AE$1=\"Comets\",OFFSET(Comets!$L$2,ROW($AE8),14)))))))))","v":3},{"$f":"IF(AE$1=\"Drillers\",OFFSET(Drillers!$L$2,ROW(AE8),15),IF(AE$1=\"Bulls\",OFFSET(Bulls!$L$2,ROW(AE8),15),IF(AE$1=\"Phantoms\",OFFSET(Phantoms!$L$2,ROW(AE8),15),IF(AE$1=\"Gators\",OFFSET(Gators!$L$2,ROW(AE8),15),IF(AE$1=\"Knights\",OFFSET(Knights!$L$2,ROW(AE8),15),IF(AE$1=\"Hornets\",OFFSET(Hornets!$L$2,ROW(AE8),15),IF(AE$1=\"Wolves\",OFFSET(Wolves!$L$2,ROW(AE8),15),IF(AE$1=\"Comets\",OFFSET(Comets!$L$2,ROW(AE8),15)))))))))","v":0},{"$f":"IF($AE$1=\"Drillers\",OFFSET(Drillers!$L$2,ROW(AE8),16),IF($AE$1=\"Bulls\",OFFSET(Bulls!$L$2,ROW(AE8),16),IF($AE$1=\"Phantoms\",OFFSET(Phantoms!$L$2,ROW(AE8),16),IF($AE$1=\"Gators\",OFFSET(Gators!$L$2,ROW(AE8),16),IF($AE$1=\"Knights\",OFFSET(Knights!$L$2,ROW(AE8),16),IF($AE$1=\"Hornets\",OFFSET(Hornets!$L$2,ROW(AE8),16),IF($AE$1=\"Wolves\",OFFSET(Wolves!$L$2,ROW(AE8),16),IF($AE$1=\"Comets\",OFFSET(Comets!$L$2,ROW(AE8),16)))))))))","v":0},{"$f":"IF($AE$1=\"Drillers\",OFFSET(Drillers!$L$2,ROW($AE8),17),IF($AE$1=\"Bulls\",OFFSET(Bulls!$L$2,ROW($AE8),17),IF($AE$1=\"Phantoms\",OFFSET(Phantoms!$L$2,ROW($AE8),17),IF($AE$1=\"Gators\",OFFSET(Gators!$L$2,ROW($AE8),17),IF($AE$1=\"Knights\",OFFSET(Knights!$L$2,ROW($AE8),17),IF($AE$1=\"Hornets\",OFFSET(Hornets!$L$2,ROW($AE8),17),IF($AE$1=\"Wolves\",OFFSET(Wolves!$L$2,ROW($AE8),17),IF($AE$1=\"Comets\",OFFSET(Comets!$L$2,ROW($AE8),17)))))))))","v":1}]
[{"$nulls":4},9,{"$f":"IF($F$1=\"Drillers\",OFFSET(Drillers!$L$2,ROW($F9),1),IF($F$1=\"Bulls\",OFFSET(Bulls!$L$2,ROW($F9),1),IF($F$1=\"Phantoms\",OFFSET(Phantoms!$L$2,ROW($F9),1),IF($F$1=\"Gators\",OFFSET(Gators!$L$2,ROW($F9),1),IF($F$1=\"Knights\",OFFSET(Knights!$L$2,ROW($F9),1),IF($F$1=\"Hornets\",OFFSET(Hornets!$L$2,ROW($F9),1),IF($F$1=\"Reds\",OFFSET(Comets!$L$2,ROW($F9),1),IF($F$1=\"Guardians\",OFFSET(Wolves!$L$2,ROW($F9),1)))))))))","v":"Lowery"},{"$f":"IF($F$1=\"Drillers\",OFFSET(Drillers!$L$2,ROW($F9),2),IF($F$1=\"Bulls\",OFFSET(Bulls!$L$2,ROW($F9),2),IF($F$1=\"Phantoms\",OFFSET(Phantoms!$L$2,ROW($F9),2),IF($F$1=\"Gators\",OFFSET(Gators!$L$2,ROW($F9),2),IF($F$1=\"Knights\",OFFSET(Knights!$L$2,ROW($F9),2),IF($F$1=\"Hornets\",OFFSET(Hornets!$L$2,ROW($F9),2),IF($F$1=\"Reds\",OFFSET(Comets!$L$2,ROW($F9),2),IF($F$1=\"Guardians\",OFFSET(Wolves!$L$2,ROW($F9),2)))))))))","v":"Shane"},{"$f":"IF($F$1=\"Drillers\",OFFSET(Drillers!$L$2,ROW($F9),3),IF($F$1=\"Bulls\",OFFSET(Bulls!$L$2,ROW($F9),3),IF($F$1=\"Phantoms\",OFFSET(Phantoms!$L$2,ROW($F9),3),IF($F$1=\"Gators\",OFFSET(Gators!$L$2,ROW($F9),3),IF($F$1=\"Knights\",OFFSET(Knights!$L$2,ROW($F9),3),IF($F$1=\"Hornets\",OFFSET(Hornets!$L$2,ROW($F9),3),IF($F$1=\"Guardians\",OFFSET(Wolves!$L$2,ROW($F9),3),IF($F$1=\"Reds\",OFFSET(Comets!$L$2,ROW($F9),3)))))))))","v":"R"},{"$f":"IF($F$1=\"Drillers\",OFFSET(Drillers!$L$2,ROW($F9),4),IF($F$1=\"Bulls\",OFFSET(Bulls!$L$2,ROW($F9),4),IF($F$1=\"Phantoms\",OFFSET(Phantoms!$L$2,ROW($F9),4),IF($F$1=\"Gators\",OFFSET(Gators!$L$2,ROW($F9),4),IF($F$1=\"Knights\",OFFSET(Knights!$L$2,ROW($F9),4),IF($F$1=\"Hornets\",OFFSET(Hornets!$L$2,ROW($F9),4),IF($F$1=\"Guardians\",OFFSET(Wolves!$L$2,ROW($F9),4),IF($F$1=\"Reds\",OFFSET(Comets!$L$2,ROW($F9),4)))))))))","v":"CF"},{"$f":"IF($F$1=\"Drillers\",OFFSET(Drillers!$L$2,ROW($F9),5),IF($F$1=\"Bulls\",OFFSET(Bulls!$L$2,ROW($F9),5),IF($F$1=\"Phantoms\",OFFSET(Phantoms!$L$2,ROW($F9),5),IF($F$1=\"Gators\",OFFSET(Gators!$L$2,ROW($F9),5),IF($F$1=\"Knights\",OFFSET(Knights!$L$2,ROW($F9),5),IF($F$1=\"Hornets\",OFFSET(Hornets!$L$2,ROW($F9),5),IF($F$1=\"Guardians\",OFFSET(Wolves!$L$2,ROW($F9),5),IF($F$1=\"Reds\",OFFSET(Comets!$L$2,ROW($F9),5)))))))))","v":3},{"$f":"IF($F$1=\"Drillers\",OFFSET(Drillers!$L$2,ROW($F9),6),IF($F$1=\"Bulls\",OFFSET(Bulls!$L$2,ROW($F9),6),IF($F$1=\"Phantoms\",OFFSET(Phantoms!$L$2,ROW($F9),6),IF($F$1=\"Gators\",OFFSET(Gators!$L$2,ROW($F9),6),IF($F$1=\"Knights\",OFFSET(Knights!$L$2,ROW($F9),6),IF($F$1=\"Hornets\",OFFSET(Hornets!$L$2,ROW($F9),6),IF($F$1=\"Guardians\",OFFSET(Wolves!$L$2,ROW($F9),6),IF($F$1=\"Reds\",OFFSET(Comets!$L$2,ROW($F9),6)))))))))","v":2},{"$f":"IF($F$1=\"Drillers\",OFFSET(Drillers!$L$2,ROW(F9),7),IF($F$1=\"Bulls\",OFFSET(Bulls!$L$2,ROW(F9),7),IF($F$1=\"Phantoms\",OFFSET(Phantoms!$L$2,ROW(F9),7),IF($F$1=\"Gators\",OFFSET(Gators!$L$2,ROW(F9),7),IF($F$1=\"Knights\",OFFSET(Knights!$L$2,ROW(F9),7),IF($F$1=\"Hornets\",OFFSET(Hornets!$L$2,ROW(F9),7),IF($F$1=\"Guardians\",OFFSET(Wolves!$L$2,ROW(F9),7),IF($F$1=\"Reds\",OFFSET(Comets!$L$2,ROW(F9),7),))))))))","v":5},{"$f":"IF($F$1=\"Drillers\",OFFSET(Drillers!$L$2,ROW(F9),8),IF($F$1=\"Bulls\",OFFSET(Bulls!$L$2,ROW(F9),8),IF($F$1=\"Phantoms\",OFFSET(Phantoms!$L$2,ROW(F9),8),IF($F$1=\"Gators\",OFFSET(Gators!$L$2,ROW(F9),8),IF($F$1=\"Knights\",OFFSET(Knights!$L$2,ROW(F9),8),IF($F$1=\"Hornets\",OFFSET(Hornets!$L$2,ROW(F9),8),IF($F$1=\"Guardians\",OFFSET(Wolves!$L$2,ROW(F9),8),IF($F$1=\"Reds\",OFFSET(Comets!$L$2,ROW(F9),8)))))))))","v":5},{"$f":"IF($F$1=\"Drillers\",OFFSET(Drillers!$L$2,ROW($F9),9),IF($F$1=\"Bulls\",OFFSET(Bulls!$L$2,ROW($F9),9),IF($F$1=\"Phantoms\",OFFSET(Phantoms!$L$2,ROW($F9),9),IF($F$1=\"Gators\",OFFSET(Gators!$L$2,ROW($F9),9),IF($F$1=\"Knights\",OFFSET(Knights!$L$2,ROW($F9),9),IF($F$1=\"Hornets\",OFFSET(Hornets!$L$2,ROW(F9),9),IF($F$1=\"Guardians\",OFFSET(Wolves!$L$2,ROW($F9),9),IF($F$1=\"Reds\",OFFSET(Comets!$L$2,ROW($F9),9)))))))))","v":5},{"$f":"IF($F$1=\"Drillers\",OFFSET(Drillers!$L$2,ROW(F9),10),IF($F$1=\"Bulls\",OFFSET(Bulls!$L$2,ROW(F9),10),IF($F$1=\"Phantoms\",OFFSET(Phantoms!$L$2,ROW(F9),10),IF($F$1=\"Gators\",OFFSET(Gators!$L$2,ROW(F9),10),IF($F$1=\"Knights\",OFFSET(Knights!$L$2,ROW(F9),10),IF($F$1=\"Hornets\",OFFSET(Hornets!$L$2,ROW(F9),10),IF($F$1=\"Guardians\",OFFSET(Wolves!$L$2,ROW(F9),10),IF($F$1=\"Reds\",OFFSET(Comets!$L$2,ROW(F9),10)))))))))","v":4},{"$f":"IF($F$1=\"Drillers\",OFFSET(Drillers!$L$2,ROW(F9),11),IF($F$1=\"Bulls\",OFFSET(Bulls!$L$2,ROW(F9),11),IF($F$1=\"Phantoms\",OFFSET(Phantoms!$L$2,ROW(F9),11),IF($F$1=\"Gators\",OFFSET(Gators!$L$2,ROW(F9),11),IF($F$1=\"Knights\",OFFSET(Knights!$L$2,ROW(F9),11),IF($F$1=\"Hornets\",OFFSET(Hornets!$L$2,ROW(F9),11),IF($F$1=\"Guardians\",OFFSET(Wolves!$L$2,ROW(F9),11),IF($F$1=\"Drillers\",OFFSET(Drillers!$L$2,ROW(F9),11),IF($F$1=\"Reds\",OFFSET(Comets!$L$2,ROW(F9),11))))))))))","v":2},{"$f":"IF($F$1=\"Drillers\",OFFSET(Drillers!$L$2,ROW(F9),12),IF($F$1=\"Bulls\",OFFSET(Bulls!$L$2,ROW(F9),12),IF($F$1=\"Phantoms\",OFFSET(Phantoms!$L$2,ROW(F9),12),IF($F$1=\"Gators\",OFFSET(Gators!$L$2,ROW(F9),12),IF($F$1=\"Knights\",OFFSET(Knights!$L$2,ROW(F9),12),IF($F$1=\"Hornets\",OFFSET(Hornets!$L$2,ROW(F9),12),IF($F$1=\"Guardians\",OFFSET(Wolves!$L$2,ROW(F9),12),IF($F$1=\"Reds\",OFFSET(Comets!$L$2,ROW(F9),12),))))))))","v":"LF"},{"$f":"IF($F$1=\"Drillers\",OFFSET(Drillers!$L$2,ROW(F9),13),IF($F$1=\"Bulls\",OFFSET(Bulls!$L$2,ROW(F9),13),IF($F$1=\"Phantoms\",OFFSET(Phantoms!$L$2,ROW(F9),13),IF($F$1=\"Gators\",OFFSET(Gators!$L$2,ROW(F9),13),IF($F$1=\"Knights\",OFFSET(Knights!$L$2,ROW(F9),13),IF($F$1=\"Hornets\",OFFSET(Hornets!$L$2,ROW(F9),13),IF($F$1=\"Guardians\",OFFSET(Wolves!$L$2,ROW(F9),13),IF($F$1=\"Reds\",OFFSET(Comets!$L$2,ROW(F9),13),))))))))","v":"RF"},{"$f":"IF($F$1=\"Drillers\",OFFSET(Drillers!$L$2,ROW(F9),14),IF($F$1=\"Bulls\",OFFSET(Bulls!$L$2,ROW(F9),14),IF($F$1=\"Phantoms\",OFFSET(Phantoms!$L$2,ROW(F9),14),IF($F$1=\"Gators\",OFFSET(Gators!$L$2,ROW(F9),14),IF($F$1=\"Knights\",OFFSET(Knights!$L$2,ROW(F9),14),IF($F$1=\"Hornets\",OFFSET(Hornets!$L$2,ROW(F9),14),IF($F$1=\"Guardians\",OFFSET(Wolves!$L$2,ROW(F9),14,),IF($F$1=\"Reds\",OFFSET(Comets!$L$2,ROW(F9),14)))))))))","v":3},{"$f":"IF($F$1=\"Drillers\",OFFSET(Drillers!$L$2,ROW(F9),15),IF($F$1=\"Bulls\",OFFSET(Bulls!$L$2,ROW(F9),15),IF($F$1=\"Phantoms\",OFFSET(Phantoms!$L$2,ROW(F9),15),IF($F$1=\"Gators\",OFFSET(Gators!$L$2,ROW(F9),15),IF($F$1=\"Knights\",OFFSET(Knights!$L$2,ROW(F9),15),IF($F$1=\"Hornets\",OFFSET(Hornets!$L$2,ROW(F9),15),IF($F$1=\"Guardians\",OFFSET(Wolves!$L$2,ROW(F9),15),IF($F$1=\"Reds\",OFFSET(Comets!$L$2,ROW(F9),15)))))))))","v":0},{"$f":"IF($F$1=\"Drillers\",OFFSET(Drillers!$L$2,ROW(F9),16),IF($F$1=\"Bulls\",OFFSET(Bulls!$L$2,ROW(F9),16),IF($F$1=\"Phantoms\",OFFSET(Phantoms!$L$2,ROW(F9),16),IF($F$1=\"Gators\",OFFSET(Gators!$L$2,ROW(F9),16),IF($F$1=\"Knights\",OFFSET(Knights!$L$2,ROW(F9),16),IF($F$1=\"Hornets\",OFFSET(Hornets!$L$2,ROW(F9),16),IF($F$1=\"Guardians\",OFFSET(Wolves!$L$2,ROW(F9),16),IF($F$1=\"Reds\",OFFSET(Comets!$L$2,ROW(F9),16)))))))))","v":0},{"$f":"IF($F$1=\"Drillers\",OFFSET(Drillers!$L$2,ROW($F9),17),IF($F$1=\"Bulls\",OFFSET(Bulls!$L$2,ROW($F9),17),IF($F$1=\"Phantoms\",OFFSET(Phantoms!$L$2,ROW($F9),17),IF($F$1=\"Gators\",OFFSET(Gators!$L$2,ROW($F9),17),IF($F$1=\"Knights\",OFFSET(Knights!$L$2,ROW($F9),17),IF($F$1=\"Hornets\",OFFSET(Hornets!$L$2,ROW($F9),17),IF($F$1=\"Guardians\",OFFSET(Wolves!$L$2,ROW($F9),17),IF($F$1=\"Reds\",OFFSET(Comets!$L$2,ROW($F9),17)))))))))","v":2},{"$nulls":7},9,{"$f":"IF($AE$1=\"Drillers\",OFFSET(Drillers!$L$2,ROW($AE9),1),IF($AE$1=\"Bulls\",OFFSET(Bulls!$L$2,ROW($AE9),1),IF($AE$1=\"Phantoms\",OFFSET(Phantoms!$L$2,ROW($AE9),1),IF($AE$1=\"Gators\",OFFSET(Gators!$L$2,ROW($AE9),1),IF($AE$1=\"Knights\",OFFSET(Knights!$L$2,ROW($AE9),1),IF($AE$1=\"Hornets\",OFFSET(Hornets!$L$2,ROW($AE9),1),IF($AE$1=\"Wolves\",OFFSET(Wolves!$L$2,ROW($AE9),1),IF(AE$1=\"Comets\",OFFSET(Comets!$L$2,ROW($AE9),1)))))))))","v":"Hernandez"},{"$f":"IF($AE$1=\"Drillers\",OFFSET(Drillers!$L$2,ROW($AF9),2),IF($AE$1=\"Bulls\",OFFSET(Bulls!$L$2,ROW($AF9),2),IF($AE$1=\"Phantoms\",OFFSET(Phantoms!$L$2,ROW($AF9),2),IF($AE$1=\"Gators\",OFFSET(Gators!$L$2,ROW($AF9),2),IF($AE$1=\"Knights\",OFFSET(Knights!$L$2,ROW($AF9),2),IF($AE$1=\"Hornets\",OFFSET(Hornets!$L$2,ROW($AF9),2),IF($AE$1=\"Wolves\",OFFSET(Wolves!$L$2,ROW($AF9),2),IF($AE$1=\"Comets\",OFFSET(Comets!$L$2,ROW($AF9),2)))))))))","v":"Edgar"},{"$f":"IF($AE$1=\"Drillers\",OFFSET(Drillers!$L$2,ROW($AE9),3),IF($AE$1=\"Bulls\",OFFSET(Bulls!$L$2,ROW($AE9),3),IF($AE$1=\"Phantoms\",OFFSET(Phantoms!$L$2,ROW($AE9),3),IF($AE$1=\"Gators\",OFFSET(Gators!$L$2,ROW($AE9),3),IF($AE$1=\"Knights\",OFFSET(Knights!$L$2,ROW($AE9),3),IF($AE$1=\"Hornets\",OFFSET(Hornets!$L$2,ROW($AE9),3),IF($AE$1=\"Wolves\",OFFSET(Wolves!$L$2,ROW($AE9),3),IF($AE$1=\"Comets\",OFFSET(Comets!$L$2,ROW($AE9),3)))))))))","v":"R"},{"$f":"IF($AE$1=\"Drillers\",OFFSET(Drillers!$L$2,ROW($AE9),4),IF($AE$1=\"Bulls\",OFFSET(Bulls!$L$2,ROW($AE9),4),IF($AE$1=\"Phantoms\",OFFSET(Phantoms!$L$2,ROW($AE9),4),IF($AE$1=\"Gators\",OFFSET(Gators!$L$2,ROW($AE9),4),IF($AE$1=\"Knights\",OFFSET(Knights!$L$2,ROW($AE9),4),IF($AE$1=\"Hornets\",OFFSET(Hornets!$L$2,ROW($AE9),4),IF($AE$1=\"Wolves\",OFFSET(Wolves!$L$2,ROW($AE9),4),IF($AE$1=\"Comets\",OFFSET(Comets!$L$2,ROW($AE9),4)))))))))","v":"C"},{"$f":"IF($AE$1=\"Drillers\",OFFSET(Drillers!$L$2,ROW($AE9),5),IF($AE$1=\"Bulls\",OFFSET(Bulls!$L$2,ROW($AE9),5),IF($AE$1=\"Phantoms\",OFFSET(Phantoms!$L$2,ROW($AE9),5),IF($AE$1=\"Gators\",OFFSET(Gators!$L$2,ROW($AE9),5),IF($AE$1=\"Knights\",OFFSET(Knights!$L$2,ROW($AE9),5),IF($AE$1=\"Hornets\",OFFSET(Hornets!$L$2,ROW($AE9),5),IF($AE$1=\"Wolves\",OFFSET(Wolves!$L$2,ROW($AE9),5),IF($AE$1=\"Comets\",OFFSET(Comets!$L$2,ROW($AE9),5)))))))))","v":3},{"$f":"IF($AE$1=\"Drillers\",OFFSET(Drillers!$L$2,ROW($AE9),6),IF($AE$1=\"Bulls\",OFFSET(Bulls!$L$2,ROW($AE9),6),IF($AE$1=\"Phantoms\",OFFSET(Phantoms!$L$2,ROW($AE9),6),IF($AE$1=\"Gators\",OFFSET(Gators!$L$2,ROW($AE9),6),IF($AE$1=\"Knights\",OFFSET(Knights!$L$2,ROW($AE9),6),IF($AE$1=\"Hornets\",OFFSET(Hornets!$L$2,ROW($AE9),6),IF($AE$1=\"Wolves\",OFFSET(Wolves!$L$2,ROW($AE9),6),IF($AE$1=\"Comets\",OFFSET(Comets!$L$2,ROW($AE9),6)))))))))","v":2},{"$f":"IF($AE$1=\"Drillers\",OFFSET(Drillers!$L$2,ROW($AE9),7),IF($AE$1=\"Bulls\",OFFSET(Bulls!$L$2,ROW($AE9),7),IF($AE$1=\"Phantoms\",OFFSET(Phantoms!$L$2,ROW($AE9),7),IF($AE$1=\"Gators\",OFFSET(Gators!$L$2,ROW($AE9),7),IF($AE$1=\"Knights\",OFFSET(Knights!$L$2,ROW($AE9),7),IF($AE$1=\"Hornets\",OFFSET(Hornets!$L$2,ROW($AE9),7),IF($AE$1=\"Wolves\",OFFSET(Wolves!$L$2,ROW($AE9),7),IF($AE$1=\"Comets\",OFFSET(Comets!$L$2,ROW($AE9),7)))))))))","v":1},{"$f":"IF($AE$1=\"Drillers\",OFFSET(Drillers!$L$2,ROW($AE9),8),IF($AE$1=\"Bulls\",OFFSET(Bulls!$L$2,ROW($AE9),8),IF($AE$1=\"Phantoms\",OFFSET(Phantoms!$L$2,ROW($AE9),8),IF($AE$1=\"Gators\",OFFSET(Gators!$L$2,ROW($AE9),8),IF($AE$1=\"Knights\",OFFSET(Knights!$L$2,ROW($AE9),8),IF($AE$1=\"Hornets\",OFFSET(Hornets!$L$2,ROW($AE9),8),IF($AE$1=\"Wolves\",OFFSET(Wolves!$L$2,ROW($AE9),8),IF($AE$1=\"Comets\",OFFSET(Comets!$L$2,ROW($AE9),8)))))))))","v":2},{"$f":"IF($AE$1=\"Drillers\",OFFSET(Drillers!$L$2,ROW($AE9),9),IF($AE$1=\"Bulls\",OFFSET(Bulls!$L$2,ROW($AE9),9),IF($AE$1=\"Phantoms\",OFFSET(Phantoms!$L$2,ROW($AE9),9),IF($AE$1=\"Gators\",OFFSET(Gators!$L$2,ROW($AE9),9),IF($AE$1=\"Knights\",OFFSET(Knights!$L$2,ROW($AE9),9),IF($AE$1=\"Hornets\",OFFSET(Hornets!$L$2,ROW($AE9),9),IF($AE$1=\"Wolves\",OFFSET(Wolves!$L$2,ROW($AE9),9),IF($AE$1=\"Comets\",OFFSET(Comets!$L$2,ROW($AE9),9)))))))))","v":2},{"$f":"IF($AE$1=\"Drillers\",OFFSET(Drillers!$L$2,ROW($AE9),10),IF($AE$1=\"Bulls\",OFFSET(Bulls!$L$2,ROW($AE9),10),IF($AE$1=\"Phantoms\",OFFSET(Phantoms!$L$2,ROW($AE9),10),IF($AE$1=\"Gators\",OFFSET(Gators!$L$2,ROW($AE9),10),IF($AE$1=\"Knights\",OFFSET(Knights!$L$2,ROW($AE9),10),IF($AE$1=\"Hornets\",OFFSET(Hornets!$L$2,ROW($AE9),10),IF($AE$1=\"Wolves\",OFFSET(Wolves!$L$2,ROW($AE9),10),IF($AE$1=\"Comets\",OFFSET(Comets!$L$2,ROW($AE9),10)))))))))","v":2},{"$f":"IF($AE$1=\"Drillers\",OFFSET(Drillers!$L$2,ROW($AE9),11),IF($AE$1=\"Bulls\",OFFSET(Bulls!$L$2,ROW($AE9),11),IF($AE$1=\"Phantoms\",OFFSET(Phantoms!$L$2,ROW($AE9),11),IF($AE$1=\"Gators\",OFFSET(Gators!$L$2,ROW($AE9),11),IF($AE$1=\"Knights\",OFFSET(Knights!$L$2,ROW($AE9),11),IF($AE$1=\"Hornets\",OFFSET(Hornets!$L$2,ROW($AE9),11),IF($AE$1=\"Wolves\",OFFSET(Wolves!$L$2,ROW($AE9),11),IF($AE$1=\"Comets\",OFFSET(Comets!$L$2,ROW($AE9),11)))))))))","v":2},{"$f":"IF($AE$1=\"Drillers\",OFFSET(Drillers!$L$2,ROW($AE9),12),IF($AE$1=\"Bulls\",OFFSET(Bulls!$L$2,ROW($AE9),12),IF($AE$1=\"Phantoms\",OFFSET(Phantoms!$L$2,ROW($AE9),12),IF($AE$1=\"Gators\",OFFSET(Gators!$L$2,ROW($AE9),12),IF($AE$1=\"Knights\",OFFSET(Knights!$L$2,ROW($AE9),12),IF($AE$1=\"Hornets\",OFFSET(Hornets!$L$2,ROW($AE9),12),IF($AE$1=\"Wolves\",OFFSET(Wolves!$L$2,ROW($AE9),12),IF($AE$1=\"Comets\",OFFSET(Comets!$L$2,ROW($AE9),12)))))))))","v":"3B"},{"$f":"IF($AE$1=\"Drillers\",OFFSET(Drillers!$L$2,ROW($AE9),13),IF($AE$1=\"Bulls\",OFFSET(Bulls!$L$2,ROW($AE9),13),IF($AE$1=\"Phantoms\",OFFSET(Phantoms!$L$2,ROW($AE9),13),IF($AE$1=\"Gators\",OFFSET(Gators!$L$2,ROW($AE9),13),IF($AE$1=\"Knights\",OFFSET(Knights!$L$2,ROW($AE9),13),IF($AE$1=\"Hornets\",OFFSET(Hornets!$L$2,ROW($AE9),13),IF($AE$1=\"Wolves\",OFFSET(Wolves!$L$2,ROW($AE9),13),IF($AE$1=\"Comets\",OFFSET(Comets!$L$2,ROW($AE9),13)))))))))","v":0},{"$f":"IF($AE$1=\"Drillers\",OFFSET(Drillers!$L$2,ROW($AE9),14),IF($AE$1=\"Bulls\",OFFSET(Bulls!$L$2,ROW($AE9),14),IF($AE$1=\"Phantoms\",OFFSET(Phantoms!$L$2,ROW($AE9),14),IF($AE$1=\"Gators\",OFFSET(Gators!$L$2,ROW($AE9),14),IF($AE$1=\"Knights\",OFFSET(Knights!$L$2,ROW($AE9),14),IF($AE$1=\"Hornets\",OFFSET(Hornets!$L$2,ROW($AE9),14),IF($AE$1=\"Wolves\",OFFSET(Wolves!$L$2,ROW($AE9),14),IF($AE$1=\"Comets\",OFFSET(Comets!$L$2,ROW($AE9),14)))))))))","v":1},{"$f":"IF(AE$1=\"Drillers\",OFFSET(Drillers!$L$2,ROW(AE9),15),IF(AE$1=\"Bulls\",OFFSET(Bulls!$L$2,ROW(AE9),15),IF(AE$1=\"Phantoms\",OFFSET(Phantoms!$L$2,ROW(AE9),15),IF(AE$1=\"Gators\",OFFSET(Gators!$L$2,ROW(AE9),15),IF(AE$1=\"Knights\",OFFSET(Knights!$L$2,ROW(AE9),15),IF(AE$1=\"Hornets\",OFFSET(Hornets!$L$2,ROW(AE9),15),IF(AE$1=\"Wolves\",OFFSET(Wolves!$L$2,ROW(AE9),15),IF(AE$1=\"Comets\",OFFSET(Comets!$L$2,ROW(AE9),15)))))))))","v":0},{"$f":"IF($AE$1=\"Drillers\",OFFSET(Drillers!$L$2,ROW(AE9),16),IF($AE$1=\"Bulls\",OFFSET(Bulls!$L$2,ROW(AE9),16),IF($AE$1=\"Phantoms\",OFFSET(Phantoms!$L$2,ROW(AE9),16),IF($AE$1=\"Gators\",OFFSET(Gators!$L$2,ROW(AE9),16),IF($AE$1=\"Knights\",OFFSET(Knights!$L$2,ROW(AE9),16),IF($AE$1=\"Hornets\",OFFSET(Hornets!$L$2,ROW(AE9),16),IF($AE$1=\"Wolves\",OFFSET(Wolves!$L$2,ROW(AE9),16),IF($AE$1=\"Comets\",OFFSET(Comets!$L$2,ROW(AE9),16)))))))))","v":0},{"$f":"IF($AE$1=\"Drillers\",OFFSET(Drillers!$L$2,ROW($AE9),17),IF($AE$1=\"Bulls\",OFFSET(Bulls!$L$2,ROW($AE9),17),IF($AE$1=\"Phantoms\",OFFSET(Phantoms!$L$2,ROW($AE9),17),IF($AE$1=\"Gators\",OFFSET(Gators!$L$2,ROW($AE9),17),IF($AE$1=\"Knights\",OFFSET(Knights!$L$2,ROW($AE9),17),IF($AE$1=\"Hornets\",OFFSET(Hornets!$L$2,ROW($AE9),17),IF($AE$1=\"Wolves\",OFFSET(Wolves!$L$2,ROW($AE9),17),IF($AE$1=\"Comets\",OFFSET(Comets!$L$2,ROW($AE9),17)))))))))","v":3}]
[{"$nulls":4},10,{"$f":"IF($F$1=\"Drillers\",OFFSET(Drillers!$L$2,ROW($F10),1),IF($F$1=\"Bulls\",OFFSET(Bulls!$L$2,ROW($F10),1),IF($F$1=\"Phantoms\",OFFSET(Phantoms!$L$2,ROW($F10),1),IF($F$1=\"Gators\",OFFSET(Gators!$L$2,ROW($F10),1),IF($F$1=\"Knights\",OFFSET(Knights!$L$2,ROW($F10),1),IF($F$1=\"Hornets\",OFFSET(Hornets!$L$2,ROW($F10),1),IF($F$1=\"Reds\",OFFSET(Comets!$L$2,ROW($F10),1),IF($F$1=\"Guardians\",OFFSET(Wolves!$L$2,ROW($F10),1)))))))))","v":"MacAldonich"},{"$f":"IF($F$1=\"Drillers\",OFFSET(Drillers!$L$2,ROW($F10),2),IF($F$1=\"Bulls\",OFFSET(Bulls!$L$2,ROW($F10),2),IF($F$1=\"Phantoms\",OFFSET(Phantoms!$L$2,ROW($F10),2),IF($F$1=\"Gators\",OFFSET(Gators!$L$2,ROW($F10),2),IF($F$1=\"Knights\",OFFSET(Knights!$L$2,ROW($F10),2),IF($F$1=\"Hornets\",OFFSET(Hornets!$L$2,ROW($F10),2),IF($F$1=\"Reds\",OFFSET(Comets!$L$2,ROW($F10),2),IF($F$1=\"Guardians\",OFFSET(Wolves!$L$2,ROW($F10),2)))))))))","v":"Chris"},{"$f":"IF($F$1=\"Drillers\",OFFSET(Drillers!$L$2,ROW($F10),3),IF($F$1=\"Bulls\",OFFSET(Bulls!$L$2,ROW($F10),3),IF($F$1=\"Phantoms\",OFFSET(Phantoms!$L$2,ROW($F10),3),IF($F$1=\"Gators\",OFFSET(Gators!$L$2,ROW($F10),3),IF($F$1=\"Knights\",OFFSET(Knights!$L$2,ROW($F10),3),IF($F$1=\"Hornets\",OFFSET(Hornets!$L$2,ROW($F10),3),IF($F$1=\"Guardians\",OFFSET(Wolves!$L$2,ROW($F10),3),IF($F$1=\"Reds\",OFFSET(Comets!$L$2,ROW($F10),3)))))))))","v":"R"},{"$f":"IF($F$1=\"Drillers\",OFFSET(Drillers!$L$2,ROW($F10),4),IF($F$1=\"Bulls\",OFFSET(Bulls!$L$2,ROW($F10),4),IF($F$1=\"Phantoms\",OFFSET(Phantoms!$L$2,ROW($F10),4),IF($F$1=\"Gators\",OFFSET(Gators!$L$2,ROW($F10),4),IF($F$1=\"Knights\",OFFSET(Knights!$L$2,ROW($F10),4),IF($F$1=\"Hornets\",OFFSET(Hornets!$L$2,ROW($F10),4),IF($F$1=\"Guardians\",OFFSET(Wolves!$L$2,ROW($F10),4),IF($F$1=\"Reds\",OFFSET(Comets!$L$2,ROW($F10),4)))))))))","v":"CF"},{"$f":"IF($F$1=\"Drillers\",OFFSET(Drillers!$L$2,ROW($F10),5),IF($F$1=\"Bulls\",OFFSET(Bulls!$L$2,ROW($F10),5),IF($F$1=\"Phantoms\",OFFSET(Phantoms!$L$2,ROW($F10),5),IF($F$1=\"Gators\",OFFSET(Gators!$L$2,ROW($F10),5),IF($F$1=\"Knights\",OFFSET(Knights!$L$2,ROW($F10),5),IF($F$1=\"Hornets\",OFFSET(Hornets!$L$2,ROW($F10),5),IF($F$1=\"Guardians\",OFFSET(Wolves!$L$2,ROW($F10),5),IF($F$1=\"Reds\",OFFSET(Comets!$L$2,ROW($F10),5)))))))))","v":3},{"$f":"IF($F$1=\"Drillers\",OFFSET(Drillers!$L$2,ROW($F10),6),IF($F$1=\"Bulls\",OFFSET(Bulls!$L$2,ROW($F10),6),IF($F$1=\"Phantoms\",OFFSET(Phantoms!$L$2,ROW($F10),6),IF($F$1=\"Gators\",OFFSET(Gators!$L$2,ROW($F10),6),IF($F$1=\"Knights\",OFFSET(Knights!$L$2,ROW($F10),6),IF($F$1=\"Hornets\",OFFSET(Hornets!$L$2,ROW($F10),6),IF($F$1=\"Guardians\",OFFSET(Wolves!$L$2,ROW($F10),6),IF($F$1=\"Reds\",OFFSET(Comets!$L$2,ROW($F10),6)))))))))","v":3},{"$f":"IF($F$1=\"Drillers\",OFFSET(Drillers!$L$2,ROW(F10),7),IF($F$1=\"Bulls\",OFFSET(Bulls!$L$2,ROW(F10),7),IF($F$1=\"Phantoms\",OFFSET(Phantoms!$L$2,ROW(F10),7),IF($F$1=\"Gators\",OFFSET(Gators!$L$2,ROW(F10),7),IF($F$1=\"Knights\",OFFSET(Knights!$L$2,ROW(F10),7),IF($F$1=\"Hornets\",OFFSET(Hornets!$L$2,ROW(F10),7),IF($F$1=\"Guardians\",OFFSET(Wolves!$L$2,ROW(F10),7),IF($F$1=\"Reds\",OFFSET(Comets!$L$2,ROW(F10),7),))))))))","v":3},{"$f":"IF($F$1=\"Drillers\",OFFSET(Drillers!$L$2,ROW(F10),8),IF($F$1=\"Bulls\",OFFSET(Bulls!$L$2,ROW(F10),8),IF($F$1=\"Phantoms\",OFFSET(Phantoms!$L$2,ROW(F10),8),IF($F$1=\"Gators\",OFFSET(Gators!$L$2,ROW(F10),8),IF($F$1=\"Knights\",OFFSET(Knights!$L$2,ROW(F10),8),IF($F$1=\"Hornets\",OFFSET(Hornets!$L$2,ROW(F10),8),IF($F$1=\"Guardians\",OFFSET(Wolves!$L$2,ROW(F10),8),IF($F$1=\"Reds\",OFFSET(Comets!$L$2,ROW(F10),8)))))))))","v":4},{"$f":"IF($F$1=\"Drillers\",OFFSET(Drillers!$L$2,ROW($F10),9),IF($F$1=\"Bulls\",OFFSET(Bulls!$L$2,ROW($F10),9),IF($F$1=\"Phantoms\",OFFSET(Phantoms!$L$2,ROW($F10),9),IF($F$1=\"Gators\",OFFSET(Gators!$L$2,ROW($F10),9),IF($F$1=\"Knights\",OFFSET(Knights!$L$2,ROW($F10),9),IF($F$1=\"Hornets\",OFFSET(Hornets!$L$2,ROW(F10),9),IF($F$1=\"Guardians\",OFFSET(Wolves!$L$2,ROW($F10),9),IF($F$1=\"Reds\",OFFSET(Comets!$L$2,ROW($F10),9)))))))))","v":3},{"$f":"IF($F$1=\"Drillers\",OFFSET(Drillers!$L$2,ROW(F10),10),IF($F$1=\"Bulls\",OFFSET(Bulls!$L$2,ROW(F10),10),IF($F$1=\"Phantoms\",OFFSET(Phantoms!$L$2,ROW(F10),10),IF($F$1=\"Gators\",OFFSET(Gators!$L$2,ROW(F10),10),IF($F$1=\"Knights\",OFFSET(Knights!$L$2,ROW(F10),10),IF($F$1=\"Hornets\",OFFSET(Hornets!$L$2,ROW(F10),10),IF($F$1=\"Guardians\",OFFSET(Wolves!$L$2,ROW(F10),10),IF($F$1=\"Reds\",OFFSET(Comets!$L$2,ROW(F10),10)))))))))","v":4},{"$f":"IF($F$1=\"Drillers\",OFFSET(Drillers!$L$2,ROW(F10),11),IF($F$1=\"Bulls\",OFFSET(Bulls!$L$2,ROW(F10),11),IF($F$1=\"Phantoms\",OFFSET(Phantoms!$L$2,ROW(F10),11),IF($F$1=\"Gators\",OFFSET(Gators!$L$2,ROW(F10),11),IF($F$1=\"Knights\",OFFSET(Knights!$L$2,ROW(F10),11),IF($F$1=\"Hornets\",OFFSET(Hornets!$L$2,ROW(F10),11),IF($F$1=\"Guardians\",OFFSET(Wolves!$L$2,ROW(F10),11),IF($F$1=\"Drillers\",OFFSET(Drillers!$L$2,ROW(F10),11),IF($F$1=\"Reds\",OFFSET(Comets!$L$2,ROW(F10),11))))))))))","v":4},{"$f":"IF($F$1=\"Drillers\",OFFSET(Drillers!$L$2,ROW(F10),12),IF($F$1=\"Bulls\",OFFSET(Bulls!$L$2,ROW(F10),12),IF($F$1=\"Phantoms\",OFFSET(Phantoms!$L$2,ROW(F10),12),IF($F$1=\"Gators\",OFFSET(Gators!$L$2,ROW(F10),12),IF($F$1=\"Knights\",OFFSET(Knights!$L$2,ROW(F10),12),IF($F$1=\"Hornets\",OFFSET(Hornets!$L$2,ROW(F10),12),IF($F$1=\"Guardians\",OFFSET(Wolves!$L$2,ROW(F10),12),IF($F$1=\"Reds\",OFFSET(Comets!$L$2,ROW(F10),12),))))))))","v":"LF"},{"$f":"IF($F$1=\"Drillers\",OFFSET(Drillers!$L$2,ROW(F10),13),IF($F$1=\"Bulls\",OFFSET(Bulls!$L$2,ROW(F10),13),IF($F$1=\"Phantoms\",OFFSET(Phantoms!$L$2,ROW(F10),13),IF($F$1=\"Gators\",OFFSET(Gators!$L$2,ROW(F10),13),IF($F$1=\"Knights\",OFFSET(Knights!$L$2,ROW(F10),13),IF($F$1=\"Hornets\",OFFSET(Hornets!$L$2,ROW(F10),13),IF($F$1=\"Guardians\",OFFSET(Wolves!$L$2,ROW(F10),13),IF($F$1=\"Reds\",OFFSET(Comets!$L$2,ROW(F10),13),))))))))","v":"RF"},{"$f":"IF($F$1=\"Drillers\",OFFSET(Drillers!$L$2,ROW(F10),14),IF($F$1=\"Bulls\",OFFSET(Bulls!$L$2,ROW(F10),14),IF($F$1=\"Phantoms\",OFFSET(Phantoms!$L$2,ROW(F10),14),IF($F$1=\"Gators\",OFFSET(Gators!$L$2,ROW(F10),14),IF($F$1=\"Knights\",OFFSET(Knights!$L$2,ROW(F10),14),IF($F$1=\"Hornets\",OFFSET(Hornets!$L$2,ROW(F10),14),IF($F$1=\"Guardians\",OFFSET(Wolves!$L$2,ROW(F10),14,),IF($F$1=\"Reds\",OFFSET(Comets!$L$2,ROW(F10),14)))))))))","v":2},{"$f":"IF($F$1=\"Drillers\",OFFSET(Drillers!$L$2,ROW(F10),15),IF($F$1=\"Bulls\",OFFSET(Bulls!$L$2,ROW(F10),15),IF($F$1=\"Phantoms\",OFFSET(Phantoms!$L$2,ROW(F10),15),IF($F$1=\"Gators\",OFFSET(Gators!$L$2,ROW(F10),15),IF($F$1=\"Knights\",OFFSET(Knights!$L$2,ROW(F10),15),IF($F$1=\"Hornets\",OFFSET(Hornets!$L$2,ROW(F10),15),IF($F$1=\"Guardians\",OFFSET(Wolves!$L$2,ROW(F10),15),IF($F$1=\"Reds\",OFFSET(Comets!$L$2,ROW(F10),15)))))))))","v":0},{"$f":"IF($F$1=\"Drillers\",OFFSET(Drillers!$L$2,ROW(F10),16),IF($F$1=\"Bulls\",OFFSET(Bulls!$L$2,ROW(F10),16),IF($F$1=\"Phantoms\",OFFSET(Phantoms!$L$2,ROW(F10),16),IF($F$1=\"Gators\",OFFSET(Gators!$L$2,ROW(F10),16),IF($F$1=\"Knights\",OFFSET(Knights!$L$2,ROW(F10),16),IF($F$1=\"Hornets\",OFFSET(Hornets!$L$2,ROW(F10),16),IF($F$1=\"Guardians\",OFFSET(Wolves!$L$2,ROW(F10),16),IF($F$1=\"Reds\",OFFSET(Comets!$L$2,ROW(F10),16)))))))))","v":0},{"$f":"IF($F$1=\"Drillers\",OFFSET(Drillers!$L$2,ROW($F10),17),IF($F$1=\"Bulls\",OFFSET(Bulls!$L$2,ROW($F10),17),IF($F$1=\"Phantoms\",OFFSET(Phantoms!$L$2,ROW($F10),17),IF($F$1=\"Gators\",OFFSET(Gators!$L$2,ROW($F10),17),IF($F$1=\"Knights\",OFFSET(Knights!$L$2,ROW($F10),17),IF($F$1=\"Hornets\",OFFSET(Hornets!$L$2,ROW($F10),17),IF($F$1=\"Guardians\",OFFSET(Wolves!$L$2,ROW($F10),17),IF($F$1=\"Reds\",OFFSET(Comets!$L$2,ROW($F10),17)))))))))","v":1},{"$nulls":7},10,{"$f":"IF($AE$1=\"Drillers\",OFFSET(Drillers!$L$2,ROW($AE10),1),IF($AE$1=\"Bulls\",OFFSET(Bulls!$L$2,ROW($AE10),1),IF($AE$1=\"Phantoms\",OFFSET(Phantoms!$L$2,ROW($AE10),1),IF($AE$1=\"Gators\",OFFSET(Gators!$L$2,ROW($AE10),1),IF($AE$1=\"Knights\",OFFSET(Knights!$L$2,ROW($AE10),1),IF($AE$1=\"Hornets\",OFFSET(Hornets!$L$2,ROW($AE10),1),IF($AE$1=\"Wolves\",OFFSET(Wolves!$L$2,ROW($AE10),1),IF(AE$1=\"Comets\",OFFSET(Comets!$L$2,ROW($AE10),1)))))))))","v":"Lopez"},{"$f":"IF($AE$1=\"Drillers\",OFFSET(Drillers!$L$2,ROW($AF10),2),IF($AE$1=\"Bulls\",OFFSET(Bulls!$L$2,ROW($AF10),2),IF($AE$1=\"Phantoms\",OFFSET(Phantoms!$L$2,ROW($AF10),2),IF($AE$1=\"Gators\",OFFSET(Gators!$L$2,ROW($AF10),2),IF($AE$1=\"Knights\",OFFSET(Knights!$L$2,ROW($AF10),2),IF($AE$1=\"Hornets\",OFFSET(Hornets!$L$2,ROW($AF10),2),IF($AE$1=\"Wolves\",OFFSET(Wolves!$L$2,ROW($AF10),2),IF($AE$1=\"Comets\",OFFSET(Comets!$L$2,ROW($AF10),2)))))))))","v":"Pedro"},{"$f":"IF($AE$1=\"Drillers\",OFFSET(Drillers!$L$2,ROW($AE10),3),IF($AE$1=\"Bulls\",OFFSET(Bulls!$L$2,ROW($AE10),3),IF($AE$1=\"Phantoms\",OFFSET(Phantoms!$L$2,ROW($AE10),3),IF($AE$1=\"Gators\",OFFSET(Gators!$L$2,ROW($AE10),3),IF($AE$1=\"Knights\",OFFSET(Knights!$L$2,ROW($AE10),3),IF($AE$1=\"Hornets\",OFFSET(Hornets!$L$2,ROW($AE10),3),IF($AE$1=\"Wolves\",OFFSET(Wolves!$L$2,ROW($AE10),3),IF($AE$1=\"Comets\",OFFSET(Comets!$L$2,ROW($AE10),3)))))))))","v":"L"},{"$f":"IF($AE$1=\"Drillers\",OFFSET(Drillers!$L$2,ROW($AE10),4),IF($AE$1=\"Bulls\",OFFSET(Bulls!$L$2,ROW($AE10),4),IF($AE$1=\"Phantoms\",OFFSET(Phantoms!$L$2,ROW($AE10),4),IF($AE$1=\"Gators\",OFFSET(Gators!$L$2,ROW($AE10),4),IF($AE$1=\"Knights\",OFFSET(Knights!$L$2,ROW($AE10),4),IF($AE$1=\"Hornets\",OFFSET(Hornets!$L$2,ROW($AE10),4),IF($AE$1=\"Wolves\",OFFSET(Wolves!$L$2,ROW($AE10),4),IF($AE$1=\"Comets\",OFFSET(Comets!$L$2,ROW($AE10),4)))))))))","v":"C"},{"$f":"IF($AE$1=\"Drillers\",OFFSET(Drillers!$L$2,ROW($AE10),5),IF($AE$1=\"Bulls\",OFFSET(Bulls!$L$2,ROW($AE10),5),IF($AE$1=\"Phantoms\",OFFSET(Phantoms!$L$2,ROW($AE10),5),IF($AE$1=\"Gators\",OFFSET(Gators!$L$2,ROW($AE10),5),IF($AE$1=\"Knights\",OFFSET(Knights!$L$2,ROW($AE10),5),IF($AE$1=\"Hornets\",OFFSET(Hornets!$L$2,ROW($AE10),5),IF($AE$1=\"Wolves\",OFFSET(Wolves!$L$2,ROW($AE10),5),IF($AE$1=\"Comets\",OFFSET(Comets!$L$2,ROW($AE10),5)))))))))","v":2},{"$f":"IF($AE$1=\"Drillers\",OFFSET(Drillers!$L$2,ROW($AE10),6),IF($AE$1=\"Bulls\",OFFSET(Bulls!$L$2,ROW($AE10),6),IF($AE$1=\"Phantoms\",OFFSET(Phantoms!$L$2,ROW($AE10),6),IF($AE$1=\"Gators\",OFFSET(Gators!$L$2,ROW($AE10),6),IF($AE$1=\"Knights\",OFFSET(Knights!$L$2,ROW($AE10),6),IF($AE$1=\"Hornets\",OFFSET(Hornets!$L$2,ROW($AE10),6),IF($AE$1=\"Wolves\",OFFSET(Wolves!$L$2,ROW($AE10),6),IF($AE$1=\"Comets\",OFFSET(Comets!$L$2,ROW($AE10),6)))))))))","v":2},{"$f":"IF($AE$1=\"Drillers\",OFFSET(Drillers!$L$2,ROW($AE10),7),IF($AE$1=\"Bulls\",OFFSET(Bulls!$L$2,ROW($AE10),7),IF($AE$1=\"Phantoms\",OFFSET(Phantoms!$L$2,ROW($AE10),7),IF($AE$1=\"Gators\",OFFSET(Gators!$L$2,ROW($AE10),7),IF($AE$1=\"Knights\",OFFSET(Knights!$L$2,ROW($AE10),7),IF($AE$1=\"Hornets\",OFFSET(Hornets!$L$2,ROW($AE10),7),IF($AE$1=\"Wolves\",OFFSET(Wolves!$L$2,ROW($AE10),7),IF($AE$1=\"Comets\",OFFSET(Comets!$L$2,ROW($AE10),7)))))))))","v":5},{"$f":"IF($AE$1=\"Drillers\",OFFSET(Drillers!$L$2,ROW($AE10),8),IF($AE$1=\"Bulls\",OFFSET(Bulls!$L$2,ROW($AE10),8),IF($AE$1=\"Phantoms\",OFFSET(Phantoms!$L$2,ROW($AE10),8),IF($AE$1=\"Gators\",OFFSET(Gators!$L$2,ROW($AE10),8),IF($AE$1=\"Knights\",OFFSET(Knights!$L$2,ROW($AE10),8),IF($AE$1=\"Hornets\",OFFSET(Hornets!$L$2,ROW($AE10),8),IF($AE$1=\"Wolves\",OFFSET(Wolves!$L$2,ROW($AE10),8),IF($AE$1=\"Comets\",OFFSET(Comets!$L$2,ROW($AE10),8)))))))))","v":3},{"$f":"IF($AE$1=\"Drillers\",OFFSET(Drillers!$L$2,ROW($AE10),9),IF($AE$1=\"Bulls\",OFFSET(Bulls!$L$2,ROW($AE10),9),IF($AE$1=\"Phantoms\",OFFSET(Phantoms!$L$2,ROW($AE10),9),IF($AE$1=\"Gators\",OFFSET(Gators!$L$2,ROW($AE10),9),IF($AE$1=\"Knights\",OFFSET(Knights!$L$2,ROW($AE10),9),IF($AE$1=\"Hornets\",OFFSET(Hornets!$L$2,ROW($AE10),9),IF($AE$1=\"Wolves\",OFFSET(Wolves!$L$2,ROW($AE10),9),IF($AE$1=\"Comets\",OFFSET(Comets!$L$2,ROW($AE10),9)))))))))","v":2},{"$f":"IF($AE$1=\"Drillers\",OFFSET(Drillers!$L$2,ROW($AE10),10),IF($AE$1=\"Bulls\",OFFSET(Bulls!$L$2,ROW($AE10),10),IF($AE$1=\"Phantoms\",OFFSET(Phantoms!$L$2,ROW($AE10),10),IF($AE$1=\"Gators\",OFFSET(Gators!$L$2,ROW($AE10),10),IF($AE$1=\"Knights\",OFFSET(Knights!$L$2,ROW($AE10),10),IF($AE$1=\"Hornets\",OFFSET(Hornets!$L$2,ROW($AE10),10),IF($AE$1=\"Wolves\",OFFSET(Wolves!$L$2,ROW($AE10),10),IF($AE$1=\"Comets\",OFFSET(Comets!$L$2,ROW($AE10),10)))))))))","v":2},{"$f":"IF($AE$1=\"Drillers\",OFFSET(Drillers!$L$2,ROW($AE10),11),IF($AE$1=\"Bulls\",OFFSET(Bulls!$L$2,ROW($AE10),11),IF($AE$1=\"Phantoms\",OFFSET(Phantoms!$L$2,ROW($AE10),11),IF($AE$1=\"Gators\",OFFSET(Gators!$L$2,ROW($AE10),11),IF($AE$1=\"Knights\",OFFSET(Knights!$L$2,ROW($AE10),11),IF($AE$1=\"Hornets\",OFFSET(Hornets!$L$2,ROW($AE10),11),IF($AE$1=\"Wolves\",OFFSET(Wolves!$L$2,ROW($AE10),11),IF($AE$1=\"Comets\",OFFSET(Comets!$L$2,ROW($AE10),11)))))))))","v":2},{"$f":"IF($AE$1=\"Drillers\",OFFSET(Drillers!$L$2,ROW($AE10),12),IF($AE$1=\"Bulls\",OFFSET(Bulls!$L$2,ROW($AE10),12),IF($AE$1=\"Phantoms\",OFFSET(Phantoms!$L$2,ROW($AE10),12),IF($AE$1=\"Gators\",OFFSET(Gators!$L$2,ROW($AE10),12),IF($AE$1=\"Knights\",OFFSET(Knights!$L$2,ROW($AE10),12),IF($AE$1=\"Hornets\",OFFSET(Hornets!$L$2,ROW($AE10),12),IF($AE$1=\"Wolves\",OFFSET(Wolves!$L$2,ROW($AE10),12),IF($AE$1=\"Comets\",OFFSET(Comets!$L$2,ROW($AE10),12)))))))))","v":"INF"},{"$f":"IF($AE$1=\"Drillers\",OFFSET(Drillers!$L$2,ROW($AE10),13),IF($AE$1=\"Bulls\",OFFSET(Bulls!$L$2,ROW($AE10),13),IF($AE$1=\"Phantoms\",OFFSET(Phantoms!$L$2,ROW($AE10),13),IF($AE$1=\"Gators\",OFFSET(Gators!$L$2,ROW($AE10),13),IF($AE$1=\"Knights\",OFFSET(Knights!$L$2,ROW($AE10),13),IF($AE$1=\"Hornets\",OFFSET(Hornets!$L$2,ROW($AE10),13),IF($AE$1=\"Wolves\",OFFSET(Wolves!$L$2,ROW($AE10),13),IF($AE$1=\"Comets\",OFFSET(Comets!$L$2,ROW($AE10),13)))))))))","v":0},{"$f":"IF($AE$1=\"Drillers\",OFFSET(Drillers!$L$2,ROW($AE10),14),IF($AE$1=\"Bulls\",OFFSET(Bulls!$L$2,ROW($AE10),14),IF($AE$1=\"Phantoms\",OFFSET(Phantoms!$L$2,ROW($AE10),14),IF($AE$1=\"Gators\",OFFSET(Gators!$L$2,ROW($AE10),14),IF($AE$1=\"Knights\",OFFSET(Knights!$L$2,ROW($AE10),14),IF($AE$1=\"Hornets\",OFFSET(Hornets!$L$2,ROW($AE10),14),IF($AE$1=\"Wolves\",OFFSET(Wolves!$L$2,ROW($AE10),14),IF($AE$1=\"Comets\",OFFSET(Comets!$L$2,ROW($AE10),14)))))))))","v":1},{"$f":"IF(AE$1=\"Drillers\",OFFSET(Drillers!$L$2,ROW(AE10),15),IF(AE$1=\"Bulls\",OFFSET(Bulls!$L$2,ROW(AE10),15),IF(AE$1=\"Phantoms\",OFFSET(Phantoms!$L$2,ROW(AE10),15),IF(AE$1=\"Gators\",OFFSET(Gators!$L$2,ROW(AE10),15),IF(AE$1=\"Knights\",OFFSET(Knights!$L$2,ROW(AE10),15),IF(AE$1=\"Hornets\",OFFSET(Hornets!$L$2,ROW(AE10),15),IF(AE$1=\"Wolves\",OFFSET(Wolves!$L$2,ROW(AE10),15),IF(AE$1=\"Comets\",OFFSET(Comets!$L$2,ROW(AE10),15)))))))))","v":0},{"$f":"IF($AE$1=\"Drillers\",OFFSET(Drillers!$L$2,ROW(AE10),16),IF($AE$1=\"Bulls\",OFFSET(Bulls!$L$2,ROW(AE10),16),IF($AE$1=\"Phantoms\",OFFSET(Phantoms!$L$2,ROW(AE10),16),IF($AE$1=\"Gators\",OFFSET(Gators!$L$2,ROW(AE10),16),IF($AE$1=\"Knights\",OFFSET(Knights!$L$2,ROW(AE10),16),IF($AE$1=\"Hornets\",OFFSET(Hornets!$L$2,ROW(AE10),16),IF($AE$1=\"Wolves\",OFFSET(Wolves!$L$2,ROW(AE10),16),IF($AE$1=\"Comets\",OFFSET(Comets!$L$2,ROW(AE10),16)))))))))","v":0},{"$f":"IF($AE$1=\"Drillers\",OFFSET(Drillers!$L$2,ROW($AE10),17),IF($AE$1=\"Bulls\",OFFSET(Bulls!$L$2,ROW($AE10),17),IF($AE$1=\"Phantoms\",OFFSET(Phantoms!$L$2,ROW($AE10),17),IF($AE$1=\"Gators\",OFFSET(Gators!$L$2,ROW($AE10),17),IF($AE$1=\"Knights\",OFFSET(Knights!$L$2,ROW($AE10),17),IF($AE$1=\"Hornets\",OFFSET(Hornets!$L$2,ROW($AE10),17),IF($AE$1=\"Wolves\",OFFSET(Wolves!$L$2,ROW($AE10),17),IF($AE$1=\"Comets\",OFFSET(Comets!$L$2,ROW($AE10),17)))))))))","v":1}]
[{"$nulls":4},11,{"$f":"IF($F$1=\"Drillers\",OFFSET(Drillers!$L$2,ROW($F11),1),IF($F$1=\"Bulls\",OFFSET(Bulls!$L$2,ROW($F11),1),IF($F$1=\"Phantoms\",OFFSET(Phantoms!$L$2,ROW($F11),1),IF($F$1=\"Gators\",OFFSET(Gators!$L$2,ROW($F11),1),IF($F$1=\"Knights\",OFFSET(Knights!$L$2,ROW($F11),1),IF($F$1=\"Hornets\",OFFSET(Hornets!$L$2,ROW($F11),1),IF($F$1=\"Reds\",OFFSET(Comets!$L$2,ROW($F11),1),IF($F$1=\"Guardians\",OFFSET(Wolves!$L$2,ROW($F11),1)))))))))","v":"Ornelas"},{"$f":"IF($F$1=\"Drillers\",OFFSET(Drillers!$L$2,ROW($F11),2),IF($F$1=\"Bulls\",OFFSET(Bulls!$L$2,ROW($F11),2),IF($F$1=\"Phantoms\",OFFSET(Phantoms!$L$2,ROW($F11),2),IF($F$1=\"Gators\",OFFSET(Gators!$L$2,ROW($F11),2),IF($F$1=\"Knights\",OFFSET(Knights!$L$2,ROW($F11),2),IF($F$1=\"Hornets\",OFFSET(Hornets!$L$2,ROW($F11),2),IF($F$1=\"Reds\",OFFSET(Comets!$L$2,ROW($F11),2),IF($F$1=\"Guardians\",OFFSET(Wolves!$L$2,ROW($F11),2)))))))))","v":"Colton"},{"$f":"IF($F$1=\"Drillers\",OFFSET(Drillers!$L$2,ROW($F11),3),IF($F$1=\"Bulls\",OFFSET(Bulls!$L$2,ROW($F11),3),IF($F$1=\"Phantoms\",OFFSET(Phantoms!$L$2,ROW($F11),3),IF($F$1=\"Gators\",OFFSET(Gators!$L$2,ROW($F11),3),IF($F$1=\"Knights\",OFFSET(Knights!$L$2,ROW($F11),3),IF($F$1=\"Hornets\",OFFSET(Hornets!$L$2,ROW($F11),3),IF($F$1=\"Guardians\",OFFSET(Wolves!$L$2,ROW($F11),3),IF($F$1=\"Reds\",OFFSET(Comets!$L$2,ROW($F11),3)))))))))","v":"R"},{"$f":"IF($F$1=\"Drillers\",OFFSET(Drillers!$L$2,ROW($F11),4),IF($F$1=\"Bulls\",OFFSET(Bulls!$L$2,ROW($F11),4),IF($F$1=\"Phantoms\",OFFSET(Phantoms!$L$2,ROW($F11),4),IF($F$1=\"Gators\",OFFSET(Gators!$L$2,ROW($F11),4),IF($F$1=\"Knights\",OFFSET(Knights!$L$2,ROW($F11),4),IF($F$1=\"Hornets\",OFFSET(Hornets!$L$2,ROW($F11),4),IF($F$1=\"Guardians\",OFFSET(Wolves!$L$2,ROW($F11),4),IF($F$1=\"Reds\",OFFSET(Comets!$L$2,ROW($F11),4)))))))))","v":"LF"},{"$f":"IF($F$1=\"Drillers\",OFFSET(Drillers!$L$2,ROW($F11),5),IF($F$1=\"Bulls\",OFFSET(Bulls!$L$2,ROW($F11),5),IF($F$1=\"Phantoms\",OFFSET(Phantoms!$L$2,ROW($F11),5),IF($F$1=\"Gators\",OFFSET(Gators!$L$2,ROW($F11),5),IF($F$1=\"Knights\",OFFSET(Knights!$L$2,ROW($F11),5),IF($F$1=\"Hornets\",OFFSET(Hornets!$L$2,ROW($F11),5),IF($F$1=\"Guardians\",OFFSET(Wolves!$L$2,ROW($F11),5),IF($F$1=\"Reds\",OFFSET(Comets!$L$2,ROW($F11),5)))))))))","v":2},{"$f":"IF($F$1=\"Drillers\",OFFSET(Drillers!$L$2,ROW($F11),6),IF($F$1=\"Bulls\",OFFSET(Bulls!$L$2,ROW($F11),6),IF($F$1=\"Phantoms\",OFFSET(Phantoms!$L$2,ROW($F11),6),IF($F$1=\"Gators\",OFFSET(Gators!$L$2,ROW($F11),6),IF($F$1=\"Knights\",OFFSET(Knights!$L$2,ROW($F11),6),IF($F$1=\"Hornets\",OFFSET(Hornets!$L$2,ROW($F11),6),IF($F$1=\"Guardians\",OFFSET(Wolves!$L$2,ROW($F11),6),IF($F$1=\"Reds\",OFFSET(Comets!$L$2,ROW($F11),6)))))))))","v":2},{"$f":"IF($F$1=\"Drillers\",OFFSET(Drillers!$L$2,ROW(F11),7),IF($F$1=\"Bulls\",OFFSET(Bulls!$L$2,ROW(F11),7),IF($F$1=\"Phantoms\",OFFSET(Phantoms!$L$2,ROW(F11),7),IF($F$1=\"Gators\",OFFSET(Gators!$L$2,ROW(F11),7),IF($F$1=\"Knights\",OFFSET(Knights!$L$2,ROW(F11),7),IF($F$1=\"Hornets\",OFFSET(Hornets!$L$2,ROW(F11),7),IF($F$1=\"Guardians\",OFFSET(Wolves!$L$2,ROW(F11),7),IF($F$1=\"Reds\",OFFSET(Comets!$L$2,ROW(F11),7),))))))))","v":2},{"$f":"IF($F$1=\"Drillers\",OFFSET(Drillers!$L$2,ROW(F11),8),IF($F$1=\"Bulls\",OFFSET(Bulls!$L$2,ROW(F11),8),IF($F$1=\"Phantoms\",OFFSET(Phantoms!$L$2,ROW(F11),8),IF($F$1=\"Gators\",OFFSET(Gators!$L$2,ROW(F11),8),IF($F$1=\"Knights\",OFFSET(Knights!$L$2,ROW(F11),8),IF($F$1=\"Hornets\",OFFSET(Hornets!$L$2,ROW(F11),8),IF($F$1=\"Guardians\",OFFSET(Wolves!$L$2,ROW(F11),8),IF($F$1=\"Reds\",OFFSET(Comets!$L$2,ROW(F11),8)))))))))","v":5},{"$f":"IF($F$1=\"Drillers\",OFFSET(Drillers!$L$2,ROW($F11),9),IF($F$1=\"Bulls\",OFFSET(Bulls!$L$2,ROW($F11),9),IF($F$1=\"Phantoms\",OFFSET(Phantoms!$L$2,ROW($F11),9),IF($F$1=\"Gators\",OFFSET(Gators!$L$2,ROW($F11),9),IF($F$1=\"Knights\",OFFSET(Knights!$L$2,ROW($F11),9),IF($F$1=\"Hornets\",OFFSET(Hornets!$L$2,ROW(F11),9),IF($F$1=\"Guardians\",OFFSET(Wolves!$L$2,ROW($F11),9),IF($F$1=\"Reds\",OFFSET(Comets!$L$2,ROW($F11),9)))))))))","v":3},{"$f":"IF($F$1=\"Drillers\",OFFSET(Drillers!$L$2,ROW(F11),10),IF($F$1=\"Bulls\",OFFSET(Bulls!$L$2,ROW(F11),10),IF($F$1=\"Phantoms\",OFFSET(Phantoms!$L$2,ROW(F11),10),IF($F$1=\"Gators\",OFFSET(Gators!$L$2,ROW(F11),10),IF($F$1=\"Knights\",OFFSET(Knights!$L$2,ROW(F11),10),IF($F$1=\"Hornets\",OFFSET(Hornets!$L$2,ROW(F11),10),IF($F$1=\"Guardians\",OFFSET(Wolves!$L$2,ROW(F11),10),IF($F$1=\"Reds\",OFFSET(Comets!$L$2,ROW(F11),10)))))))))","v":5},{"$f":"IF($F$1=\"Drillers\",OFFSET(Drillers!$L$2,ROW(F11),11),IF($F$1=\"Bulls\",OFFSET(Bulls!$L$2,ROW(F11),11),IF($F$1=\"Phantoms\",OFFSET(Phantoms!$L$2,ROW(F11),11),IF($F$1=\"Gators\",OFFSET(Gators!$L$2,ROW(F11),11),IF($F$1=\"Knights\",OFFSET(Knights!$L$2,ROW(F11),11),IF($F$1=\"Hornets\",OFFSET(Hornets!$L$2,ROW(F11),11),IF($F$1=\"Guardians\",OFFSET(Wolves!$L$2,ROW(F11),11),IF($F$1=\"Drillers\",OFFSET(Drillers!$L$2,ROW(F11),11),IF($F$1=\"Reds\",OFFSET(Comets!$L$2,ROW(F11),11))))))))))","v":2},{"$f":"IF($F$1=\"Drillers\",OFFSET(Drillers!$L$2,ROW(F11),12),IF($F$1=\"Bulls\",OFFSET(Bulls!$L$2,ROW(F11),12),IF($F$1=\"Phantoms\",OFFSET(Phantoms!$L$2,ROW(F11),12),IF($F$1=\"Gators\",OFFSET(Gators!$L$2,ROW(F11),12),IF($F$1=\"Knights\",OFFSET(Knights!$L$2,ROW(F11),12),IF($F$1=\"Hornets\",OFFSET(Hornets!$L$2,ROW(F11),12),IF($F$1=\"Guardians\",OFFSET(Wolves!$L$2,ROW(F11),12),IF($F$1=\"Reds\",OFFSET(Comets!$L$2,ROW(F11),12),))))))))","v":"OF"},{"$f":"IF($F$1=\"Drillers\",OFFSET(Drillers!$L$2,ROW(F11),13),IF($F$1=\"Bulls\",OFFSET(Bulls!$L$2,ROW(F11),13),IF($F$1=\"Phantoms\",OFFSET(Phantoms!$L$2,ROW(F11),13),IF($F$1=\"Gators\",OFFSET(Gators!$L$2,ROW(F11),13),IF($F$1=\"Knights\",OFFSET(Knights!$L$2,ROW(F11),13),IF($F$1=\"Hornets\",OFFSET(Hornets!$L$2,ROW(F11),13),IF($F$1=\"Guardians\",OFFSET(Wolves!$L$2,ROW(F11),13),IF($F$1=\"Reds\",OFFSET(Comets!$L$2,ROW(F11),13),))))))))","v":0},{"$f":"IF($F$1=\"Drillers\",OFFSET(Drillers!$L$2,ROW(F11),14),IF($F$1=\"Bulls\",OFFSET(Bulls!$L$2,ROW(F11),14),IF($F$1=\"Phantoms\",OFFSET(Phantoms!$L$2,ROW(F11),14),IF($F$1=\"Gators\",OFFSET(Gators!$L$2,ROW(F11),14),IF($F$1=\"Knights\",OFFSET(Knights!$L$2,ROW(F11),14),IF($F$1=\"Hornets\",OFFSET(Hornets!$L$2,ROW(F11),14),IF($F$1=\"Guardians\",OFFSET(Wolves!$L$2,ROW(F11),14,),IF($F$1=\"Reds\",OFFSET(Comets!$L$2,ROW(F11),14)))))))))","v":3},{"$f":"IF($F$1=\"Drillers\",OFFSET(Drillers!$L$2,ROW(F11),15),IF($F$1=\"Bulls\",OFFSET(Bulls!$L$2,ROW(F11),15),IF($F$1=\"Phantoms\",OFFSET(Phantoms!$L$2,ROW(F11),15),IF($F$1=\"Gators\",OFFSET(Gators!$L$2,ROW(F11),15),IF($F$1=\"Knights\",OFFSET(Knights!$L$2,ROW(F11),15),IF($F$1=\"Hornets\",OFFSET(Hornets!$L$2,ROW(F11),15),IF($F$1=\"Guardians\",OFFSET(Wolves!$L$2,ROW(F11),15),IF($F$1=\"Reds\",OFFSET(Comets!$L$2,ROW(F11),15)))))))))","v":0},{"$f":"IF($F$1=\"Drillers\",OFFSET(Drillers!$L$2,ROW(F11),16),IF($F$1=\"Bulls\",OFFSET(Bulls!$L$2,ROW(F11),16),IF($F$1=\"Phantoms\",OFFSET(Phantoms!$L$2,ROW(F11),16),IF($F$1=\"Gators\",OFFSET(Gators!$L$2,ROW(F11),16),IF($F$1=\"Knights\",OFFSET(Knights!$L$2,ROW(F11),16),IF($F$1=\"Hornets\",OFFSET(Hornets!$L$2,ROW(F11),16),IF($F$1=\"Guardians\",OFFSET(Wolves!$L$2,ROW(F11),16),IF($F$1=\"Reds\",OFFSET(Comets!$L$2,ROW(F11),16)))))))))","v":0},{"$f":"IF($F$1=\"Drillers\",OFFSET(Drillers!$L$2,ROW($F11),17),IF($F$1=\"Bulls\",OFFSET(Bulls!$L$2,ROW($F11),17),IF($F$1=\"Phantoms\",OFFSET(Phantoms!$L$2,ROW($F11),17),IF($F$1=\"Gators\",OFFSET(Gators!$L$2,ROW($F11),17),IF($F$1=\"Knights\",OFFSET(Knights!$L$2,ROW($F11),17),IF($F$1=\"Hornets\",OFFSET(Hornets!$L$2,ROW($F11),17),IF($F$1=\"Guardians\",OFFSET(Wolves!$L$2,ROW($F11),17),IF($F$1=\"Reds\",OFFSET(Comets!$L$2,ROW($F11),17)))))))))","v":1},{"$nulls":7},11,{"$f":"IF($AE$1=\"Drillers\",OFFSET(Drillers!$L$2,ROW($AE11),1),IF($AE$1=\"Bulls\",OFFSET(Bulls!$L$2,ROW($AE11),1),IF($AE$1=\"Phantoms\",OFFSET(Phantoms!$L$2,ROW($AE11),1),IF($AE$1=\"Gators\",OFFSET(Gators!$L$2,ROW($AE11),1),IF($AE$1=\"Knights\",OFFSET(Knights!$L$2,ROW($AE11),1),IF($AE$1=\"Hornets\",OFFSET(Hornets!$L$2,ROW($AE11),1),IF($AE$1=\"Wolves\",OFFSET(Wolves!$L$2,ROW($AE11),1),IF(AE$1=\"Comets\",OFFSET(Comets!$L$2,ROW($AE11),1)))))))))","v":"Castillo"},{"$f":"IF($AE$1=\"Drillers\",OFFSET(Drillers!$L$2,ROW($AF11),2),IF($AE$1=\"Bulls\",OFFSET(Bulls!$L$2,ROW($AF11),2),IF($AE$1=\"Phantoms\",OFFSET(Phantoms!$L$2,ROW($AF11),2),IF($AE$1=\"Gators\",OFFSET(Gators!$L$2,ROW($AF11),2),IF($AE$1=\"Knights\",OFFSET(Knights!$L$2,ROW($AF11),2),IF($AE$1=\"Hornets\",OFFSET(Hornets!$L$2,ROW($AF11),2),IF($AE$1=\"Wolves\",OFFSET(Wolves!$L$2,ROW($AF11),2),IF($AE$1=\"Comets\",OFFSET(Comets!$L$2,ROW($AF11),2)))))))))","v":"Ivan"},{"$f":"IF($AE$1=\"Drillers\",OFFSET(Drillers!$L$2,ROW($AE11),3),IF($AE$1=\"Bulls\",OFFSET(Bulls!$L$2,ROW($AE11),3),IF($AE$1=\"Phantoms\",OFFSET(Phantoms!$L$2,ROW($AE11),3),IF($AE$1=\"Gators\",OFFSET(Gators!$L$2,ROW($AE11),3),IF($AE$1=\"Knights\",OFFSET(Knights!$L$2,ROW($AE11),3),IF($AE$1=\"Hornets\",OFFSET(Hornets!$L$2,ROW($AE11),3),IF($AE$1=\"Wolves\",OFFSET(Wolves!$L$2,ROW($AE11),3),IF($AE$1=\"Comets\",OFFSET(Comets!$L$2,ROW($AE11),3)))))))))","v":"R"},{"$f":"IF($AE$1=\"Drillers\",OFFSET(Drillers!$L$2,ROW($AE11),4),IF($AE$1=\"Bulls\",OFFSET(Bulls!$L$2,ROW($AE11),4),IF($AE$1=\"Phantoms\",OFFSET(Phantoms!$L$2,ROW($AE11),4),IF($AE$1=\"Gators\",OFFSET(Gators!$L$2,ROW($AE11),4),IF($AE$1=\"Knights\",OFFSET(Knights!$L$2,ROW($AE11),4),IF($AE$1=\"Hornets\",OFFSET(Hornets!$L$2,ROW($AE11),4),IF($AE$1=\"Wolves\",OFFSET(Wolves!$L$2,ROW($AE11),4),IF($AE$1=\"Comets\",OFFSET(Comets!$L$2,ROW($AE11),4)))))))))","v":"C"},{"$f":"IF($AE$1=\"Drillers\",OFFSET(Drillers!$L$2,ROW($AE11),5),IF($AE$1=\"Bulls\",OFFSET(Bulls!$L$2,ROW($AE11),5),IF($AE$1=\"Phantoms\",OFFSET(Phantoms!$L$2,ROW($AE11),5),IF($AE$1=\"Gators\",OFFSET(Gators!$L$2,ROW($AE11),5),IF($AE$1=\"Knights\",OFFSET(Knights!$L$2,ROW($AE11),5),IF($AE$1=\"Hornets\",OFFSET(Hornets!$L$2,ROW($AE11),5),IF($AE$1=\"Wolves\",OFFSET(Wolves!$L$2,ROW($AE11),5),IF($AE$1=\"Comets\",OFFSET(Comets!$L$2,ROW($AE11),5)))))))))","v":5},{"$f":"IF($AE$1=\"Drillers\",OFFSET(Drillers!$L$2,ROW($AE11),6),IF($AE$1=\"Bulls\",OFFSET(Bulls!$L$2,ROW($AE11),6),IF($AE$1=\"Phantoms\",OFFSET(Phantoms!$L$2,ROW($AE11),6),IF($AE$1=\"Gators\",OFFSET(Gators!$L$2,ROW($AE11),6),IF($AE$1=\"Knights\",OFFSET(Knights!$L$2,ROW($AE11),6),IF($AE$1=\"Hornets\",OFFSET(Hornets!$L$2,ROW($AE11),6),IF($AE$1=\"Wolves\",OFFSET(Wolves!$L$2,ROW($AE11),6),IF($AE$1=\"Comets\",OFFSET(Comets!$L$2,ROW($AE11),6)))))))))","v":3},{"$f":"IF($AE$1=\"Drillers\",OFFSET(Drillers!$L$2,ROW($AE11),7),IF($AE$1=\"Bulls\",OFFSET(Bulls!$L$2,ROW($AE11),7),IF($AE$1=\"Phantoms\",OFFSET(Phantoms!$L$2,ROW($AE11),7),IF($AE$1=\"Gators\",OFFSET(Gators!$L$2,ROW($AE11),7),IF($AE$1=\"Knights\",OFFSET(Knights!$L$2,ROW($AE11),7),IF($AE$1=\"Hornets\",OFFSET(Hornets!$L$2,ROW($AE11),7),IF($AE$1=\"Wolves\",OFFSET(Wolves!$L$2,ROW($AE11),7),IF($AE$1=\"Comets\",OFFSET(Comets!$L$2,ROW($AE11),7)))))))))","v":1},{"$f":"IF($AE$1=\"Drillers\",OFFSET(Drillers!$L$2,ROW($AE11),8),IF($AE$1=\"Bulls\",OFFSET(Bulls!$L$2,ROW($AE11),8),IF($AE$1=\"Phantoms\",OFFSET(Phantoms!$L$2,ROW($AE11),8),IF($AE$1=\"Gators\",OFFSET(Gators!$L$2,ROW($AE11),8),IF($AE$1=\"Knights\",OFFSET(Knights!$L$2,ROW($AE11),8),IF($AE$1=\"Hornets\",OFFSET(Hornets!$L$2,ROW($AE11),8),IF($AE$1=\"Wolves\",OFFSET(Wolves!$L$2,ROW($AE11),8),IF($AE$1=\"Comets\",OFFSET(Comets!$L$2,ROW($AE11),8)))))))))","v":2},{"$f":"IF($AE$1=\"Drillers\",OFFSET(Drillers!$L$2,ROW($AE11),9),IF($AE$1=\"Bulls\",OFFSET(Bulls!$L$2,ROW($AE11),9),IF($AE$1=\"Phantoms\",OFFSET(Phantoms!$L$2,ROW($AE11),9),IF($AE$1=\"Gators\",OFFSET(Gators!$L$2,ROW($AE11),9),IF($AE$1=\"Knights\",OFFSET(Knights!$L$2,ROW($AE11),9),IF($AE$1=\"Hornets\",OFFSET(Hornets!$L$2,ROW($AE11),9),IF($AE$1=\"Wolves\",OFFSET(Wolves!$L$2,ROW($AE11),9),IF($AE$1=\"Comets\",OFFSET(Comets!$L$2,ROW($AE11),9)))))))))","v":2},{"$f":"IF($AE$1=\"Drillers\",OFFSET(Drillers!$L$2,ROW($AE11),10),IF($AE$1=\"Bulls\",OFFSET(Bulls!$L$2,ROW($AE11),10),IF($AE$1=\"Phantoms\",OFFSET(Phantoms!$L$2,ROW($AE11),10),IF($AE$1=\"Gators\",OFFSET(Gators!$L$2,ROW($AE11),10),IF($AE$1=\"Knights\",OFFSET(Knights!$L$2,ROW($AE11),10),IF($AE$1=\"Hornets\",OFFSET(Hornets!$L$2,ROW($AE11),10),IF($AE$1=\"Wolves\",OFFSET(Wolves!$L$2,ROW($AE11),10),IF($AE$1=\"Comets\",OFFSET(Comets!$L$2,ROW($AE11),10)))))))))","v":4},{"$f":"IF($AE$1=\"Drillers\",OFFSET(Drillers!$L$2,ROW($AE11),11),IF($AE$1=\"Bulls\",OFFSET(Bulls!$L$2,ROW($AE11),11),IF($AE$1=\"Phantoms\",OFFSET(Phantoms!$L$2,ROW($AE11),11),IF($AE$1=\"Gators\",OFFSET(Gators!$L$2,ROW($AE11),11),IF($AE$1=\"Knights\",OFFSET(Knights!$L$2,ROW($AE11),11),IF($AE$1=\"Hornets\",OFFSET(Hornets!$L$2,ROW($AE11),11),IF($AE$1=\"Wolves\",OFFSET(Wolves!$L$2,ROW($AE11),11),IF($AE$1=\"Comets\",OFFSET(Comets!$L$2,ROW($AE11),11)))))))))","v":4},{"$f":"IF($AE$1=\"Drillers\",OFFSET(Drillers!$L$2,ROW($AE11),12),IF($AE$1=\"Bulls\",OFFSET(Bulls!$L$2,ROW($AE11),12),IF($AE$1=\"Phantoms\",OFFSET(Phantoms!$L$2,ROW($AE11),12),IF($AE$1=\"Gators\",OFFSET(Gators!$L$2,ROW($AE11),12),IF($AE$1=\"Knights\",OFFSET(Knights!$L$2,ROW($AE11),12),IF($AE$1=\"Hornets\",OFFSET(Hornets!$L$2,ROW($AE11),12),IF($AE$1=\"Wolves\",OFFSET(Wolves!$L$2,ROW($AE11),12),IF($AE$1=\"Comets\",OFFSET(Comets!$L$2,ROW($AE11),12)))))))))","v":"1B"},{"$f":"IF($AE$1=\"Drillers\",OFFSET(Drillers!$L$2,ROW($AE11),13),IF($AE$1=\"Bulls\",OFFSET(Bulls!$L$2,ROW($AE11),13),IF($AE$1=\"Phantoms\",OFFSET(Phantoms!$L$2,ROW($AE11),13),IF($AE$1=\"Gators\",OFFSET(Gators!$L$2,ROW($AE11),13),IF($AE$1=\"Knights\",OFFSET(Knights!$L$2,ROW($AE11),13),IF($AE$1=\"Hornets\",OFFSET(Hornets!$L$2,ROW($AE11),13),IF($AE$1=\"Wolves\",OFFSET(Wolves!$L$2,ROW($AE11),13),IF($AE$1=\"Comets\",OFFSET(Comets!$L$2,ROW($AE11),13)))))))))","v":0},{"$f":"IF($AE$1=\"Drillers\",OFFSET(Drillers!$L$2,ROW($AE11),14),IF($AE$1=\"Bulls\",OFFSET(Bulls!$L$2,ROW($AE11),14),IF($AE$1=\"Phantoms\",OFFSET(Phantoms!$L$2,ROW($AE11),14),IF($AE$1=\"Gators\",OFFSET(Gators!$L$2,ROW($AE11),14),IF($AE$1=\"Knights\",OFFSET(Knights!$L$2,ROW($AE11),14),IF($AE$1=\"Hornets\",OFFSET(Hornets!$L$2,ROW($AE11),14),IF($AE$1=\"Wolves\",OFFSET(Wolves!$L$2,ROW($AE11),14),IF($AE$1=\"Comets\",OFFSET(Comets!$L$2,ROW($AE11),14)))))))))","v":2},{"$f":"IF(AE$1=\"Drillers\",OFFSET(Drillers!$L$2,ROW(AE11),15),IF(AE$1=\"Bulls\",OFFSET(Bulls!$L$2,ROW(AE11),15),IF(AE$1=\"Phantoms\",OFFSET(Phantoms!$L$2,ROW(AE11),15),IF(AE$1=\"Gators\",OFFSET(Gators!$L$2,ROW(AE11),15),IF(AE$1=\"Knights\",OFFSET(Knights!$L$2,ROW(AE11),15),IF(AE$1=\"Hornets\",OFFSET(Hornets!$L$2,ROW(AE11),15),IF(AE$1=\"Wolves\",OFFSET(Wolves!$L$2,ROW(AE11),15),IF(AE$1=\"Comets\",OFFSET(Comets!$L$2,ROW(AE11),15)))))))))","v":0},{"$f":"IF($AE$1=\"Drillers\",OFFSET(Drillers!$L$2,ROW(AE11),16),IF($AE$1=\"Bulls\",OFFSET(Bulls!$L$2,ROW(AE11),16),IF($AE$1=\"Phantoms\",OFFSET(Phantoms!$L$2,ROW(AE11),16),IF($AE$1=\"Gators\",OFFSET(Gators!$L$2,ROW(AE11),16),IF($AE$1=\"Knights\",OFFSET(Knights!$L$2,ROW(AE11),16),IF($AE$1=\"Hornets\",OFFSET(Hornets!$L$2,ROW(AE11),16),IF($AE$1=\"Wolves\",OFFSET(Wolves!$L$2,ROW(AE11),16),IF($AE$1=\"Comets\",OFFSET(Comets!$L$2,ROW(AE11),16)))))))))","v":0},{"$f":"IF($AE$1=\"Drillers\",OFFSET(Drillers!$L$2,ROW($AE11),17),IF($AE$1=\"Bulls\",OFFSET(Bulls!$L$2,ROW($AE11),17),IF($AE$1=\"Phantoms\",OFFSET(Phantoms!$L$2,ROW($AE11),17),IF($AE$1=\"Gators\",OFFSET(Gators!$L$2,ROW($AE11),17),IF($AE$1=\"Knights\",OFFSET(Knights!$L$2,ROW($AE11),17),IF($AE$1=\"Hornets\",OFFSET(Hornets!$L$2,ROW($AE11),17),IF($AE$1=\"Wolves\",OFFSET(Wolves!$L$2,ROW($AE11),17),IF($AE$1=\"Comets\",OFFSET(Comets!$L$2,ROW($AE11),17)))))))))","v":2}]
[{"$nulls":4},12,{"$f":"IF($F$1=\"Drillers\",OFFSET(Drillers!$L$2,ROW($F12),1),IF($F$1=\"Bulls\",OFFSET(Bulls!$L$2,ROW($F12),1),IF($F$1=\"Phantoms\",OFFSET(Phantoms!$L$2,ROW($F12),1),IF($F$1=\"Gators\",OFFSET(Gators!$L$2,ROW($F12),1),IF($F$1=\"Knights\",OFFSET(Knights!$L$2,ROW($F12),1),IF($F$1=\"Hornets\",OFFSET(Hornets!$L$2,ROW($F12),1),IF($F$1=\"Reds\",OFFSET(Comets!$L$2,ROW($F12),1),IF($F$1=\"Guardians\",OFFSET(Wolves!$L$2,ROW($F12),1)))))))))","v":"Santos"},{"$f":"IF($F$1=\"Drillers\",OFFSET(Drillers!$L$2,ROW($F12),2),IF($F$1=\"Bulls\",OFFSET(Bulls!$L$2,ROW($F12),2),IF($F$1=\"Phantoms\",OFFSET(Phantoms!$L$2,ROW($F12),2),IF($F$1=\"Gators\",OFFSET(Gators!$L$2,ROW($F12),2),IF($F$1=\"Knights\",OFFSET(Knights!$L$2,ROW($F12),2),IF($F$1=\"Hornets\",OFFSET(Hornets!$L$2,ROW($F12),2),IF($F$1=\"Reds\",OFFSET(Comets!$L$2,ROW($F12),2),IF($F$1=\"Guardians\",OFFSET(Wolves!$L$2,ROW($F12),2)))))))))","v":"Ramon"},{"$f":"IF($F$1=\"Drillers\",OFFSET(Drillers!$L$2,ROW($F12),3),IF($F$1=\"Bulls\",OFFSET(Bulls!$L$2,ROW($F12),3),IF($F$1=\"Phantoms\",OFFSET(Phantoms!$L$2,ROW($F12),3),IF($F$1=\"Gators\",OFFSET(Gators!$L$2,ROW($F12),3),IF($F$1=\"Knights\",OFFSET(Knights!$L$2,ROW($F12),3),IF($F$1=\"Hornets\",OFFSET(Hornets!$L$2,ROW($F12),3),IF($F$1=\"Guardians\",OFFSET(Wolves!$L$2,ROW($F12),3),IF($F$1=\"Reds\",OFFSET(Comets!$L$2,ROW($F12),3)))))))))","v":"R"},{"$f":"IF($F$1=\"Drillers\",OFFSET(Drillers!$L$2,ROW($F12),4),IF($F$1=\"Bulls\",OFFSET(Bulls!$L$2,ROW($F12),4),IF($F$1=\"Phantoms\",OFFSET(Phantoms!$L$2,ROW($F12),4),IF($F$1=\"Gators\",OFFSET(Gators!$L$2,ROW($F12),4),IF($F$1=\"Knights\",OFFSET(Knights!$L$2,ROW($F12),4),IF($F$1=\"Hornets\",OFFSET(Hornets!$L$2,ROW($F12),4),IF($F$1=\"Guardians\",OFFSET(Wolves!$L$2,ROW($F12),4),IF($F$1=\"Reds\",OFFSET(Comets!$L$2,ROW($F12),4)))))))))","v":"C"},{"$f":"IF($F$1=\"Drillers\",OFFSET(Drillers!$L$2,ROW($F12),5),IF($F$1=\"Bulls\",OFFSET(Bulls!$L$2,ROW($F12),5),IF($F$1=\"Phantoms\",OFFSET(Phantoms!$L$2,ROW($F12),5),IF($F$1=\"Gators\",OFFSET(Gators!$L$2,ROW($F12),5),IF($F$1=\"Knights\",OFFSET(Knights!$L$2,ROW($F12),5),IF($F$1=\"Hornets\",OFFSET(Hornets!$L$2,ROW($F12),5),IF($F$1=\"Guardians\",OFFSET(Wolves!$L$2,ROW($F12),5),IF($F$1=\"Reds\",OFFSET(Comets!$L$2,ROW($F12),5)))))))))","v":3},{"$f":"IF($F$1=\"Drillers\",OFFSET(Drillers!$L$2,ROW($F12),6),IF($F$1=\"Bulls\",OFFSET(Bulls!$L$2,ROW($F12),6),IF($F$1=\"Phantoms\",OFFSET(Phantoms!$L$2,ROW($F12),6),IF($F$1=\"Gators\",OFFSET(Gators!$L$2,ROW($F12),6),IF($F$1=\"Knights\",OFFSET(Knights!$L$2,ROW($F12),6),IF($F$1=\"Hornets\",OFFSET(Hornets!$L$2,ROW($F12),6),IF($F$1=\"Guardians\",OFFSET(Wolves!$L$2,ROW($F12),6),IF($F$1=\"Reds\",OFFSET(Comets!$L$2,ROW($F12),6)))))))))","v":2},{"$f":"IF($F$1=\"Drillers\",OFFSET(Drillers!$L$2,ROW(F12),7),IF($F$1=\"Bulls\",OFFSET(Bulls!$L$2,ROW(F12),7),IF($F$1=\"Phantoms\",OFFSET(Phantoms!$L$2,ROW(F12),7),IF($F$1=\"Gators\",OFFSET(Gators!$L$2,ROW(F12),7),IF($F$1=\"Knights\",OFFSET(Knights!$L$2,ROW(F12),7),IF($F$1=\"Hornets\",OFFSET(Hornets!$L$2,ROW(F12),7),IF($F$1=\"Guardians\",OFFSET(Wolves!$L$2,ROW(F12),7),IF($F$1=\"Reds\",OFFSET(Comets!$L$2,ROW(F12),7),))))))))","v":2},{"$f":"IF($F$1=\"Drillers\",OFFSET(Drillers!$L$2,ROW(F12),8),IF($F$1=\"Bulls\",OFFSET(Bulls!$L$2,ROW(F12),8),IF($F$1=\"Phantoms\",OFFSET(Phantoms!$L$2,ROW(F12),8),IF($F$1=\"Gators\",OFFSET(Gators!$L$2,ROW(F12),8),IF($F$1=\"Knights\",OFFSET(Knights!$L$2,ROW(F12),8),IF($F$1=\"Hornets\",OFFSET(Hornets!$L$2,ROW(F12),8),IF($F$1=\"Guardians\",OFFSET(Wolves!$L$2,ROW(F12),8),IF($F$1=\"Reds\",OFFSET(Comets!$L$2,ROW(F12),8)))))))))","v":2},{"$f":"IF($F$1=\"Drillers\",OFFSET(Drillers!$L$2,ROW($F12),9),IF($F$1=\"Bulls\",OFFSET(Bulls!$L$2,ROW($F12),9),IF($F$1=\"Phantoms\",OFFSET(Phantoms!$L$2,ROW($F12),9),IF($F$1=\"Gators\",OFFSET(Gators!$L$2,ROW($F12),9),IF($F$1=\"Knights\",OFFSET(Knights!$L$2,ROW($F12),9),IF($F$1=\"Hornets\",OFFSET(Hornets!$L$2,ROW(F12),9),IF($F$1=\"Guardians\",OFFSET(Wolves!$L$2,ROW($F12),9),IF($F$1=\"Reds\",OFFSET(Comets!$L$2,ROW($F12),9)))))))))","v":2},{"$f":"IF($F$1=\"Drillers\",OFFSET(Drillers!$L$2,ROW(F12),10),IF($F$1=\"Bulls\",OFFSET(Bulls!$L$2,ROW(F12),10),IF($F$1=\"Phantoms\",OFFSET(Phantoms!$L$2,ROW(F12),10),IF($F$1=\"Gators\",OFFSET(Gators!$L$2,ROW(F12),10),IF($F$1=\"Knights\",OFFSET(Knights!$L$2,ROW(F12),10),IF($F$1=\"Hornets\",OFFSET(Hornets!$L$2,ROW(F12),10),IF($F$1=\"Guardians\",OFFSET(Wolves!$L$2,ROW(F12),10),IF($F$1=\"Reds\",OFFSET(Comets!$L$2,ROW(F12),10)))))))))","v":2},{"$f":"IF($F$1=\"Drillers\",OFFSET(Drillers!$L$2,ROW(F12),11),IF($F$1=\"Bulls\",OFFSET(Bulls!$L$2,ROW(F12),11),IF($F$1=\"Phantoms\",OFFSET(Phantoms!$L$2,ROW(F12),11),IF($F$1=\"Gators\",OFFSET(Gators!$L$2,ROW(F12),11),IF($F$1=\"Knights\",OFFSET(Knights!$L$2,ROW(F12),11),IF($F$1=\"Hornets\",OFFSET(Hornets!$L$2,ROW(F12),11),IF($F$1=\"Guardians\",OFFSET(Wolves!$L$2,ROW(F12),11),IF($F$1=\"Drillers\",OFFSET(Drillers!$L$2,ROW(F12),11),IF($F$1=\"Reds\",OFFSET(Comets!$L$2,ROW(F12),11))))))))))","v":2},{"$f":"IF($F$1=\"Drillers\",OFFSET(Drillers!$L$2,ROW(F12),12),IF($F$1=\"Bulls\",OFFSET(Bulls!$L$2,ROW(F12),12),IF($F$1=\"Phantoms\",OFFSET(Phantoms!$L$2,ROW(F12),12),IF($F$1=\"Gators\",OFFSET(Gators!$L$2,ROW(F12),12),IF($F$1=\"Knights\",OFFSET(Knights!$L$2,ROW(F12),12),IF($F$1=\"Hornets\",OFFSET(Hornets!$L$2,ROW(F12),12),IF($F$1=\"Guardians\",OFFSET(Wolves!$L$2,ROW(F12),12),IF($F$1=\"Reds\",OFFSET(Comets!$L$2,ROW(F12),12),))))))))","v":"1B"},{"$f":"IF($F$1=\"Drillers\",OFFSET(Drillers!$L$2,ROW(F12),13),IF($F$1=\"Bulls\",OFFSET(Bulls!$L$2,ROW(F12),13),IF($F$1=\"Phantoms\",OFFSET(Phantoms!$L$2,ROW(F12),13),IF($F$1=\"Gators\",OFFSET(Gators!$L$2,ROW(F12),13),IF($F$1=\"Knights\",OFFSET(Knights!$L$2,ROW(F12),13),IF($F$1=\"Hornets\",OFFSET(Hornets!$L$2,ROW(F12),13),IF($F$1=\"Guardians\",OFFSET(Wolves!$L$2,ROW(F12),13),IF($F$1=\"Reds\",OFFSET(Comets!$L$2,ROW(F12),13),))))))))","v":0},{"$f":"IF($F$1=\"Drillers\",OFFSET(Drillers!$L$2,ROW(F12),14),IF($F$1=\"Bulls\",OFFSET(Bulls!$L$2,ROW(F12),14),IF($F$1=\"Phantoms\",OFFSET(Phantoms!$L$2,ROW(F12),14),IF($F$1=\"Gators\",OFFSET(Gators!$L$2,ROW(F12),14),IF($F$1=\"Knights\",OFFSET(Knights!$L$2,ROW(F12),14),IF($F$1=\"Hornets\",OFFSET(Hornets!$L$2,ROW(F12),14),IF($F$1=\"Guardians\",OFFSET(Wolves!$L$2,ROW(F12),14,),IF($F$1=\"Reds\",OFFSET(Comets!$L$2,ROW(F12),14)))))))))","v":1},{"$f":"IF($F$1=\"Drillers\",OFFSET(Drillers!$L$2,ROW(F12),15),IF($F$1=\"Bulls\",OFFSET(Bulls!$L$2,ROW(F12),15),IF($F$1=\"Phantoms\",OFFSET(Phantoms!$L$2,ROW(F12),15),IF($F$1=\"Gators\",OFFSET(Gators!$L$2,ROW(F12),15),IF($F$1=\"Knights\",OFFSET(Knights!$L$2,ROW(F12),15),IF($F$1=\"Hornets\",OFFSET(Hornets!$L$2,ROW(F12),15),IF($F$1=\"Guardians\",OFFSET(Wolves!$L$2,ROW(F12),15),IF($F$1=\"Reds\",OFFSET(Comets!$L$2,ROW(F12),15)))))))))","v":0},{"$f":"IF($F$1=\"Drillers\",OFFSET(Drillers!$L$2,ROW(F12),16),IF($F$1=\"Bulls\",OFFSET(Bulls!$L$2,ROW(F12),16),IF($F$1=\"Phantoms\",OFFSET(Phantoms!$L$2,ROW(F12),16),IF($F$1=\"Gators\",OFFSET(Gators!$L$2,ROW(F12),16),IF($F$1=\"Knights\",OFFSET(Knights!$L$2,ROW(F12),16),IF($F$1=\"Hornets\",OFFSET(Hornets!$L$2,ROW(F12),16),IF($F$1=\"Guardians\",OFFSET(Wolves!$L$2,ROW(F12),16),IF($F$1=\"Reds\",OFFSET(Comets!$L$2,ROW(F12),16)))))))))","v":0},{"$f":"IF($F$1=\"Drillers\",OFFSET(Drillers!$L$2,ROW($F12),17),IF($F$1=\"Bulls\",OFFSET(Bulls!$L$2,ROW($F12),17),IF($F$1=\"Phantoms\",OFFSET(Phantoms!$L$2,ROW($F12),17),IF($F$1=\"Gators\",OFFSET(Gators!$L$2,ROW($F12),17),IF($F$1=\"Knights\",OFFSET(Knights!$L$2,ROW($F12),17),IF($F$1=\"Hornets\",OFFSET(Hornets!$L$2,ROW($F12),17),IF($F$1=\"Guardians\",OFFSET(Wolves!$L$2,ROW($F12),17),IF($F$1=\"Reds\",OFFSET(Comets!$L$2,ROW($F12),17)))))))))","v":3},{"$nulls":7},12,{"$f":"IF($AE$1=\"Drillers\",OFFSET(Drillers!$L$2,ROW($AE12),1),IF($AE$1=\"Bulls\",OFFSET(Bulls!$L$2,ROW($AE12),1),IF($AE$1=\"Phantoms\",OFFSET(Phantoms!$L$2,ROW($AE12),1),IF($AE$1=\"Gators\",OFFSET(Gators!$L$2,ROW($AE12),1),IF($AE$1=\"Knights\",OFFSET(Knights!$L$2,ROW($AE12),1),IF($AE$1=\"Hornets\",OFFSET(Hornets!$L$2,ROW($AE12),1),IF($AE$1=\"Wolves\",OFFSET(Wolves!$L$2,ROW($AE12),1),IF(AE$1=\"Comets\",OFFSET(Comets!$L$2,ROW($AE12),1)))))))))","v":"Medina"},{"$f":"IF($AE$1=\"Drillers\",OFFSET(Drillers!$L$2,ROW($AF12),2),IF($AE$1=\"Bulls\",OFFSET(Bulls!$L$2,ROW($AF12),2),IF($AE$1=\"Phantoms\",OFFSET(Phantoms!$L$2,ROW($AF12),2),IF($AE$1=\"Gators\",OFFSET(Gators!$L$2,ROW($AF12),2),IF($AE$1=\"Knights\",OFFSET(Knights!$L$2,ROW($AF12),2),IF($AE$1=\"Hornets\",OFFSET(Hornets!$L$2,ROW($AF12),2),IF($AE$1=\"Wolves\",OFFSET(Wolves!$L$2,ROW($AF12),2),IF($AE$1=\"Comets\",OFFSET(Comets!$L$2,ROW($AF12),2)))))))))","v":"Octavio"},{"$f":"IF($AE$1=\"Drillers\",OFFSET(Drillers!$L$2,ROW($AE12),3),IF($AE$1=\"Bulls\",OFFSET(Bulls!$L$2,ROW($AE12),3),IF($AE$1=\"Phantoms\",OFFSET(Phantoms!$L$2,ROW($AE12),3),IF($AE$1=\"Gators\",OFFSET(Gators!$L$2,ROW($AE12),3),IF($AE$1=\"Knights\",OFFSET(Knights!$L$2,ROW($AE12),3),IF($AE$1=\"Hornets\",OFFSET(Hornets!$L$2,ROW($AE12),3),IF($AE$1=\"Wolves\",OFFSET(Wolves!$L$2,ROW($AE12),3),IF($AE$1=\"Comets\",OFFSET(Comets!$L$2,ROW($AE12),3)))))))))","v":"L"},{"$f":"IF($AE$1=\"Drillers\",OFFSET(Drillers!$L$2,ROW($AE12),4),IF($AE$1=\"Bulls\",OFFSET(Bulls!$L$2,ROW($AE12),4),IF($AE$1=\"Phantoms\",OFFSET(Phantoms!$L$2,ROW($AE12),4),IF($AE$1=\"Gators\",OFFSET(Gators!$L$2,ROW($AE12),4),IF($AE$1=\"Knights\",OFFSET(Knights!$L$2,ROW($AE12),4),IF($AE$1=\"Hornets\",OFFSET(Hornets!$L$2,ROW($AE12),4),IF($AE$1=\"Wolves\",OFFSET(Wolves!$L$2,ROW($AE12),4),IF($AE$1=\"Comets\",OFFSET(Comets!$L$2,ROW($AE12),4)))))))))","v":"1B"},{"$f":"IF($AE$1=\"Drillers\",OFFSET(Drillers!$L$2,ROW($AE12),5),IF($AE$1=\"Bulls\",OFFSET(Bulls!$L$2,ROW($AE12),5),IF($AE$1=\"Phantoms\",OFFSET(Phantoms!$L$2,ROW($AE12),5),IF($AE$1=\"Gators\",OFFSET(Gators!$L$2,ROW($AE12),5),IF($AE$1=\"Knights\",OFFSET(Knights!$L$2,ROW($AE12),5),IF($AE$1=\"Hornets\",OFFSET(Hornets!$L$2,ROW($AE12),5),IF($AE$1=\"Wolves\",OFFSET(Wolves!$L$2,ROW($AE12),5),IF($AE$1=\"Comets\",OFFSET(Comets!$L$2,ROW($AE12),5)))))))))","v":3},{"$f":"IF($AE$1=\"Drillers\",OFFSET(Drillers!$L$2,ROW($AE12),6),IF($AE$1=\"Bulls\",OFFSET(Bulls!$L$2,ROW($AE12),6),IF($AE$1=\"Phantoms\",OFFSET(Phantoms!$L$2,ROW($AE12),6),IF($AE$1=\"Gators\",OFFSET(Gators!$L$2,ROW($AE12),6),IF($AE$1=\"Knights\",OFFSET(Knights!$L$2,ROW($AE12),6),IF($AE$1=\"Hornets\",OFFSET(Hornets!$L$2,ROW($AE12),6),IF($AE$1=\"Wolves\",OFFSET(Wolves!$L$2,ROW($AE12),6),IF($AE$1=\"Comets\",OFFSET(Comets!$L$2,ROW($AE12),6)))))))))","v":3},{"$f":"IF($AE$1=\"Drillers\",OFFSET(Drillers!$L$2,ROW($AE12),7),IF($AE$1=\"Bulls\",OFFSET(Bulls!$L$2,ROW($AE12),7),IF($AE$1=\"Phantoms\",OFFSET(Phantoms!$L$2,ROW($AE12),7),IF($AE$1=\"Gators\",OFFSET(Gators!$L$2,ROW($AE12),7),IF($AE$1=\"Knights\",OFFSET(Knights!$L$2,ROW($AE12),7),IF($AE$1=\"Hornets\",OFFSET(Hornets!$L$2,ROW($AE12),7),IF($AE$1=\"Wolves\",OFFSET(Wolves!$L$2,ROW($AE12),7),IF($AE$1=\"Comets\",OFFSET(Comets!$L$2,ROW($AE12),7)))))))))","v":2},{"$f":"IF($AE$1=\"Drillers\",OFFSET(Drillers!$L$2,ROW($AE12),8),IF($AE$1=\"Bulls\",OFFSET(Bulls!$L$2,ROW($AE12),8),IF($AE$1=\"Phantoms\",OFFSET(Phantoms!$L$2,ROW($AE12),8),IF($AE$1=\"Gators\",OFFSET(Gators!$L$2,ROW($AE12),8),IF($AE$1=\"Knights\",OFFSET(Knights!$L$2,ROW($AE12),8),IF($AE$1=\"Hornets\",OFFSET(Hornets!$L$2,ROW($AE12),8),IF($AE$1=\"Wolves\",OFFSET(Wolves!$L$2,ROW($AE12),8),IF($AE$1=\"Comets\",OFFSET(Comets!$L$2,ROW($AE12),8)))))))))","v":3},{"$f":"IF($AE$1=\"Drillers\",OFFSET(Drillers!$L$2,ROW($AE12),9),IF($AE$1=\"Bulls\",OFFSET(Bulls!$L$2,ROW($AE12),9),IF($AE$1=\"Phantoms\",OFFSET(Phantoms!$L$2,ROW($AE12),9),IF($AE$1=\"Gators\",OFFSET(Gators!$L$2,ROW($AE12),9),IF($AE$1=\"Knights\",OFFSET(Knights!$L$2,ROW($AE12),9),IF($AE$1=\"Hornets\",OFFSET(Hornets!$L$2,ROW($AE12),9),IF($AE$1=\"Wolves\",OFFSET(Wolves!$L$2,ROW($AE12),9),IF($AE$1=\"Comets\",OFFSET(Comets!$L$2,ROW($AE12),9)))))))))","v":3},{"$f":"IF($AE$1=\"Drillers\",OFFSET(Drillers!$L$2,ROW($AE12),10),IF($AE$1=\"Bulls\",OFFSET(Bulls!$L$2,ROW($AE12),10),IF($AE$1=\"Phantoms\",OFFSET(Phantoms!$L$2,ROW($AE12),10),IF($AE$1=\"Gators\",OFFSET(Gators!$L$2,ROW($AE12),10),IF($AE$1=\"Knights\",OFFSET(Knights!$L$2,ROW($AE12),10),IF($AE$1=\"Hornets\",OFFSET(Hornets!$L$2,ROW($AE12),10),IF($AE$1=\"Wolves\",OFFSET(Wolves!$L$2,ROW($AE12),10),IF($AE$1=\"Comets\",OFFSET(Comets!$L$2,ROW($AE12),10)))))))))","v":5},{"$f":"IF($AE$1=\"Drillers\",OFFSET(Drillers!$L$2,ROW($AE12),11),IF($AE$1=\"Bulls\",OFFSET(Bulls!$L$2,ROW($AE12),11),IF($AE$1=\"Phantoms\",OFFSET(Phantoms!$L$2,ROW($AE12),11),IF($AE$1=\"Gators\",OFFSET(Gators!$L$2,ROW($AE12),11),IF($AE$1=\"Knights\",OFFSET(Knights!$L$2,ROW($AE12),11),IF($AE$1=\"Hornets\",OFFSET(Hornets!$L$2,ROW($AE12),11),IF($AE$1=\"Wolves\",OFFSET(Wolves!$L$2,ROW($AE12),11),IF($AE$1=\"Comets\",OFFSET(Comets!$L$2,ROW($AE12),11)))))))))","v":2},{"$f":"IF($AE$1=\"Drillers\",OFFSET(Drillers!$L$2,ROW($AE12),12),IF($AE$1=\"Bulls\",OFFSET(Bulls!$L$2,ROW($AE12),12),IF($AE$1=\"Phantoms\",OFFSET(Phantoms!$L$2,ROW($AE12),12),IF($AE$1=\"Gators\",OFFSET(Gators!$L$2,ROW($AE12),12),IF($AE$1=\"Knights\",OFFSET(Knights!$L$2,ROW($AE12),12),IF($AE$1=\"Hornets\",OFFSET(Hornets!$L$2,ROW($AE12),12),IF($AE$1=\"Wolves\",OFFSET(Wolves!$L$2,ROW($AE12),12),IF($AE$1=\"Comets\",OFFSET(Comets!$L$2,ROW($AE12),12)))))))))","v":"3B"},{"$f":"IF($AE$1=\"Drillers\",OFFSET(Drillers!$L$2,ROW($AE12),13),IF($AE$1=\"Bulls\",OFFSET(Bulls!$L$2,ROW($AE12),13),IF($AE$1=\"Phantoms\",OFFSET(Phantoms!$L$2,ROW($AE12),13),IF($AE$1=\"Gators\",OFFSET(Gators!$L$2,ROW($AE12),13),IF($AE$1=\"Knights\",OFFSET(Knights!$L$2,ROW($AE12),13),IF($AE$1=\"Hornets\",OFFSET(Hornets!$L$2,ROW($AE12),13),IF($AE$1=\"Wolves\",OFFSET(Wolves!$L$2,ROW($AE12),13),IF($AE$1=\"Comets\",OFFSET(Comets!$L$2,ROW($AE12),13)))))))))","v":0},{"$f":"IF($AE$1=\"Drillers\",OFFSET(Drillers!$L$2,ROW($AE12),14),IF($AE$1=\"Bulls\",OFFSET(Bulls!$L$2,ROW($AE12),14),IF($AE$1=\"Phantoms\",OFFSET(Phantoms!$L$2,ROW($AE12),14),IF($AE$1=\"Gators\",OFFSET(Gators!$L$2,ROW($AE12),14),IF($AE$1=\"Knights\",OFFSET(Knights!$L$2,ROW($AE12),14),IF($AE$1=\"Hornets\",OFFSET(Hornets!$L$2,ROW($AE12),14),IF($AE$1=\"Wolves\",OFFSET(Wolves!$L$2,ROW($AE12),14),IF($AE$1=\"Comets\",OFFSET(Comets!$L$2,ROW($AE12),14)))))))))","v":2},{"$f":"IF(AE$1=\"Drillers\",OFFSET(Drillers!$L$2,ROW(AE12),15),IF(AE$1=\"Bulls\",OFFSET(Bulls!$L$2,ROW(AE12),15),IF(AE$1=\"Phantoms\",OFFSET(Phantoms!$L$2,ROW(AE12),15),IF(AE$1=\"Gators\",OFFSET(Gators!$L$2,ROW(AE12),15),IF(AE$1=\"Knights\",OFFSET(Knights!$L$2,ROW(AE12),15),IF(AE$1=\"Hornets\",OFFSET(Hornets!$L$2,ROW(AE12),15),IF(AE$1=\"Wolves\",OFFSET(Wolves!$L$2,ROW(AE12),15),IF(AE$1=\"Comets\",OFFSET(Comets!$L$2,ROW(AE12),15)))))))))","v":0},{"$f":"IF($AE$1=\"Drillers\",OFFSET(Drillers!$L$2,ROW(AE12),16),IF($AE$1=\"Bulls\",OFFSET(Bulls!$L$2,ROW(AE12),16),IF($AE$1=\"Phantoms\",OFFSET(Phantoms!$L$2,ROW(AE12),16),IF($AE$1=\"Gators\",OFFSET(Gators!$L$2,ROW(AE12),16),IF($AE$1=\"Knights\",OFFSET(Knights!$L$2,ROW(AE12),16),IF($AE$1=\"Hornets\",OFFSET(Hornets!$L$2,ROW(AE12),16),IF($AE$1=\"Wolves\",OFFSET(Wolves!$L$2,ROW(AE12),16),IF($AE$1=\"Comets\",OFFSET(Comets!$L$2,ROW(AE12),16)))))))))","v":0},{"$f":"IF($AE$1=\"Drillers\",OFFSET(Drillers!$L$2,ROW($AE12),17),IF($AE$1=\"Bulls\",OFFSET(Bulls!$L$2,ROW($AE12),17),IF($AE$1=\"Phantoms\",OFFSET(Phantoms!$L$2,ROW($AE12),17),IF($AE$1=\"Gators\",OFFSET(Gators!$L$2,ROW($AE12),17),IF($AE$1=\"Knights\",OFFSET(Knights!$L$2,ROW($AE12),17),IF($AE$1=\"Hornets\",OFFSET(Hornets!$L$2,ROW($AE12),17),IF($AE$1=\"Wolves\",OFFSET(Wolves!$L$2,ROW($AE12),17),IF($AE$1=\"Comets\",OFFSET(Comets!$L$2,ROW($AE12),17)))))))))","v":1}]
[{"$nulls":4},13,{"$f":"IF($F$1=\"Drillers\",OFFSET(Drillers!$L$2,ROW($F13),1),IF($F$1=\"Bulls\",OFFSET(Bulls!$L$2,ROW($F13),1),IF($F$1=\"Phantoms\",OFFSET(Phantoms!$L$2,ROW($F13),1),IF($F$1=\"Gators\",OFFSET(Gators!$L$2,ROW($F13),1),IF($F$1=\"Knights\",OFFSET(Knights!$L$2,ROW($F13),1),IF($F$1=\"Hornets\",OFFSET(Hornets!$L$2,ROW($F13),1),IF($F$1=\"Reds\",OFFSET(Comets!$L$2,ROW($F13),1),IF($F$1=\"Guardians\",OFFSET(Wolves!$L$2,ROW($F13),1)))))))))","v":"Gonzalez"},{"$f":"IF($F$1=\"Drillers\",OFFSET(Drillers!$L$2,ROW($F13),2),IF($F$1=\"Bulls\",OFFSET(Bulls!$L$2,ROW($F13),2),IF($F$1=\"Phantoms\",OFFSET(Phantoms!$L$2,ROW($F13),2),IF($F$1=\"Gators\",OFFSET(Gators!$L$2,ROW($F13),2),IF($F$1=\"Knights\",OFFSET(Knights!$L$2,ROW($F13),2),IF($F$1=\"Hornets\",OFFSET(Hornets!$L$2,ROW($F13),2),IF($F$1=\"Reds\",OFFSET(Comets!$L$2,ROW($F13),2),IF($F$1=\"Guardians\",OFFSET(Wolves!$L$2,ROW($F13),2)))))))))","v":"Jose"},{"$f":"IF($F$1=\"Drillers\",OFFSET(Drillers!$L$2,ROW($F13),3),IF($F$1=\"Bulls\",OFFSET(Bulls!$L$2,ROW($F13),3),IF($F$1=\"Phantoms\",OFFSET(Phantoms!$L$2,ROW($F13),3),IF($F$1=\"Gators\",OFFSET(Gators!$L$2,ROW($F13),3),IF($F$1=\"Knights\",OFFSET(Knights!$L$2,ROW($F13),3),IF($F$1=\"Hornets\",OFFSET(Hornets!$L$2,ROW($F13),3),IF($F$1=\"Guardians\",OFFSET(Wolves!$L$2,ROW($F13),3),IF($F$1=\"Reds\",OFFSET(Comets!$L$2,ROW($F13),3)))))))))","v":"R"},{"$f":"IF($F$1=\"Drillers\",OFFSET(Drillers!$L$2,ROW($F13),4),IF($F$1=\"Bulls\",OFFSET(Bulls!$L$2,ROW($F13),4),IF($F$1=\"Phantoms\",OFFSET(Phantoms!$L$2,ROW($F13),4),IF($F$1=\"Gators\",OFFSET(Gators!$L$2,ROW($F13),4),IF($F$1=\"Knights\",OFFSET(Knights!$L$2,ROW($F13),4),IF($F$1=\"Hornets\",OFFSET(Hornets!$L$2,ROW($F13),4),IF($F$1=\"Guardians\",OFFSET(Wolves!$L$2,ROW($F13),4),IF($F$1=\"Reds\",OFFSET(Comets!$L$2,ROW($F13),4)))))))))","v":"SS"},{"$f":"IF($F$1=\"Drillers\",OFFSET(Drillers!$L$2,ROW($F13),5),IF($F$1=\"Bulls\",OFFSET(Bulls!$L$2,ROW($F13),5),IF($F$1=\"Phantoms\",OFFSET(Phantoms!$L$2,ROW($F13),5),IF($F$1=\"Gators\",OFFSET(Gators!$L$2,ROW($F13),5),IF($F$1=\"Knights\",OFFSET(Knights!$L$2,ROW($F13),5),IF($F$1=\"Hornets\",OFFSET(Hornets!$L$2,ROW($F13),5),IF($F$1=\"Guardians\",OFFSET(Wolves!$L$2,ROW($F13),5),IF($F$1=\"Reds\",OFFSET(Comets!$L$2,ROW($F13),5)))))))))","v":3},{"$f":"IF($F$1=\"Drillers\",OFFSET(Drillers!$L$2,ROW($F13),6),IF($F$1=\"Bulls\",OFFSET(Bulls!$L$2,ROW($F13),6),IF($F$1=\"Phantoms\",OFFSET(Phantoms!$L$2,ROW($F13),6),IF($F$1=\"Gators\",OFFSET(Gators!$L$2,ROW($F13),6),IF($F$1=\"Knights\",OFFSET(Knights!$L$2,ROW($F13),6),IF($F$1=\"Hornets\",OFFSET(Hornets!$L$2,ROW($F13),6),IF($F$1=\"Guardians\",OFFSET(Wolves!$L$2,ROW($F13),6),IF($F$1=\"Reds\",OFFSET(Comets!$L$2,ROW($F13),6)))))))))","v":2},{"$f":"IF($F$1=\"Drillers\",OFFSET(Drillers!$L$2,ROW(F13),7),IF($F$1=\"Bulls\",OFFSET(Bulls!$L$2,ROW(F13),7),IF($F$1=\"Phantoms\",OFFSET(Phantoms!$L$2,ROW(F13),7),IF($F$1=\"Gators\",OFFSET(Gators!$L$2,ROW(F13),7),IF($F$1=\"Knights\",OFFSET(Knights!$L$2,ROW(F13),7),IF($F$1=\"Hornets\",OFFSET(Hornets!$L$2,ROW(F13),7),IF($F$1=\"Guardians\",OFFSET(Wolves!$L$2,ROW(F13),7),IF($F$1=\"Reds\",OFFSET(Comets!$L$2,ROW(F13),7),))))))))","v":2},{"$f":"IF($F$1=\"Drillers\",OFFSET(Drillers!$L$2,ROW(F13),8),IF($F$1=\"Bulls\",OFFSET(Bulls!$L$2,ROW(F13),8),IF($F$1=\"Phantoms\",OFFSET(Phantoms!$L$2,ROW(F13),8),IF($F$1=\"Gators\",OFFSET(Gators!$L$2,ROW(F13),8),IF($F$1=\"Knights\",OFFSET(Knights!$L$2,ROW(F13),8),IF($F$1=\"Hornets\",OFFSET(Hornets!$L$2,ROW(F13),8),IF($F$1=\"Guardians\",OFFSET(Wolves!$L$2,ROW(F13),8),IF($F$1=\"Reds\",OFFSET(Comets!$L$2,ROW(F13),8)))))))))","v":3},{"$f":"IF($F$1=\"Drillers\",OFFSET(Drillers!$L$2,ROW($F13),9),IF($F$1=\"Bulls\",OFFSET(Bulls!$L$2,ROW($F13),9),IF($F$1=\"Phantoms\",OFFSET(Phantoms!$L$2,ROW($F13),9),IF($F$1=\"Gators\",OFFSET(Gators!$L$2,ROW($F13),9),IF($F$1=\"Knights\",OFFSET(Knights!$L$2,ROW($F13),9),IF($F$1=\"Hornets\",OFFSET(Hornets!$L$2,ROW(F13),9),IF($F$1=\"Guardians\",OFFSET(Wolves!$L$2,ROW($F13),9),IF($F$1=\"Reds\",OFFSET(Comets!$L$2,ROW($F13),9)))))))))","v":2},{"$f":"IF($F$1=\"Drillers\",OFFSET(Drillers!$L$2,ROW(F13),10),IF($F$1=\"Bulls\",OFFSET(Bulls!$L$2,ROW(F13),10),IF($F$1=\"Phantoms\",OFFSET(Phantoms!$L$2,ROW(F13),10),IF($F$1=\"Gators\",OFFSET(Gators!$L$2,ROW(F13),10),IF($F$1=\"Knights\",OFFSET(Knights!$L$2,ROW(F13),10),IF($F$1=\"Hornets\",OFFSET(Hornets!$L$2,ROW(F13),10),IF($F$1=\"Guardians\",OFFSET(Wolves!$L$2,ROW(F13),10),IF($F$1=\"Reds\",OFFSET(Comets!$L$2,ROW(F13),10)))))))))","v":4},{"$f":"IF($F$1=\"Drillers\",OFFSET(Drillers!$L$2,ROW(F13),11),IF($F$1=\"Bulls\",OFFSET(Bulls!$L$2,ROW(F13),11),IF($F$1=\"Phantoms\",OFFSET(Phantoms!$L$2,ROW(F13),11),IF($F$1=\"Gators\",OFFSET(Gators!$L$2,ROW(F13),11),IF($F$1=\"Knights\",OFFSET(Knights!$L$2,ROW(F13),11),IF($F$1=\"Hornets\",OFFSET(Hornets!$L$2,ROW(F13),11),IF($F$1=\"Guardians\",OFFSET(Wolves!$L$2,ROW(F13),11),IF($F$1=\"Drillers\",OFFSET(Drillers!$L$2,ROW(F13),11),IF($F$1=\"Reds\",OFFSET(Comets!$L$2,ROW(F13),11))))))))))","v":2},{"$f":"IF($F$1=\"Drillers\",OFFSET(Drillers!$L$2,ROW(F13),12),IF($F$1=\"Bulls\",OFFSET(Bulls!$L$2,ROW(F13),12),IF($F$1=\"Phantoms\",OFFSET(Phantoms!$L$2,ROW(F13),12),IF($F$1=\"Gators\",OFFSET(Gators!$L$2,ROW(F13),12),IF($F$1=\"Knights\",OFFSET(Knights!$L$2,ROW(F13),12),IF($F$1=\"Hornets\",OFFSET(Hornets!$L$2,ROW(F13),12),IF($F$1=\"Guardians\",OFFSET(Wolves!$L$2,ROW(F13),12),IF($F$1=\"Reds\",OFFSET(Comets!$L$2,ROW(F13),12),))))))))","v":"2B"},{"$f":"IF($F$1=\"Drillers\",OFFSET(Drillers!$L$2,ROW(F13),13),IF($F$1=\"Bulls\",OFFSET(Bulls!$L$2,ROW(F13),13),IF($F$1=\"Phantoms\",OFFSET(Phantoms!$L$2,ROW(F13),13),IF($F$1=\"Gators\",OFFSET(Gators!$L$2,ROW(F13),13),IF($F$1=\"Knights\",OFFSET(Knights!$L$2,ROW(F13),13),IF($F$1=\"Hornets\",OFFSET(Hornets!$L$2,ROW(F13),13),IF($F$1=\"Guardians\",OFFSET(Wolves!$L$2,ROW(F13),13),IF($F$1=\"Reds\",OFFSET(Comets!$L$2,ROW(F13),13),))))))))","v":0},{"$f":"IF($F$1=\"Drillers\",OFFSET(Drillers!$L$2,ROW(F13),14),IF($F$1=\"Bulls\",OFFSET(Bulls!$L$2,ROW(F13),14),IF($F$1=\"Phantoms\",OFFSET(Phantoms!$L$2,ROW(F13),14),IF($F$1=\"Gators\",OFFSET(Gators!$L$2,ROW(F13),14),IF($F$1=\"Knights\",OFFSET(Knights!$L$2,ROW(F13),14),IF($F$1=\"Hornets\",OFFSET(Hornets!$L$2,ROW(F13),14),IF($F$1=\"Guardians\",OFFSET(Wolves!$L$2,ROW(F13),14,),IF($F$1=\"Reds\",OFFSET(Comets!$L$2,ROW(F13),14)))))))))","v":2},{"$f":"IF($F$1=\"Drillers\",OFFSET(Drillers!$L$2,ROW(F13),15),IF($F$1=\"Bulls\",OFFSET(Bulls!$L$2,ROW(F13),15),IF($F$1=\"Phantoms\",OFFSET(Phantoms!$L$2,ROW(F13),15),IF($F$1=\"Gators\",OFFSET(Gators!$L$2,ROW(F13),15),IF($F$1=\"Knights\",OFFSET(Knights!$L$2,ROW(F13),15),IF($F$1=\"Hornets\",OFFSET(Hornets!$L$2,ROW(F13),15),IF($F$1=\"Guardians\",OFFSET(Wolves!$L$2,ROW(F13),15),IF($F$1=\"Reds\",OFFSET(Comets!$L$2,ROW(F13),15)))))))))","v":0},{"$f":"IF($F$1=\"Drillers\",OFFSET(Drillers!$L$2,ROW(F13),16),IF($F$1=\"Bulls\",OFFSET(Bulls!$L$2,ROW(F13),16),IF($F$1=\"Phantoms\",OFFSET(Phantoms!$L$2,ROW(F13),16),IF($F$1=\"Gators\",OFFSET(Gators!$L$2,ROW(F13),16),IF($F$1=\"Knights\",OFFSET(Knights!$L$2,ROW(F13),16),IF($F$1=\"Hornets\",OFFSET(Hornets!$L$2,ROW(F13),16),IF($F$1=\"Guardians\",OFFSET(Wolves!$L$2,ROW(F13),16),IF($F$1=\"Reds\",OFFSET(Comets!$L$2,ROW(F13),16)))))))))","v":0},{"$f":"IF($F$1=\"Drillers\",OFFSET(Drillers!$L$2,ROW($F13),17),IF($F$1=\"Bulls\",OFFSET(Bulls!$L$2,ROW($F13),17),IF($F$1=\"Phantoms\",OFFSET(Phantoms!$L$2,ROW($F13),17),IF($F$1=\"Gators\",OFFSET(Gators!$L$2,ROW($F13),17),IF($F$1=\"Knights\",OFFSET(Knights!$L$2,ROW($F13),17),IF($F$1=\"Hornets\",OFFSET(Hornets!$L$2,ROW($F13),17),IF($F$1=\"Guardians\",OFFSET(Wolves!$L$2,ROW($F13),17),IF($F$1=\"Reds\",OFFSET(Comets!$L$2,ROW($F13),17)))))))))","v":2},{"$nulls":7},13,{"$f":"IF($AE$1=\"Drillers\",OFFSET(Drillers!$L$2,ROW($AE13),1),IF($AE$1=\"Bulls\",OFFSET(Bulls!$L$2,ROW($AE13),1),IF($AE$1=\"Phantoms\",OFFSET(Phantoms!$L$2,ROW($AE13),1),IF($AE$1=\"Gators\",OFFSET(Gators!$L$2,ROW($AE13),1),IF($AE$1=\"Knights\",OFFSET(Knights!$L$2,ROW($AE13),1),IF($AE$1=\"Hornets\",OFFSET(Hornets!$L$2,ROW($AE13),1),IF($AE$1=\"Wolves\",OFFSET(Wolves!$L$2,ROW($AE13),1),IF(AE$1=\"Comets\",OFFSET(Comets!$L$2,ROW($AE13),1)))))))))","v":"Holland"},{"$f":"IF($AE$1=\"Drillers\",OFFSET(Drillers!$L$2,ROW($AF13),2),IF($AE$1=\"Bulls\",OFFSET(Bulls!$L$2,ROW($AF13),2),IF($AE$1=\"Phantoms\",OFFSET(Phantoms!$L$2,ROW($AF13),2),IF($AE$1=\"Gators\",OFFSET(Gators!$L$2,ROW($AF13),2),IF($AE$1=\"Knights\",OFFSET(Knights!$L$2,ROW($AF13),2),IF($AE$1=\"Hornets\",OFFSET(Hornets!$L$2,ROW($AF13),2),IF($AE$1=\"Wolves\",OFFSET(Wolves!$L$2,ROW($AF13),2),IF($AE$1=\"Comets\",OFFSET(Comets!$L$2,ROW($AF13),2)))))))))","v":"Chris"},{"$f":"IF($AE$1=\"Drillers\",OFFSET(Drillers!$L$2,ROW($AE13),3),IF($AE$1=\"Bulls\",OFFSET(Bulls!$L$2,ROW($AE13),3),IF($AE$1=\"Phantoms\",OFFSET(Phantoms!$L$2,ROW($AE13),3),IF($AE$1=\"Gators\",OFFSET(Gators!$L$2,ROW($AE13),3),IF($AE$1=\"Knights\",OFFSET(Knights!$L$2,ROW($AE13),3),IF($AE$1=\"Hornets\",OFFSET(Hornets!$L$2,ROW($AE13),3),IF($AE$1=\"Wolves\",OFFSET(Wolves!$L$2,ROW($AE13),3),IF($AE$1=\"Comets\",OFFSET(Comets!$L$2,ROW($AE13),3)))))))))","v":"B"},{"$f":"IF($AE$1=\"Drillers\",OFFSET(Drillers!$L$2,ROW($AE13),4),IF($AE$1=\"Bulls\",OFFSET(Bulls!$L$2,ROW($AE13),4),IF($AE$1=\"Phantoms\",OFFSET(Phantoms!$L$2,ROW($AE13),4),IF($AE$1=\"Gators\",OFFSET(Gators!$L$2,ROW($AE13),4),IF($AE$1=\"Knights\",OFFSET(Knights!$L$2,ROW($AE13),4),IF($AE$1=\"Hornets\",OFFSET(Hornets!$L$2,ROW($AE13),4),IF($AE$1=\"Wolves\",OFFSET(Wolves!$L$2,ROW($AE13),4),IF($AE$1=\"Comets\",OFFSET(Comets!$L$2,ROW($AE13),4)))))))))","v":"SS"},{"$f":"IF($AE$1=\"Drillers\",OFFSET(Drillers!$L$2,ROW($AE13),5),IF($AE$1=\"Bulls\",OFFSET(Bulls!$L$2,ROW($AE13),5),IF($AE$1=\"Phantoms\",OFFSET(Phantoms!$L$2,ROW($AE13),5),IF($AE$1=\"Gators\",OFFSET(Gators!$L$2,ROW($AE13),5),IF($AE$1=\"Knights\",OFFSET(Knights!$L$2,ROW($AE13),5),IF($AE$1=\"Hornets\",OFFSET(Hornets!$L$2,ROW($AE13),5),IF($AE$1=\"Wolves\",OFFSET(Wolves!$L$2,ROW($AE13),5),IF($AE$1=\"Comets\",OFFSET(Comets!$L$2,ROW($AE13),5)))))))))","v":2},{"$f":"IF($AE$1=\"Drillers\",OFFSET(Drillers!$L$2,ROW($AE13),6),IF($AE$1=\"Bulls\",OFFSET(Bulls!$L$2,ROW($AE13),6),IF($AE$1=\"Phantoms\",OFFSET(Phantoms!$L$2,ROW($AE13),6),IF($AE$1=\"Gators\",OFFSET(Gators!$L$2,ROW($AE13),6),IF($AE$1=\"Knights\",OFFSET(Knights!$L$2,ROW($AE13),6),IF($AE$1=\"Hornets\",OFFSET(Hornets!$L$2,ROW($AE13),6),IF($AE$1=\"Wolves\",OFFSET(Wolves!$L$2,ROW($AE13),6),IF($AE$1=\"Comets\",OFFSET(Comets!$L$2,ROW($AE13),6)))))))))","v":3},{"$f":"IF($AE$1=\"Drillers\",OFFSET(Drillers!$L$2,ROW($AE13),7),IF($AE$1=\"Bulls\",OFFSET(Bulls!$L$2,ROW($AE13),7),IF($AE$1=\"Phantoms\",OFFSET(Phantoms!$L$2,ROW($AE13),7),IF($AE$1=\"Gators\",OFFSET(Gators!$L$2,ROW($AE13),7),IF($AE$1=\"Knights\",OFFSET(Knights!$L$2,ROW($AE13),7),IF($AE$1=\"Hornets\",OFFSET(Hornets!$L$2,ROW($AE13),7),IF($AE$1=\"Wolves\",OFFSET(Wolves!$L$2,ROW($AE13),7),IF($AE$1=\"Comets\",OFFSET(Comets!$L$2,ROW($AE13),7)))))))))","v":3},{"$f":"IF($AE$1=\"Drillers\",OFFSET(Drillers!$L$2,ROW($AE13),8),IF($AE$1=\"Bulls\",OFFSET(Bulls!$L$2,ROW($AE13),8),IF($AE$1=\"Phantoms\",OFFSET(Phantoms!$L$2,ROW($AE13),8),IF($AE$1=\"Gators\",OFFSET(Gators!$L$2,ROW($AE13),8),IF($AE$1=\"Knights\",OFFSET(Knights!$L$2,ROW($AE13),8),IF($AE$1=\"Hornets\",OFFSET(Hornets!$L$2,ROW($AE13),8),IF($AE$1=\"Wolves\",OFFSET(Wolves!$L$2,ROW($AE13),8),IF($AE$1=\"Comets\",OFFSET(Comets!$L$2,ROW($AE13),8)))))))))","v":3},{"$f":"IF($AE$1=\"Drillers\",OFFSET(Drillers!$L$2,ROW($AE13),9),IF($AE$1=\"Bulls\",OFFSET(Bulls!$L$2,ROW($AE13),9),IF($AE$1=\"Phantoms\",OFFSET(Phantoms!$L$2,ROW($AE13),9),IF($AE$1=\"Gators\",OFFSET(Gators!$L$2,ROW($AE13),9),IF($AE$1=\"Knights\",OFFSET(Knights!$L$2,ROW($AE13),9),IF($AE$1=\"Hornets\",OFFSET(Hornets!$L$2,ROW($AE13),9),IF($AE$1=\"Wolves\",OFFSET(Wolves!$L$2,ROW($AE13),9),IF($AE$1=\"Comets\",OFFSET(Comets!$L$2,ROW($AE13),9)))))))))","v":2},{"$f":"IF($AE$1=\"Drillers\",OFFSET(Drillers!$L$2,ROW($AE13),10),IF($AE$1=\"Bulls\",OFFSET(Bulls!$L$2,ROW($AE13),10),IF($AE$1=\"Phantoms\",OFFSET(Phantoms!$L$2,ROW($AE13),10),IF($AE$1=\"Gators\",OFFSET(Gators!$L$2,ROW($AE13),10),IF($AE$1=\"Knights\",OFFSET(Knights!$L$2,ROW($AE13),10),IF($AE$1=\"Hornets\",OFFSET(Hornets!$L$2,ROW($AE13),10),IF($AE$1=\"Wolves\",OFFSET(Wolves!$L$2,ROW($AE13),10),IF($AE$1=\"Comets\",OFFSET(Comets!$L$2,ROW($AE13),10)))))))))","v":3},{"$f":"IF($AE$1=\"Drillers\",OFFSET(Drillers!$L$2,ROW($AE13),11),IF($AE$1=\"Bulls\",OFFSET(Bulls!$L$2,ROW($AE13),11),IF($AE$1=\"Phantoms\",OFFSET(Phantoms!$L$2,ROW($AE13),11),IF($AE$1=\"Gators\",OFFSET(Gators!$L$2,ROW($AE13),11),IF($AE$1=\"Knights\",OFFSET(Knights!$L$2,ROW($AE13),11),IF($AE$1=\"Hornets\",OFFSET(Hornets!$L$2,ROW($AE13),11),IF($AE$1=\"Wolves\",OFFSET(Wolves!$L$2,ROW($AE13),11),IF($AE$1=\"Comets\",OFFSET(Comets!$L$2,ROW($AE13),11)))))))))","v":2},{"$f":"IF($AE$1=\"Drillers\",OFFSET(Drillers!$L$2,ROW($AE13),12),IF($AE$1=\"Bulls\",OFFSET(Bulls!$L$2,ROW($AE13),12),IF($AE$1=\"Phantoms\",OFFSET(Phantoms!$L$2,ROW($AE13),12),IF($AE$1=\"Gators\",OFFSET(Gators!$L$2,ROW($AE13),12),IF($AE$1=\"Knights\",OFFSET(Knights!$L$2,ROW($AE13),12),IF($AE$1=\"Hornets\",OFFSET(Hornets!$L$2,ROW($AE13),12),IF($AE$1=\"Wolves\",OFFSET(Wolves!$L$2,ROW($AE13),12),IF($AE$1=\"Comets\",OFFSET(Comets!$L$2,ROW($AE13),12)))))))))","v":"INF"},{"$f":"IF($AE$1=\"Drillers\",OFFSET(Drillers!$L$2,ROW($AE13),13),IF($AE$1=\"Bulls\",OFFSET(Bulls!$L$2,ROW($AE13),13),IF($AE$1=\"Phantoms\",OFFSET(Phantoms!$L$2,ROW($AE13),13),IF($AE$1=\"Gators\",OFFSET(Gators!$L$2,ROW($AE13),13),IF($AE$1=\"Knights\",OFFSET(Knights!$L$2,ROW($AE13),13),IF($AE$1=\"Hornets\",OFFSET(Hornets!$L$2,ROW($AE13),13),IF($AE$1=\"Wolves\",OFFSET(Wolves!$L$2,ROW($AE13),13),IF($AE$1=\"Comets\",OFFSET(Comets!$L$2,ROW($AE13),13)))))))))","v":0},{"$f":"IF($AE$1=\"Drillers\",OFFSET(Drillers!$L$2,ROW($AE13),14),IF($AE$1=\"Bulls\",OFFSET(Bulls!$L$2,ROW($AE13),14),IF($AE$1=\"Phantoms\",OFFSET(Phantoms!$L$2,ROW($AE13),14),IF($AE$1=\"Gators\",OFFSET(Gators!$L$2,ROW($AE13),14),IF($AE$1=\"Knights\",OFFSET(Knights!$L$2,ROW($AE13),14),IF($AE$1=\"Hornets\",OFFSET(Hornets!$L$2,ROW($AE13),14),IF($AE$1=\"Wolves\",OFFSET(Wolves!$L$2,ROW($AE13),14),IF($AE$1=\"Comets\",OFFSET(Comets!$L$2,ROW($AE13),14)))))))))","v":1},{"$f":"IF(AE$1=\"Drillers\",OFFSET(Drillers!$L$2,ROW(AE13),15),IF(AE$1=\"Bulls\",OFFSET(Bulls!$L$2,ROW(AE13),15),IF(AE$1=\"Phantoms\",OFFSET(Phantoms!$L$2,ROW(AE13),15),IF(AE$1=\"Gators\",OFFSET(Gators!$L$2,ROW(AE13),15),IF(AE$1=\"Knights\",OFFSET(Knights!$L$2,ROW(AE13),15),IF(AE$1=\"Hornets\",OFFSET(Hornets!$L$2,ROW(AE13),15),IF(AE$1=\"Wolves\",OFFSET(Wolves!$L$2,ROW(AE13),15),IF(AE$1=\"Comets\",OFFSET(Comets!$L$2,ROW(AE13),15)))))))))","v":0},{"$f":"IF($AE$1=\"Drillers\",OFFSET(Drillers!$L$2,ROW(AE13),16),IF($AE$1=\"Bulls\",OFFSET(Bulls!$L$2,ROW(AE13),16),IF($AE$1=\"Phantoms\",OFFSET(Phantoms!$L$2,ROW(AE13),16),IF($AE$1=\"Gators\",OFFSET(Gators!$L$2,ROW(AE13),16),IF($AE$1=\"Knights\",OFFSET(Knights!$L$2,ROW(AE13),16),IF($AE$1=\"Hornets\",OFFSET(Hornets!$L$2,ROW(AE13),16),IF($AE$1=\"Wolves\",OFFSET(Wolves!$L$2,ROW(AE13),16),IF($AE$1=\"Comets\",OFFSET(Comets!$L$2,ROW(AE13),16)))))))))","v":0},{"$f":"IF($AE$1=\"Drillers\",OFFSET(Drillers!$L$2,ROW($AE13),17),IF($AE$1=\"Bulls\",OFFSET(Bulls!$L$2,ROW($AE13),17),IF($AE$1=\"Phantoms\",OFFSET(Phantoms!$L$2,ROW($AE13),17),IF($AE$1=\"Gators\",OFFSET(Gators!$L$2,ROW($AE13),17),IF($AE$1=\"Knights\",OFFSET(Knights!$L$2,ROW($AE13),17),IF($AE$1=\"Hornets\",OFFSET(Hornets!$L$2,ROW($AE13),17),IF($AE$1=\"Wolves\",OFFSET(Wolves!$L$2,ROW($AE13),17),IF($AE$1=\"Comets\",OFFSET(Comets!$L$2,ROW($AE13),17)))))))))","v":3}]
[{"$nulls":4},14,{"$f":"IF($F$1=\"Drillers\",OFFSET(Drillers!$L$2,ROW($F14),1),IF($F$1=\"Bulls\",OFFSET(Bulls!$L$2,ROW($F14),1),IF($F$1=\"Phantoms\",OFFSET(Phantoms!$L$2,ROW($F14),1),IF($F$1=\"Gators\",OFFSET(Gators!$L$2,ROW($F14),1),IF($F$1=\"Knights\",OFFSET(Knights!$L$2,ROW($F14),1),IF($F$1=\"Hornets\",OFFSET(Hornets!$L$2,ROW($F14),1),IF($F$1=\"Reds\",OFFSET(Comets!$L$2,ROW($F14),1),IF($F$1=\"Guardians\",OFFSET(Wolves!$L$2,ROW($F14),1)))))))))","v":"Cruz"},{"$f":"IF($F$1=\"Drillers\",OFFSET(Drillers!$L$2,ROW($F14),2),IF($F$1=\"Bulls\",OFFSET(Bulls!$L$2,ROW($F14),2),IF($F$1=\"Phantoms\",OFFSET(Phantoms!$L$2,ROW($F14),2),IF($F$1=\"Gators\",OFFSET(Gators!$L$2,ROW($F14),2),IF($F$1=\"Knights\",OFFSET(Knights!$L$2,ROW($F14),2),IF($F$1=\"Hornets\",OFFSET(Hornets!$L$2,ROW($F14),2),IF($F$1=\"Reds\",OFFSET(Comets!$L$2,ROW($F14),2),IF($F$1=\"Guardians\",OFFSET(Wolves!$L$2,ROW($F14),2)))))))))","v":"Orlando"},{"$f":"IF($F$1=\"Drillers\",OFFSET(Drillers!$L$2,ROW($F14),3),IF($F$1=\"Bulls\",OFFSET(Bulls!$L$2,ROW($F14),3),IF($F$1=\"Phantoms\",OFFSET(Phantoms!$L$2,ROW($F14),3),IF($F$1=\"Gators\",OFFSET(Gators!$L$2,ROW($F14),3),IF($F$1=\"Knights\",OFFSET(Knights!$L$2,ROW($F14),3),IF($F$1=\"Hornets\",OFFSET(Hornets!$L$2,ROW($F14),3),IF($F$1=\"Guardians\",OFFSET(Wolves!$L$2,ROW($F14),3),IF($F$1=\"Reds\",OFFSET(Comets!$L$2,ROW($F14),3)))))))))","v":"R"},{"$f":"IF($F$1=\"Drillers\",OFFSET(Drillers!$L$2,ROW($F14),4),IF($F$1=\"Bulls\",OFFSET(Bulls!$L$2,ROW($F14),4),IF($F$1=\"Phantoms\",OFFSET(Phantoms!$L$2,ROW($F14),4),IF($F$1=\"Gators\",OFFSET(Gators!$L$2,ROW($F14),4),IF($F$1=\"Knights\",OFFSET(Knights!$L$2,ROW($F14),4),IF($F$1=\"Hornets\",OFFSET(Hornets!$L$2,ROW($F14),4),IF($F$1=\"Guardians\",OFFSET(Wolves!$L$2,ROW($F14),4),IF($F$1=\"Reds\",OFFSET(Comets!$L$2,ROW($F14),4)))))))))","v":"SS"},{"$f":"IF($F$1=\"Drillers\",OFFSET(Drillers!$L$2,ROW($F14),5),IF($F$1=\"Bulls\",OFFSET(Bulls!$L$2,ROW($F14),5),IF($F$1=\"Phantoms\",OFFSET(Phantoms!$L$2,ROW($F14),5),IF($F$1=\"Gators\",OFFSET(Gators!$L$2,ROW($F14),5),IF($F$1=\"Knights\",OFFSET(Knights!$L$2,ROW($F14),5),IF($F$1=\"Hornets\",OFFSET(Hornets!$L$2,ROW($F14),5),IF($F$1=\"Guardians\",OFFSET(Wolves!$L$2,ROW($F14),5),IF($F$1=\"Reds\",OFFSET(Comets!$L$2,ROW($F14),5)))))))))","v":3},{"$f":"IF($F$1=\"Drillers\",OFFSET(Drillers!$L$2,ROW($F14),6),IF($F$1=\"Bulls\",OFFSET(Bulls!$L$2,ROW($F14),6),IF($F$1=\"Phantoms\",OFFSET(Phantoms!$L$2,ROW($F14),6),IF($F$1=\"Gators\",OFFSET(Gators!$L$2,ROW($F14),6),IF($F$1=\"Knights\",OFFSET(Knights!$L$2,ROW($F14),6),IF($F$1=\"Hornets\",OFFSET(Hornets!$L$2,ROW($F14),6),IF($F$1=\"Guardians\",OFFSET(Wolves!$L$2,ROW($F14),6),IF($F$1=\"Reds\",OFFSET(Comets!$L$2,ROW($F14),6)))))))))","v":2},{"$f":"IF($F$1=\"Drillers\",OFFSET(Drillers!$L$2,ROW(F14),7),IF($F$1=\"Bulls\",OFFSET(Bulls!$L$2,ROW(F14),7),IF($F$1=\"Phantoms\",OFFSET(Phantoms!$L$2,ROW(F14),7),IF($F$1=\"Gators\",OFFSET(Gators!$L$2,ROW(F14),7),IF($F$1=\"Knights\",OFFSET(Knights!$L$2,ROW(F14),7),IF($F$1=\"Hornets\",OFFSET(Hornets!$L$2,ROW(F14),7),IF($F$1=\"Guardians\",OFFSET(Wolves!$L$2,ROW(F14),7),IF($F$1=\"Reds\",OFFSET(Comets!$L$2,ROW(F14),7),))))))))","v":4},{"$f":"IF($F$1=\"Drillers\",OFFSET(Drillers!$L$2,ROW(F14),8),IF($F$1=\"Bulls\",OFFSET(Bulls!$L$2,ROW(F14),8),IF($F$1=\"Phantoms\",OFFSET(Phantoms!$L$2,ROW(F14),8),IF($F$1=\"Gators\",OFFSET(Gators!$L$2,ROW(F14),8),IF($F$1=\"Knights\",OFFSET(Knights!$L$2,ROW(F14),8),IF($F$1=\"Hornets\",OFFSET(Hornets!$L$2,ROW(F14),8),IF($F$1=\"Guardians\",OFFSET(Wolves!$L$2,ROW(F14),8),IF($F$1=\"Reds\",OFFSET(Comets!$L$2,ROW(F14),8)))))))))","v":4},{"$f":"IF($F$1=\"Drillers\",OFFSET(Drillers!$L$2,ROW($F14),9),IF($F$1=\"Bulls\",OFFSET(Bulls!$L$2,ROW($F14),9),IF($F$1=\"Phantoms\",OFFSET(Phantoms!$L$2,ROW($F14),9),IF($F$1=\"Gators\",OFFSET(Gators!$L$2,ROW($F14),9),IF($F$1=\"Knights\",OFFSET(Knights!$L$2,ROW($F14),9),IF($F$1=\"Hornets\",OFFSET(Hornets!$L$2,ROW(F14),9),IF($F$1=\"Guardians\",OFFSET(Wolves!$L$2,ROW($F14),9),IF($F$1=\"Reds\",OFFSET(Comets!$L$2,ROW($F14),9)))))))))","v":2},{"$f":"IF($F$1=\"Drillers\",OFFSET(Drillers!$L$2,ROW(F14),10),IF($F$1=\"Bulls\",OFFSET(Bulls!$L$2,ROW(F14),10),IF($F$1=\"Phantoms\",OFFSET(Phantoms!$L$2,ROW(F14),10),IF($F$1=\"Gators\",OFFSET(Gators!$L$2,ROW(F14),10),IF($F$1=\"Knights\",OFFSET(Knights!$L$2,ROW(F14),10),IF($F$1=\"Hornets\",OFFSET(Hornets!$L$2,ROW(F14),10),IF($F$1=\"Guardians\",OFFSET(Wolves!$L$2,ROW(F14),10),IF($F$1=\"Reds\",OFFSET(Comets!$L$2,ROW(F14),10)))))))))","v":3},{"$f":"IF($F$1=\"Drillers\",OFFSET(Drillers!$L$2,ROW(F14),11),IF($F$1=\"Bulls\",OFFSET(Bulls!$L$2,ROW(F14),11),IF($F$1=\"Phantoms\",OFFSET(Phantoms!$L$2,ROW(F14),11),IF($F$1=\"Gators\",OFFSET(Gators!$L$2,ROW(F14),11),IF($F$1=\"Knights\",OFFSET(Knights!$L$2,ROW(F14),11),IF($F$1=\"Hornets\",OFFSET(Hornets!$L$2,ROW(F14),11),IF($F$1=\"Guardians\",OFFSET(Wolves!$L$2,ROW(F14),11),IF($F$1=\"Drillers\",OFFSET(Drillers!$L$2,ROW(F14),11),IF($F$1=\"Reds\",OFFSET(Comets!$L$2,ROW(F14),11))))))))))","v":4},{"$f":"IF($F$1=\"Drillers\",OFFSET(Drillers!$L$2,ROW(F14),12),IF($F$1=\"Bulls\",OFFSET(Bulls!$L$2,ROW(F14),12),IF($F$1=\"Phantoms\",OFFSET(Phantoms!$L$2,ROW(F14),12),IF($F$1=\"Gators\",OFFSET(Gators!$L$2,ROW(F14),12),IF($F$1=\"Knights\",OFFSET(Knights!$L$2,ROW(F14),12),IF($F$1=\"Hornets\",OFFSET(Hornets!$L$2,ROW(F14),12),IF($F$1=\"Guardians\",OFFSET(Wolves!$L$2,ROW(F14),12),IF($F$1=\"Reds\",OFFSET(Comets!$L$2,ROW(F14),12),))))))))","v":"2B"},{"$f":"IF($F$1=\"Drillers\",OFFSET(Drillers!$L$2,ROW(F14),13),IF($F$1=\"Bulls\",OFFSET(Bulls!$L$2,ROW(F14),13),IF($F$1=\"Phantoms\",OFFSET(Phantoms!$L$2,ROW(F14),13),IF($F$1=\"Gators\",OFFSET(Gators!$L$2,ROW(F14),13),IF($F$1=\"Knights\",OFFSET(Knights!$L$2,ROW(F14),13),IF($F$1=\"Hornets\",OFFSET(Hornets!$L$2,ROW(F14),13),IF($F$1=\"Guardians\",OFFSET(Wolves!$L$2,ROW(F14),13),IF($F$1=\"Reds\",OFFSET(Comets!$L$2,ROW(F14),13),))))))))","v":"3B"},{"$f":"IF($F$1=\"Drillers\",OFFSET(Drillers!$L$2,ROW(F14),14),IF($F$1=\"Bulls\",OFFSET(Bulls!$L$2,ROW(F14),14),IF($F$1=\"Phantoms\",OFFSET(Phantoms!$L$2,ROW(F14),14),IF($F$1=\"Gators\",OFFSET(Gators!$L$2,ROW(F14),14),IF($F$1=\"Knights\",OFFSET(Knights!$L$2,ROW(F14),14),IF($F$1=\"Hornets\",OFFSET(Hornets!$L$2,ROW(F14),14),IF($F$1=\"Guardians\",OFFSET(Wolves!$L$2,ROW(F14),14,),IF($F$1=\"Reds\",OFFSET(Comets!$L$2,ROW(F14),14)))))))))","v":2},{"$f":"IF($F$1=\"Drillers\",OFFSET(Drillers!$L$2,ROW(F14),15),IF($F$1=\"Bulls\",OFFSET(Bulls!$L$2,ROW(F14),15),IF($F$1=\"Phantoms\",OFFSET(Phantoms!$L$2,ROW(F14),15),IF($F$1=\"Gators\",OFFSET(Gators!$L$2,ROW(F14),15),IF($F$1=\"Knights\",OFFSET(Knights!$L$2,ROW(F14),15),IF($F$1=\"Hornets\",OFFSET(Hornets!$L$2,ROW(F14),15),IF($F$1=\"Guardians\",OFFSET(Wolves!$L$2,ROW(F14),15),IF($F$1=\"Reds\",OFFSET(Comets!$L$2,ROW(F14),15)))))))))","v":0},{"$f":"IF($F$1=\"Drillers\",OFFSET(Drillers!$L$2,ROW(F14),16),IF($F$1=\"Bulls\",OFFSET(Bulls!$L$2,ROW(F14),16),IF($F$1=\"Phantoms\",OFFSET(Phantoms!$L$2,ROW(F14),16),IF($F$1=\"Gators\",OFFSET(Gators!$L$2,ROW(F14),16),IF($F$1=\"Knights\",OFFSET(Knights!$L$2,ROW(F14),16),IF($F$1=\"Hornets\",OFFSET(Hornets!$L$2,ROW(F14),16),IF($F$1=\"Guardians\",OFFSET(Wolves!$L$2,ROW(F14),16),IF($F$1=\"Reds\",OFFSET(Comets!$L$2,ROW(F14),16)))))))))","v":0},{"$f":"IF($F$1=\"Drillers\",OFFSET(Drillers!$L$2,ROW($F14),17),IF($F$1=\"Bulls\",OFFSET(Bulls!$L$2,ROW($F14),17),IF($F$1=\"Phantoms\",OFFSET(Phantoms!$L$2,ROW($F14),17),IF($F$1=\"Gators\",OFFSET(Gators!$L$2,ROW($F14),17),IF($F$1=\"Knights\",OFFSET(Knights!$L$2,ROW($F14),17),IF($F$1=\"Hornets\",OFFSET(Hornets!$L$2,ROW($F14),17),IF($F$1=\"Guardians\",OFFSET(Wolves!$L$2,ROW($F14),17),IF($F$1=\"Reds\",OFFSET(Comets!$L$2,ROW($F14),17)))))))))","v":1},{"$nulls":7},14,{"$f":"IF($AE$1=\"Drillers\",OFFSET(Drillers!$L$2,ROW($AE14),1),IF($AE$1=\"Bulls\",OFFSET(Bulls!$L$2,ROW($AE14),1),IF($AE$1=\"Phantoms\",OFFSET(Phantoms!$L$2,ROW($AE14),1),IF($AE$1=\"Gators\",OFFSET(Gators!$L$2,ROW($AE14),1),IF($AE$1=\"Knights\",OFFSET(Knights!$L$2,ROW($AE14),1),IF($AE$1=\"Hornets\",OFFSET(Hornets!$L$2,ROW($AE14),1),IF($AE$1=\"Wolves\",OFFSET(Wolves!$L$2,ROW($AE14),1),IF(AE$1=\"Comets\",OFFSET(Comets!$L$2,ROW($AE14),1)))))))))","v":"Stanley"},{"$f":"IF($AE$1=\"Drillers\",OFFSET(Drillers!$L$2,ROW($AF14),2),IF($AE$1=\"Bulls\",OFFSET(Bulls!$L$2,ROW($AF14),2),IF($AE$1=\"Phantoms\",OFFSET(Phantoms!$L$2,ROW($AF14),2),IF($AE$1=\"Gators\",OFFSET(Gators!$L$2,ROW($AF14),2),IF($AE$1=\"Knights\",OFFSET(Knights!$L$2,ROW($AF14),2),IF($AE$1=\"Hornets\",OFFSET(Hornets!$L$2,ROW($AF14),2),IF($AE$1=\"Wolves\",OFFSET(Wolves!$L$2,ROW($AF14),2),IF($AE$1=\"Comets\",OFFSET(Comets!$L$2,ROW($AF14),2)))))))))","v":"Todd"},{"$f":"IF($AE$1=\"Drillers\",OFFSET(Drillers!$L$2,ROW($AE14),3),IF($AE$1=\"Bulls\",OFFSET(Bulls!$L$2,ROW($AE14),3),IF($AE$1=\"Phantoms\",OFFSET(Phantoms!$L$2,ROW($AE14),3),IF($AE$1=\"Gators\",OFFSET(Gators!$L$2,ROW($AE14),3),IF($AE$1=\"Knights\",OFFSET(Knights!$L$2,ROW($AE14),3),IF($AE$1=\"Hornets\",OFFSET(Hornets!$L$2,ROW($AE14),3),IF($AE$1=\"Wolves\",OFFSET(Wolves!$L$2,ROW($AE14),3),IF($AE$1=\"Comets\",OFFSET(Comets!$L$2,ROW($AE14),3)))))))))","v":"R"},{"$f":"IF($AE$1=\"Drillers\",OFFSET(Drillers!$L$2,ROW($AE14),4),IF($AE$1=\"Bulls\",OFFSET(Bulls!$L$2,ROW($AE14),4),IF($AE$1=\"Phantoms\",OFFSET(Phantoms!$L$2,ROW($AE14),4),IF($AE$1=\"Gators\",OFFSET(Gators!$L$2,ROW($AE14),4),IF($AE$1=\"Knights\",OFFSET(Knights!$L$2,ROW($AE14),4),IF($AE$1=\"Hornets\",OFFSET(Hornets!$L$2,ROW($AE14),4),IF($AE$1=\"Wolves\",OFFSET(Wolves!$L$2,ROW($AE14),4),IF($AE$1=\"Comets\",OFFSET(Comets!$L$2,ROW($AE14),4)))))))))","v":"SS"},{"$f":"IF($AE$1=\"Drillers\",OFFSET(Drillers!$L$2,ROW($AE14),5),IF($AE$1=\"Bulls\",OFFSET(Bulls!$L$2,ROW($AE14),5),IF($AE$1=\"Phantoms\",OFFSET(Phantoms!$L$2,ROW($AE14),5),IF($AE$1=\"Gators\",OFFSET(Gators!$L$2,ROW($AE14),5),IF($AE$1=\"Knights\",OFFSET(Knights!$L$2,ROW($AE14),5),IF($AE$1=\"Hornets\",OFFSET(Hornets!$L$2,ROW($AE14),5),IF($AE$1=\"Wolves\",OFFSET(Wolves!$L$2,ROW($AE14),5),IF($AE$1=\"Comets\",OFFSET(Comets!$L$2,ROW($AE14),5)))))))))","v":3},{"$f":"IF($AE$1=\"Drillers\",OFFSET(Drillers!$L$2,ROW($AE14),6),IF($AE$1=\"Bulls\",OFFSET(Bulls!$L$2,ROW($AE14),6),IF($AE$1=\"Phantoms\",OFFSET(Phantoms!$L$2,ROW($AE14),6),IF($AE$1=\"Gators\",OFFSET(Gators!$L$2,ROW($AE14),6),IF($AE$1=\"Knights\",OFFSET(Knights!$L$2,ROW($AE14),6),IF($AE$1=\"Hornets\",OFFSET(Hornets!$L$2,ROW($AE14),6),IF($AE$1=\"Wolves\",OFFSET(Wolves!$L$2,ROW($AE14),6),IF($AE$1=\"Comets\",OFFSET(Comets!$L$2,ROW($AE14),6)))))))))","v":2},{"$f":"IF($AE$1=\"Drillers\",OFFSET(Drillers!$L$2,ROW($AE14),7),IF($AE$1=\"Bulls\",OFFSET(Bulls!$L$2,ROW($AE14),7),IF($AE$1=\"Phantoms\",OFFSET(Phantoms!$L$2,ROW($AE14),7),IF($AE$1=\"Gators\",OFFSET(Gators!$L$2,ROW($AE14),7),IF($AE$1=\"Knights\",OFFSET(Knights!$L$2,ROW($AE14),7),IF($AE$1=\"Hornets\",OFFSET(Hornets!$L$2,ROW($AE14),7),IF($AE$1=\"Wolves\",OFFSET(Wolves!$L$2,ROW($AE14),7),IF($AE$1=\"Comets\",OFFSET(Comets!$L$2,ROW($AE14),7)))))))))","v":2},{"$f":"IF($AE$1=\"Drillers\",OFFSET(Drillers!$L$2,ROW($AE14),8),IF($AE$1=\"Bulls\",OFFSET(Bulls!$L$2,ROW($AE14),8),IF($AE$1=\"Phantoms\",OFFSET(Phantoms!$L$2,ROW($AE14),8),IF($AE$1=\"Gators\",OFFSET(Gators!$L$2,ROW($AE14),8),IF($AE$1=\"Knights\",OFFSET(Knights!$L$2,ROW($AE14),8),IF($AE$1=\"Hornets\",OFFSET(Hornets!$L$2,ROW($AE14),8),IF($AE$1=\"Wolves\",OFFSET(Wolves!$L$2,ROW($AE14),8),IF($AE$1=\"Comets\",OFFSET(Comets!$L$2,ROW($AE14),8)))))))))","v":3},{"$f":"IF($AE$1=\"Drillers\",OFFSET(Drillers!$L$2,ROW($AE14),9),IF($AE$1=\"Bulls\",OFFSET(Bulls!$L$2,ROW($AE14),9),IF($AE$1=\"Phantoms\",OFFSET(Phantoms!$L$2,ROW($AE14),9),IF($AE$1=\"Gators\",OFFSET(Gators!$L$2,ROW($AE14),9),IF($AE$1=\"Knights\",OFFSET(Knights!$L$2,ROW($AE14),9),IF($AE$1=\"Hornets\",OFFSET(Hornets!$L$2,ROW($AE14),9),IF($AE$1=\"Wolves\",OFFSET(Wolves!$L$2,ROW($AE14),9),IF($AE$1=\"Comets\",OFFSET(Comets!$L$2,ROW($AE14),9)))))))))","v":2},{"$f":"IF($AE$1=\"Drillers\",OFFSET(Drillers!$L$2,ROW($AE14),10),IF($AE$1=\"Bulls\",OFFSET(Bulls!$L$2,ROW($AE14),10),IF($AE$1=\"Phantoms\",OFFSET(Phantoms!$L$2,ROW($AE14),10),IF($AE$1=\"Gators\",OFFSET(Gators!$L$2,ROW($AE14),10),IF($AE$1=\"Knights\",OFFSET(Knights!$L$2,ROW($AE14),10),IF($AE$1=\"Hornets\",OFFSET(Hornets!$L$2,ROW($AE14),10),IF($AE$1=\"Wolves\",OFFSET(Wolves!$L$2,ROW($AE14),10),IF($AE$1=\"Comets\",OFFSET(Comets!$L$2,ROW($AE14),10)))))))))","v":2},{"$f":"IF($AE$1=\"Drillers\",OFFSET(Drillers!$L$2,ROW($AE14),11),IF($AE$1=\"Bulls\",OFFSET(Bulls!$L$2,ROW($AE14),11),IF($AE$1=\"Phantoms\",OFFSET(Phantoms!$L$2,ROW($AE14),11),IF($AE$1=\"Gators\",OFFSET(Gators!$L$2,ROW($AE14),11),IF($AE$1=\"Knights\",OFFSET(Knights!$L$2,ROW($AE14),11),IF($AE$1=\"Hornets\",OFFSET(Hornets!$L$2,ROW($AE14),11),IF($AE$1=\"Wolves\",OFFSET(Wolves!$L$2,ROW($AE14),11),IF($AE$1=\"Comets\",OFFSET(Comets!$L$2,ROW($AE14),11)))))))))","v":2},{"$f":"IF($AE$1=\"Drillers\",OFFSET(Drillers!$L$2,ROW($AE14),12),IF($AE$1=\"Bulls\",OFFSET(Bulls!$L$2,ROW($AE14),12),IF($AE$1=\"Phantoms\",OFFSET(Phantoms!$L$2,ROW($AE14),12),IF($AE$1=\"Gators\",OFFSET(Gators!$L$2,ROW($AE14),12),IF($AE$1=\"Knights\",OFFSET(Knights!$L$2,ROW($AE14),12),IF($AE$1=\"Hornets\",OFFSET(Hornets!$L$2,ROW($AE14),12),IF($AE$1=\"Wolves\",OFFSET(Wolves!$L$2,ROW($AE14),12),IF($AE$1=\"Comets\",OFFSET(Comets!$L$2,ROW($AE14),12)))))))))","v":"RF"},{"$f":"IF($AE$1=\"Drillers\",OFFSET(Drillers!$L$2,ROW($AE14),13),IF($AE$1=\"Bulls\",OFFSET(Bulls!$L$2,ROW($AE14),13),IF($AE$1=\"Phantoms\",OFFSET(Phantoms!$L$2,ROW($AE14),13),IF($AE$1=\"Gators\",OFFSET(Gators!$L$2,ROW($AE14),13),IF($AE$1=\"Knights\",OFFSET(Knights!$L$2,ROW($AE14),13),IF($AE$1=\"Hornets\",OFFSET(Hornets!$L$2,ROW($AE14),13),IF($AE$1=\"Wolves\",OFFSET(Wolves!$L$2,ROW($AE14),13),IF($AE$1=\"Comets\",OFFSET(Comets!$L$2,ROW($AE14),13)))))))))","v":0},{"$f":"IF($AE$1=\"Drillers\",OFFSET(Drillers!$L$2,ROW($AE14),14),IF($AE$1=\"Bulls\",OFFSET(Bulls!$L$2,ROW($AE14),14),IF($AE$1=\"Phantoms\",OFFSET(Phantoms!$L$2,ROW($AE14),14),IF($AE$1=\"Gators\",OFFSET(Gators!$L$2,ROW($AE14),14),IF($AE$1=\"Knights\",OFFSET(Knights!$L$2,ROW($AE14),14),IF($AE$1=\"Hornets\",OFFSET(Hornets!$L$2,ROW($AE14),14),IF($AE$1=\"Wolves\",OFFSET(Wolves!$L$2,ROW($AE14),14),IF($AE$1=\"Comets\",OFFSET(Comets!$L$2,ROW($AE14),14)))))))))","v":1},{"$f":"IF(AE$1=\"Drillers\",OFFSET(Drillers!$L$2,ROW(AE14),15),IF(AE$1=\"Bulls\",OFFSET(Bulls!$L$2,ROW(AE14),15),IF(AE$1=\"Phantoms\",OFFSET(Phantoms!$L$2,ROW(AE14),15),IF(AE$1=\"Gators\",OFFSET(Gators!$L$2,ROW(AE14),15),IF(AE$1=\"Knights\",OFFSET(Knights!$L$2,ROW(AE14),15),IF(AE$1=\"Hornets\",OFFSET(Hornets!$L$2,ROW(AE14),15),IF(AE$1=\"Wolves\",OFFSET(Wolves!$L$2,ROW(AE14),15),IF(AE$1=\"Comets\",OFFSET(Comets!$L$2,ROW(AE14),15)))))))))","v":0},{"$f":"IF($AE$1=\"Drillers\",OFFSET(Drillers!$L$2,ROW(AE14),16),IF($AE$1=\"Bulls\",OFFSET(Bulls!$L$2,ROW(AE14),16),IF($AE$1=\"Phantoms\",OFFSET(Phantoms!$L$2,ROW(AE14),16),IF($AE$1=\"Gators\",OFFSET(Gators!$L$2,ROW(AE14),16),IF($AE$1=\"Knights\",OFFSET(Knights!$L$2,ROW(AE14),16),IF($AE$1=\"Hornets\",OFFSET(Hornets!$L$2,ROW(AE14),16),IF($AE$1=\"Wolves\",OFFSET(Wolves!$L$2,ROW(AE14),16),IF($AE$1=\"Comets\",OFFSET(Comets!$L$2,ROW(AE14),16)))))))))","v":0},{"$f":"IF($AE$1=\"Drillers\",OFFSET(Drillers!$L$2,ROW($AE14),17),IF($AE$1=\"Bulls\",OFFSET(Bulls!$L$2,ROW($AE14),17),IF($AE$1=\"Phantoms\",OFFSET(Phantoms!$L$2,ROW($AE14),17),IF($AE$1=\"Gators\",OFFSET(Gators!$L$2,ROW($AE14),17),IF($AE$1=\"Knights\",OFFSET(Knights!$L$2,ROW($AE14),17),IF($AE$1=\"Hornets\",OFFSET(Hornets!$L$2,ROW($AE14),17),IF($AE$1=\"Wolves\",OFFSET(Wolves!$L$2,ROW($AE14),17),IF($AE$1=\"Comets\",OFFSET(Comets!$L$2,ROW($AE14),17)))))))))","v":2}]
[{"$nulls":4},15,{"$f":"IF($F$1=\"Drillers\",OFFSET(Drillers!$L$2,ROW($F15),1),IF($F$1=\"Bulls\",OFFSET(Bulls!$L$2,ROW($F15),1),IF($F$1=\"Phantoms\",OFFSET(Phantoms!$L$2,ROW($F15),1),IF($F$1=\"Gators\",OFFSET(Gators!$L$2,ROW($F15),1),IF($F$1=\"Knights\",OFFSET(Knights!$L$2,ROW($F15),1),IF($F$1=\"Hornets\",OFFSET(Hornets!$L$2,ROW($F15),1),IF($F$1=\"Reds\",OFFSET(Comets!$L$2,ROW($F15),1),IF($F$1=\"Guardians\",OFFSET(Wolves!$L$2,ROW($F15),1)))))))))","v":"Aldridge"},{"$f":"IF($F$1=\"Drillers\",OFFSET(Drillers!$L$2,ROW($F15),2),IF($F$1=\"Bulls\",OFFSET(Bulls!$L$2,ROW($F15),2),IF($F$1=\"Phantoms\",OFFSET(Phantoms!$L$2,ROW($F15),2),IF($F$1=\"Gators\",OFFSET(Gators!$L$2,ROW($F15),2),IF($F$1=\"Knights\",OFFSET(Knights!$L$2,ROW($F15),2),IF($F$1=\"Hornets\",OFFSET(Hornets!$L$2,ROW($F15),2),IF($F$1=\"Reds\",OFFSET(Comets!$L$2,ROW($F15),2),IF($F$1=\"Guardians\",OFFSET(Wolves!$L$2,ROW($F15),2)))))))))","v":"Joe"},{"$f":"IF($F$1=\"Drillers\",OFFSET(Drillers!$L$2,ROW($F15),3),IF($F$1=\"Bulls\",OFFSET(Bulls!$L$2,ROW($F15),3),IF($F$1=\"Phantoms\",OFFSET(Phantoms!$L$2,ROW($F15),3),IF($F$1=\"Gators\",OFFSET(Gators!$L$2,ROW($F15),3),IF($F$1=\"Knights\",OFFSET(Knights!$L$2,ROW($F15),3),IF($F$1=\"Hornets\",OFFSET(Hornets!$L$2,ROW($F15),3),IF($F$1=\"Guardians\",OFFSET(Wolves!$L$2,ROW($F15),3),IF($F$1=\"Reds\",OFFSET(Comets!$L$2,ROW($F15),3)))))))))","v":"B"},{"$f":"IF($F$1=\"Drillers\",OFFSET(Drillers!$L$2,ROW($F15),4),IF($F$1=\"Bulls\",OFFSET(Bulls!$L$2,ROW($F15),4),IF($F$1=\"Phantoms\",OFFSET(Phantoms!$L$2,ROW($F15),4),IF($F$1=\"Gators\",OFFSET(Gators!$L$2,ROW($F15),4),IF($F$1=\"Knights\",OFFSET(Knights!$L$2,ROW($F15),4),IF($F$1=\"Hornets\",OFFSET(Hornets!$L$2,ROW($F15),4),IF($F$1=\"Guardians\",OFFSET(Wolves!$L$2,ROW($F15),4),IF($F$1=\"Reds\",OFFSET(Comets!$L$2,ROW($F15),4)))))))))","v":"1B"},{"$f":"IF($F$1=\"Drillers\",OFFSET(Drillers!$L$2,ROW($F15),5),IF($F$1=\"Bulls\",OFFSET(Bulls!$L$2,ROW($F15),5),IF($F$1=\"Phantoms\",OFFSET(Phantoms!$L$2,ROW($F15),5),IF($F$1=\"Gators\",OFFSET(Gators!$L$2,ROW($F15),5),IF($F$1=\"Knights\",OFFSET(Knights!$L$2,ROW($F15),5),IF($F$1=\"Hornets\",OFFSET(Hornets!$L$2,ROW($F15),5),IF($F$1=\"Guardians\",OFFSET(Wolves!$L$2,ROW($F15),5),IF($F$1=\"Reds\",OFFSET(Comets!$L$2,ROW($F15),5)))))))))","v":1},{"$f":"IF($F$1=\"Drillers\",OFFSET(Drillers!$L$2,ROW($F15),6),IF($F$1=\"Bulls\",OFFSET(Bulls!$L$2,ROW($F15),6),IF($F$1=\"Phantoms\",OFFSET(Phantoms!$L$2,ROW($F15),6),IF($F$1=\"Gators\",OFFSET(Gators!$L$2,ROW($F15),6),IF($F$1=\"Knights\",OFFSET(Knights!$L$2,ROW($F15),6),IF($F$1=\"Hornets\",OFFSET(Hornets!$L$2,ROW($F15),6),IF($F$1=\"Guardians\",OFFSET(Wolves!$L$2,ROW($F15),6),IF($F$1=\"Reds\",OFFSET(Comets!$L$2,ROW($F15),6)))))))))","v":2},{"$f":"IF($F$1=\"Drillers\",OFFSET(Drillers!$L$2,ROW(F15),7),IF($F$1=\"Bulls\",OFFSET(Bulls!$L$2,ROW(F15),7),IF($F$1=\"Phantoms\",OFFSET(Phantoms!$L$2,ROW(F15),7),IF($F$1=\"Gators\",OFFSET(Gators!$L$2,ROW(F15),7),IF($F$1=\"Knights\",OFFSET(Knights!$L$2,ROW(F15),7),IF($F$1=\"Hornets\",OFFSET(Hornets!$L$2,ROW(F15),7),IF($F$1=\"Guardians\",OFFSET(Wolves!$L$2,ROW(F15),7),IF($F$1=\"Reds\",OFFSET(Comets!$L$2,ROW(F15),7),))))))))","v":2},{"$f":"IF($F$1=\"Drillers\",OFFSET(Drillers!$L$2,ROW(F15),8),IF($F$1=\"Bulls\",OFFSET(Bulls!$L$2,ROW(F15),8),IF($F$1=\"Phantoms\",OFFSET(Phantoms!$L$2,ROW(F15),8),IF($F$1=\"Gators\",OFFSET(Gators!$L$2,ROW(F15),8),IF($F$1=\"Knights\",OFFSET(Knights!$L$2,ROW(F15),8),IF($F$1=\"Hornets\",OFFSET(Hornets!$L$2,ROW(F15),8),IF($F$1=\"Guardians\",OFFSET(Wolves!$L$2,ROW(F15),8),IF($F$1=\"Reds\",OFFSET(Comets!$L$2,ROW(F15),8)))))))))","v":2},{"$f":"IF($F$1=\"Drillers\",OFFSET(Drillers!$L$2,ROW($F15),9),IF($F$1=\"Bulls\",OFFSET(Bulls!$L$2,ROW($F15),9),IF($F$1=\"Phantoms\",OFFSET(Phantoms!$L$2,ROW($F15),9),IF($F$1=\"Gators\",OFFSET(Gators!$L$2,ROW($F15),9),IF($F$1=\"Knights\",OFFSET(Knights!$L$2,ROW($F15),9),IF($F$1=\"Hornets\",OFFSET(Hornets!$L$2,ROW(F15),9),IF($F$1=\"Guardians\",OFFSET(Wolves!$L$2,ROW($F15),9),IF($F$1=\"Reds\",OFFSET(Comets!$L$2,ROW($F15),9)))))))))","v":1},{"$f":"IF($F$1=\"Drillers\",OFFSET(Drillers!$L$2,ROW(F15),10),IF($F$1=\"Bulls\",OFFSET(Bulls!$L$2,ROW(F15),10),IF($F$1=\"Phantoms\",OFFSET(Phantoms!$L$2,ROW(F15),10),IF($F$1=\"Gators\",OFFSET(Gators!$L$2,ROW(F15),10),IF($F$1=\"Knights\",OFFSET(Knights!$L$2,ROW(F15),10),IF($F$1=\"Hornets\",OFFSET(Hornets!$L$2,ROW(F15),10),IF($F$1=\"Guardians\",OFFSET(Wolves!$L$2,ROW(F15),10),IF($F$1=\"Reds\",OFFSET(Comets!$L$2,ROW(F15),10)))))))))","v":3},{"$f":"IF($F$1=\"Drillers\",OFFSET(Drillers!$L$2,ROW(F15),11),IF($F$1=\"Bulls\",OFFSET(Bulls!$L$2,ROW(F15),11),IF($F$1=\"Phantoms\",OFFSET(Phantoms!$L$2,ROW(F15),11),IF($F$1=\"Gators\",OFFSET(Gators!$L$2,ROW(F15),11),IF($F$1=\"Knights\",OFFSET(Knights!$L$2,ROW(F15),11),IF($F$1=\"Hornets\",OFFSET(Hornets!$L$2,ROW(F15),11),IF($F$1=\"Guardians\",OFFSET(Wolves!$L$2,ROW(F15),11),IF($F$1=\"Drillers\",OFFSET(Drillers!$L$2,ROW(F15),11),IF($F$1=\"Reds\",OFFSET(Comets!$L$2,ROW(F15),11))))))))))","v":1},{"$f":"IF($F$1=\"Drillers\",OFFSET(Drillers!$L$2,ROW(F15),12),IF($F$1=\"Bulls\",OFFSET(Bulls!$L$2,ROW(F15),12),IF($F$1=\"Phantoms\",OFFSET(Phantoms!$L$2,ROW(F15),12),IF($F$1=\"Gators\",OFFSET(Gators!$L$2,ROW(F15),12),IF($F$1=\"Knights\",OFFSET(Knights!$L$2,ROW(F15),12),IF($F$1=\"Hornets\",OFFSET(Hornets!$L$2,ROW(F15),12),IF($F$1=\"Guardians\",OFFSET(Wolves!$L$2,ROW(F15),12),IF($F$1=\"Reds\",OFFSET(Comets!$L$2,ROW(F15),12),))))))))","v":"C"},{"$f":"IF($F$1=\"Drillers\",OFFSET(Drillers!$L$2,ROW(F15),13),IF($F$1=\"Bulls\",OFFSET(Bulls!$L$2,ROW(F15),13),IF($F$1=\"Phantoms\",OFFSET(Phantoms!$L$2,ROW(F15),13),IF($F$1=\"Gators\",OFFSET(Gators!$L$2,ROW(F15),13),IF($F$1=\"Knights\",OFFSET(Knights!$L$2,ROW(F15),13),IF($F$1=\"Hornets\",OFFSET(Hornets!$L$2,ROW(F15),13),IF($F$1=\"Guardians\",OFFSET(Wolves!$L$2,ROW(F15),13),IF($F$1=\"Reds\",OFFSET(Comets!$L$2,ROW(F15),13),))))))))","v":0},{"$f":"IF($F$1=\"Drillers\",OFFSET(Drillers!$L$2,ROW(F15),14),IF($F$1=\"Bulls\",OFFSET(Bulls!$L$2,ROW(F15),14),IF($F$1=\"Phantoms\",OFFSET(Phantoms!$L$2,ROW(F15),14),IF($F$1=\"Gators\",OFFSET(Gators!$L$2,ROW(F15),14),IF($F$1=\"Knights\",OFFSET(Knights!$L$2,ROW(F15),14),IF($F$1=\"Hornets\",OFFSET(Hornets!$L$2,ROW(F15),14),IF($F$1=\"Guardians\",OFFSET(Wolves!$L$2,ROW(F15),14,),IF($F$1=\"Reds\",OFFSET(Comets!$L$2,ROW(F15),14)))))))))","v":1},{"$f":"IF($F$1=\"Drillers\",OFFSET(Drillers!$L$2,ROW(F15),15),IF($F$1=\"Bulls\",OFFSET(Bulls!$L$2,ROW(F15),15),IF($F$1=\"Phantoms\",OFFSET(Phantoms!$L$2,ROW(F15),15),IF($F$1=\"Gators\",OFFSET(Gators!$L$2,ROW(F15),15),IF($F$1=\"Knights\",OFFSET(Knights!$L$2,ROW(F15),15),IF($F$1=\"Hornets\",OFFSET(Hornets!$L$2,ROW(F15),15),IF($F$1=\"Guardians\",OFFSET(Wolves!$L$2,ROW(F15),15),IF($F$1=\"Reds\",OFFSET(Comets!$L$2,ROW(F15),15)))))))))","v":0},{"$f":"IF($F$1=\"Drillers\",OFFSET(Drillers!$L$2,ROW(F15),16),IF($F$1=\"Bulls\",OFFSET(Bulls!$L$2,ROW(F15),16),IF($F$1=\"Phantoms\",OFFSET(Phantoms!$L$2,ROW(F15),16),IF($F$1=\"Gators\",OFFSET(Gators!$L$2,ROW(F15),16),IF($F$1=\"Knights\",OFFSET(Knights!$L$2,ROW(F15),16),IF($F$1=\"Hornets\",OFFSET(Hornets!$L$2,ROW(F15),16),IF($F$1=\"Guardians\",OFFSET(Wolves!$L$2,ROW(F15),16),IF($F$1=\"Reds\",OFFSET(Comets!$L$2,ROW(F15),16)))))))))","v":0},{"$f":"IF($F$1=\"Drillers\",OFFSET(Drillers!$L$2,ROW($F15),17),IF($F$1=\"Bulls\",OFFSET(Bulls!$L$2,ROW($F15),17),IF($F$1=\"Phantoms\",OFFSET(Phantoms!$L$2,ROW($F15),17),IF($F$1=\"Gators\",OFFSET(Gators!$L$2,ROW($F15),17),IF($F$1=\"Knights\",OFFSET(Knights!$L$2,ROW($F15),17),IF($F$1=\"Hornets\",OFFSET(Hornets!$L$2,ROW($F15),17),IF($F$1=\"Guardians\",OFFSET(Wolves!$L$2,ROW($F15),17),IF($F$1=\"Reds\",OFFSET(Comets!$L$2,ROW($F15),17)))))))))","v":3},{"$nulls":7},15,{"$f":"IF($AE$1=\"Drillers\",OFFSET(Drillers!$L$2,ROW($AE15),1),IF($AE$1=\"Bulls\",OFFSET(Bulls!$L$2,ROW($AE15),1),IF($AE$1=\"Phantoms\",OFFSET(Phantoms!$L$2,ROW($AE15),1),IF($AE$1=\"Gators\",OFFSET(Gators!$L$2,ROW($AE15),1),IF($AE$1=\"Knights\",OFFSET(Knights!$L$2,ROW($AE15),1),IF($AE$1=\"Hornets\",OFFSET(Hornets!$L$2,ROW($AE15),1),IF($AE$1=\"Wolves\",OFFSET(Wolves!$L$2,ROW($AE15),1),IF(AE$1=\"Comets\",OFFSET(Comets!$L$2,ROW($AE15),1)))))))))","v":"Garcia"},{"$f":"IF($AE$1=\"Drillers\",OFFSET(Drillers!$L$2,ROW($AF15),2),IF($AE$1=\"Bulls\",OFFSET(Bulls!$L$2,ROW($AF15),2),IF($AE$1=\"Phantoms\",OFFSET(Phantoms!$L$2,ROW($AF15),2),IF($AE$1=\"Gators\",OFFSET(Gators!$L$2,ROW($AF15),2),IF($AE$1=\"Knights\",OFFSET(Knights!$L$2,ROW($AF15),2),IF($AE$1=\"Hornets\",OFFSET(Hornets!$L$2,ROW($AF15),2),IF($AE$1=\"Wolves\",OFFSET(Wolves!$L$2,ROW($AF15),2),IF($AE$1=\"Comets\",OFFSET(Comets!$L$2,ROW($AF15),2)))))))))","v":"Jose"},{"$f":"IF($AE$1=\"Drillers\",OFFSET(Drillers!$L$2,ROW($AE15),3),IF($AE$1=\"Bulls\",OFFSET(Bulls!$L$2,ROW($AE15),3),IF($AE$1=\"Phantoms\",OFFSET(Phantoms!$L$2,ROW($AE15),3),IF($AE$1=\"Gators\",OFFSET(Gators!$L$2,ROW($AE15),3),IF($AE$1=\"Knights\",OFFSET(Knights!$L$2,ROW($AE15),3),IF($AE$1=\"Hornets\",OFFSET(Hornets!$L$2,ROW($AE15),3),IF($AE$1=\"Wolves\",OFFSET(Wolves!$L$2,ROW($AE15),3),IF($AE$1=\"Comets\",OFFSET(Comets!$L$2,ROW($AE15),3)))))))))","v":"L"},{"$f":"IF($AE$1=\"Drillers\",OFFSET(Drillers!$L$2,ROW($AE15),4),IF($AE$1=\"Bulls\",OFFSET(Bulls!$L$2,ROW($AE15),4),IF($AE$1=\"Phantoms\",OFFSET(Phantoms!$L$2,ROW($AE15),4),IF($AE$1=\"Gators\",OFFSET(Gators!$L$2,ROW($AE15),4),IF($AE$1=\"Knights\",OFFSET(Knights!$L$2,ROW($AE15),4),IF($AE$1=\"Hornets\",OFFSET(Hornets!$L$2,ROW($AE15),4),IF($AE$1=\"Wolves\",OFFSET(Wolves!$L$2,ROW($AE15),4),IF($AE$1=\"Comets\",OFFSET(Comets!$L$2,ROW($AE15),4)))))))))","v":"CF"},{"$f":"IF($AE$1=\"Drillers\",OFFSET(Drillers!$L$2,ROW($AE15),5),IF($AE$1=\"Bulls\",OFFSET(Bulls!$L$2,ROW($AE15),5),IF($AE$1=\"Phantoms\",OFFSET(Phantoms!$L$2,ROW($AE15),5),IF($AE$1=\"Gators\",OFFSET(Gators!$L$2,ROW($AE15),5),IF($AE$1=\"Knights\",OFFSET(Knights!$L$2,ROW($AE15),5),IF($AE$1=\"Hornets\",OFFSET(Hornets!$L$2,ROW($AE15),5),IF($AE$1=\"Wolves\",OFFSET(Wolves!$L$2,ROW($AE15),5),IF($AE$1=\"Comets\",OFFSET(Comets!$L$2,ROW($AE15),5)))))))))","v":2},{"$f":"IF($AE$1=\"Drillers\",OFFSET(Drillers!$L$2,ROW($AE15),6),IF($AE$1=\"Bulls\",OFFSET(Bulls!$L$2,ROW($AE15),6),IF($AE$1=\"Phantoms\",OFFSET(Phantoms!$L$2,ROW($AE15),6),IF($AE$1=\"Gators\",OFFSET(Gators!$L$2,ROW($AE15),6),IF($AE$1=\"Knights\",OFFSET(Knights!$L$2,ROW($AE15),6),IF($AE$1=\"Hornets\",OFFSET(Hornets!$L$2,ROW($AE15),6),IF($AE$1=\"Wolves\",OFFSET(Wolves!$L$2,ROW($AE15),6),IF($AE$1=\"Comets\",OFFSET(Comets!$L$2,ROW($AE15),6)))))))))","v":3},{"$f":"IF($AE$1=\"Drillers\",OFFSET(Drillers!$L$2,ROW($AE15),7),IF($AE$1=\"Bulls\",OFFSET(Bulls!$L$2,ROW($AE15),7),IF($AE$1=\"Phantoms\",OFFSET(Phantoms!$L$2,ROW($AE15),7),IF($AE$1=\"Gators\",OFFSET(Gators!$L$2,ROW($AE15),7),IF($AE$1=\"Knights\",OFFSET(Knights!$L$2,ROW($AE15),7),IF($AE$1=\"Hornets\",OFFSET(Hornets!$L$2,ROW($AE15),7),IF($AE$1=\"Wolves\",OFFSET(Wolves!$L$2,ROW($AE15),7),IF($AE$1=\"Comets\",OFFSET(Comets!$L$2,ROW($AE15),7)))))))))","v":5},{"$f":"IF($AE$1=\"Drillers\",OFFSET(Drillers!$L$2,ROW($AE15),8),IF($AE$1=\"Bulls\",OFFSET(Bulls!$L$2,ROW($AE15),8),IF($AE$1=\"Phantoms\",OFFSET(Phantoms!$L$2,ROW($AE15),8),IF($AE$1=\"Gators\",OFFSET(Gators!$L$2,ROW($AE15),8),IF($AE$1=\"Knights\",OFFSET(Knights!$L$2,ROW($AE15),8),IF($AE$1=\"Hornets\",OFFSET(Hornets!$L$2,ROW($AE15),8),IF($AE$1=\"Wolves\",OFFSET(Wolves!$L$2,ROW($AE15),8),IF($AE$1=\"Comets\",OFFSET(Comets!$L$2,ROW($AE15),8)))))))))","v":5},{"$f":"IF($AE$1=\"Drillers\",OFFSET(Drillers!$L$2,ROW($AE15),9),IF($AE$1=\"Bulls\",OFFSET(Bulls!$L$2,ROW($AE15),9),IF($AE$1=\"Phantoms\",OFFSET(Phantoms!$L$2,ROW($AE15),9),IF($AE$1=\"Gators\",OFFSET(Gators!$L$2,ROW($AE15),9),IF($AE$1=\"Knights\",OFFSET(Knights!$L$2,ROW($AE15),9),IF($AE$1=\"Hornets\",OFFSET(Hornets!$L$2,ROW($AE15),9),IF($AE$1=\"Wolves\",OFFSET(Wolves!$L$2,ROW($AE15),9),IF($AE$1=\"Comets\",OFFSET(Comets!$L$2,ROW($AE15),9)))))))))","v":5},{"$f":"IF($AE$1=\"Drillers\",OFFSET(Drillers!$L$2,ROW($AE15),10),IF($AE$1=\"Bulls\",OFFSET(Bulls!$L$2,ROW($AE15),10),IF($AE$1=\"Phantoms\",OFFSET(Phantoms!$L$2,ROW($AE15),10),IF($AE$1=\"Gators\",OFFSET(Gators!$L$2,ROW($AE15),10),IF($AE$1=\"Knights\",OFFSET(Knights!$L$2,ROW($AE15),10),IF($AE$1=\"Hornets\",OFFSET(Hornets!$L$2,ROW($AE15),10),IF($AE$1=\"Wolves\",OFFSET(Wolves!$L$2,ROW($AE15),10),IF($AE$1=\"Comets\",OFFSET(Comets!$L$2,ROW($AE15),10)))))))))","v":4},{"$f":"IF($AE$1=\"Drillers\",OFFSET(Drillers!$L$2,ROW($AE15),11),IF($AE$1=\"Bulls\",OFFSET(Bulls!$L$2,ROW($AE15),11),IF($AE$1=\"Phantoms\",OFFSET(Phantoms!$L$2,ROW($AE15),11),IF($AE$1=\"Gators\",OFFSET(Gators!$L$2,ROW($AE15),11),IF($AE$1=\"Knights\",OFFSET(Knights!$L$2,ROW($AE15),11),IF($AE$1=\"Hornets\",OFFSET(Hornets!$L$2,ROW($AE15),11),IF($AE$1=\"Wolves\",OFFSET(Wolves!$L$2,ROW($AE15),11),IF($AE$1=\"Comets\",OFFSET(Comets!$L$2,ROW($AE15),11)))))))))","v":1},{"$f":"IF($AE$1=\"Drillers\",OFFSET(Drillers!$L$2,ROW($AE15),12),IF($AE$1=\"Bulls\",OFFSET(Bulls!$L$2,ROW($AE15),12),IF($AE$1=\"Phantoms\",OFFSET(Phantoms!$L$2,ROW($AE15),12),IF($AE$1=\"Gators\",OFFSET(Gators!$L$2,ROW($AE15),12),IF($AE$1=\"Knights\",OFFSET(Knights!$L$2,ROW($AE15),12),IF($AE$1=\"Hornets\",OFFSET(Hornets!$L$2,ROW($AE15),12),IF($AE$1=\"Wolves\",OFFSET(Wolves!$L$2,ROW($AE15),12),IF($AE$1=\"Comets\",OFFSET(Comets!$L$2,ROW($AE15),12)))))))))","v":"LF"},{"$f":"IF($AE$1=\"Drillers\",OFFSET(Drillers!$L$2,ROW($AE15),13),IF($AE$1=\"Bulls\",OFFSET(Bulls!$L$2,ROW($AE15),13),IF($AE$1=\"Phantoms\",OFFSET(Phantoms!$L$2,ROW($AE15),13),IF($AE$1=\"Gators\",OFFSET(Gators!$L$2,ROW($AE15),13),IF($AE$1=\"Knights\",OFFSET(Knights!$L$2,ROW($AE15),13),IF($AE$1=\"Hornets\",OFFSET(Hornets!$L$2,ROW($AE15),13),IF($AE$1=\"Wolves\",OFFSET(Wolves!$L$2,ROW($AE15),13),IF($AE$1=\"Comets\",OFFSET(Comets!$L$2,ROW($AE15),13)))))))))","v":"RF"},{"$f":"IF($AE$1=\"Drillers\",OFFSET(Drillers!$L$2,ROW($AE15),14),IF($AE$1=\"Bulls\",OFFSET(Bulls!$L$2,ROW($AE15),14),IF($AE$1=\"Phantoms\",OFFSET(Phantoms!$L$2,ROW($AE15),14),IF($AE$1=\"Gators\",OFFSET(Gators!$L$2,ROW($AE15),14),IF($AE$1=\"Knights\",OFFSET(Knights!$L$2,ROW($AE15),14),IF($AE$1=\"Hornets\",OFFSET(Hornets!$L$2,ROW($AE15),14),IF($AE$1=\"Wolves\",OFFSET(Wolves!$L$2,ROW($AE15),14),IF($AE$1=\"Comets\",OFFSET(Comets!$L$2,ROW($AE15),14)))))))))","v":0},{"$f":"IF(AE$1=\"Drillers\",OFFSET(Drillers!$L$2,ROW(AE15),15),IF(AE$1=\"Bulls\",OFFSET(Bulls!$L$2,ROW(AE15),15),IF(AE$1=\"Phantoms\",OFFSET(Phantoms!$L$2,ROW(AE15),15),IF(AE$1=\"Gators\",OFFSET(Gators!$L$2,ROW(AE15),15),IF(AE$1=\"Knights\",OFFSET(Knights!$L$2,ROW(AE15),15),IF(AE$1=\"Hornets\",OFFSET(Hornets!$L$2,ROW(AE15),15),IF(AE$1=\"Wolves\",OFFSET(Wolves!$L$2,ROW(AE15),15),IF(AE$1=\"Comets\",OFFSET(Comets!$L$2,ROW(AE15),15)))))))))","v":0},{"$f":"IF($AE$1=\"Drillers\",OFFSET(Drillers!$L$2,ROW(AE15),16),IF($AE$1=\"Bulls\",OFFSET(Bulls!$L$2,ROW(AE15),16),IF($AE$1=\"Phantoms\",OFFSET(Phantoms!$L$2,ROW(AE15),16),IF($AE$1=\"Gators\",OFFSET(Gators!$L$2,ROW(AE15),16),IF($AE$1=\"Knights\",OFFSET(Knights!$L$2,ROW(AE15),16),IF($AE$1=\"Hornets\",OFFSET(Hornets!$L$2,ROW(AE15),16),IF($AE$1=\"Wolves\",OFFSET(Wolves!$L$2,ROW(AE15),16),IF($AE$1=\"Comets\",OFFSET(Comets!$L$2,ROW(AE15),16)))))))))","v":0},{"$f":"IF($AE$1=\"Drillers\",OFFSET(Drillers!$L$2,ROW($AE15),17),IF($AE$1=\"Bulls\",OFFSET(Bulls!$L$2,ROW($AE15),17),IF($AE$1=\"Phantoms\",OFFSET(Phantoms!$L$2,ROW($AE15),17),IF($AE$1=\"Gators\",OFFSET(Gators!$L$2,ROW($AE15),17),IF($AE$1=\"Knights\",OFFSET(Knights!$L$2,ROW($AE15),17),IF($AE$1=\"Hornets\",OFFSET(Hornets!$L$2,ROW($AE15),17),IF($AE$1=\"Wolves\",OFFSET(Wolves!$L$2,ROW($AE15),17),IF($AE$1=\"Comets\",OFFSET(Comets!$L$2,ROW($AE15),17)))))))))","v":1}]
[]
[{"$nulls":7},"T","VsL","VsR","ST","-1","-2","-3","-4","-5","-6","-7","P",{"$nulls":13},"T","VsL","VsR","ST","-1","-2","-3","-4","-5","-6","-7","P"]
[]
[{"$nulls":4},1,{"$f":"IF($F$1=\"Drillers\",OFFSET(Drillers!$L$2,ROW($F19),1),IF($F$1=\"Bulls\",OFFSET(Bulls!$L$2,ROW($F19),1),IF($F$1=\"Phantoms\",OFFSET(Phantoms!$L$2,ROW($F19),1),IF($F$1=\"Gators\",OFFSET(Gators!$L$2,ROW($F19),1),IF($F$1=\"Knights\",OFFSET(Knights!$L$2,ROW($F19),1),IF($F$1=\"Hornets\",OFFSET(Hornets!$L$2,ROW($F19),1),IF($F$1=\"Reds\",OFFSET(Comets!$L$2,ROW($F19),1),IF($F$1=\"Guardians\",OFFSET(Wolves!$L$2,ROW($F19),1)))))))))","v":"Bowerman"},{"$f":"IF($F$1=\"Drillers\",OFFSET(Drillers!$L$2,ROW($F19),2),IF($F$1=\"Bulls\",OFFSET(Bulls!$L$2,ROW($F19),2),IF($F$1=\"Phantoms\",OFFSET(Phantoms!$L$2,ROW($F19),2),IF($F$1=\"Gators\",OFFSET(Gators!$L$2,ROW($F19),2),IF($F$1=\"Knights\",OFFSET(Knights!$L$2,ROW($F19),2),IF($F$1=\"Hornets\",OFFSET(Hornets!$L$2,ROW($F19),2),IF($F$1=\"Reds\",OFFSET(Comets!$L$2,ROW($F19),2),IF($F$1=\"Guardians\",OFFSET(Wolves!$L$2,ROW($F19),2)))))))))","v":"Nate"},{"$f":"IF($F$1=\"Drillers\",OFFSET(Drillers!$L$2,ROW($F19),3),IF($F$1=\"Bulls\",OFFSET(Bulls!$L$2,ROW($F19),3),IF($F$1=\"Phantoms\",OFFSET(Phantoms!$L$2,ROW($F19),3),IF($F$1=\"Gators\",OFFSET(Gators!$L$2,ROW($F19),3),IF($F$1=\"Knights\",OFFSET(Knights!$L$2,ROW($F19),3),IF($F$1=\"Hornets\",OFFSET(Hornets!$L$2,ROW($F19),3),IF($F$1=\"Guardians\",OFFSET(Wolves!$L$2,ROW($F19),3),IF($F$1=\"Reds\",OFFSET(Comets!$L$2,ROW($F19),3)))))))))","v":"L"},{"$f":"IF($F$1=\"Drillers\",OFFSET(Drillers!$L$2,ROW($F19),4),IF($F$1=\"Bulls\",OFFSET(Bulls!$L$2,ROW($F19),4),IF($F$1=\"Phantoms\",OFFSET(Phantoms!$L$2,ROW($F19),4),IF($F$1=\"Gators\",OFFSET(Gators!$L$2,ROW($F19),4),IF($F$1=\"Knights\",OFFSET(Knights!$L$2,ROW($F19),4),IF($F$1=\"Hornets\",OFFSET(Hornets!$L$2,ROW($F19),4),IF($F$1=\"Guardians\",OFFSET(Wolves!$L$2,ROW($F19),4),IF($F$1=\"Reds\",OFFSET(Comets!$L$2,ROW($F19),4)))))))))","v":-5},{"$f":"IF($F$1=\"Drillers\",OFFSET(Drillers!$L$2,ROW($F19),5),IF($F$1=\"Bulls\",OFFSET(Bulls!$L$2,ROW($F19),5),IF($F$1=\"Phantoms\",OFFSET(Phantoms!$L$2,ROW($F19),5),IF($F$1=\"Gators\",OFFSET(Gators!$L$2,ROW($F19),5),IF($F$1=\"Knights\",OFFSET(Knights!$L$2,ROW($F19),5),IF($F$1=\"Hornets\",OFFSET(Hornets!$L$2,ROW($F19),5),IF($F$1=\"Guardians\",OFFSET(Wolves!$L$2,ROW($F19),5),IF($F$1=\"Reds\",OFFSET(Comets!$L$2,ROW($F19),5)))))))))","v":-3},{"$f":"IF($F$1=\"Drillers\",OFFSET(Drillers!$L$2,ROW($F19),6),IF($F$1=\"Bulls\",OFFSET(Bulls!$L$2,ROW($F19),6),IF($F$1=\"Phantoms\",OFFSET(Phantoms!$L$2,ROW($F19),6),IF($F$1=\"Gators\",OFFSET(Gators!$L$2,ROW($F19),6),IF($F$1=\"Knights\",OFFSET(Knights!$L$2,ROW($F19),6),IF($F$1=\"Hornets\",OFFSET(Hornets!$L$2,ROW($F19),6),IF($F$1=\"Guardians\",OFFSET(Wolves!$L$2,ROW($F19),6),IF($F$1=\"Reds\",OFFSET(Comets!$L$2,ROW($F19),6)))))))))","v":"5"},{"$f":"IF($F$1=\"Drillers\",OFFSET(Drillers!$L$2,ROW(F19),7),IF($F$1=\"Bulls\",OFFSET(Bulls!$L$2,ROW(F19),7),IF($F$1=\"Phantoms\",OFFSET(Phantoms!$L$2,ROW(F19),7),IF($F$1=\"Gators\",OFFSET(Gators!$L$2,ROW(F19),7),IF($F$1=\"Knights\",OFFSET(Knights!$L$2,ROW(F19),7),IF($F$1=\"Hornets\",OFFSET(Hornets!$L$2,ROW(F19),7),IF($F$1=\"Guardians\",OFFSET(Wolves!$L$2,ROW(F19),7),IF($F$1=\"Reds\",OFFSET(Comets!$L$2,ROW(F19),7),))))))))","v":0},{"$f":"IF($F$1=\"Drillers\",OFFSET(Drillers!$L$2,ROW(F19),8),IF($F$1=\"Bulls\",OFFSET(Bulls!$L$2,ROW(F19),8),IF($F$1=\"Phantoms\",OFFSET(Phantoms!$L$2,ROW(F19),8),IF($F$1=\"Gators\",OFFSET(Gators!$L$2,ROW(F19),8),IF($F$1=\"Knights\",OFFSET(Knights!$L$2,ROW(F19),8),IF($F$1=\"Hornets\",OFFSET(Hornets!$L$2,ROW(F19),8),IF($F$1=\"Guardians\",OFFSET(Wolves!$L$2,ROW(F19),8),IF($F$1=\"Reds\",OFFSET(Comets!$L$2,ROW(F19),8)))))))))","v":0},{"$f":"IF($F$1=\"Drillers\",OFFSET(Drillers!$L$2,ROW($F19),9),IF($F$1=\"Bulls\",OFFSET(Bulls!$L$2,ROW($F19),9),IF($F$1=\"Phantoms\",OFFSET(Phantoms!$L$2,ROW($F19),9),IF($F$1=\"Gators\",OFFSET(Gators!$L$2,ROW($F19),9),IF($F$1=\"Knights\",OFFSET(Knights!$L$2,ROW($F19),9),IF($F$1=\"Hornets\",OFFSET(Hornets!$L$2,ROW(F19),9),IF($F$1=\"Guardians\",OFFSET(Wolves!$L$2,ROW($F19),9),IF($F$1=\"Reds\",OFFSET(Comets!$L$2,ROW($F19),9)))))))))","v":0},{"$f":"IF($F$1=\"Drillers\",OFFSET(Drillers!$L$2,ROW(F19),10),IF($F$1=\"Bulls\",OFFSET(Bulls!$L$2,ROW(F19),10),IF($F$1=\"Phantoms\",OFFSET(Phantoms!$L$2,ROW(F19),10),IF($F$1=\"Gators\",OFFSET(Gators!$L$2,ROW(F19),10),IF($F$1=\"Knights\",OFFSET(Knights!$L$2,ROW(F19),10),IF($F$1=\"Hornets\",OFFSET(Hornets!$L$2,ROW(F19),10),IF($F$1=\"Guardians\",OFFSET(Wolves!$L$2,ROW(F19),10),IF($F$1=\"Reds\",OFFSET(Comets!$L$2,ROW(F19),10)))))))))","v":0},{"$f":"IF($F$1=\"Drillers\",OFFSET(Drillers!$L$2,ROW(F19),11),IF($F$1=\"Bulls\",OFFSET(Bulls!$L$2,ROW(F19),11),IF($F$1=\"Phantoms\",OFFSET(Phantoms!$L$2,ROW(F19),11),IF($F$1=\"Gators\",OFFSET(Gators!$L$2,ROW(F19),11),IF($F$1=\"Knights\",OFFSET(Knights!$L$2,ROW(F19),11),IF($F$1=\"Hornets\",OFFSET(Hornets!$L$2,ROW(F19),11),IF($F$1=\"Guardians\",OFFSET(Wolves!$L$2,ROW(F19),11),IF($F$1=\"Drillers\",OFFSET(Drillers!$L$2,ROW(F19),11),IF($F$1=\"Reds\",OFFSET(Comets!$L$2,ROW(F19),11))))))))))","v":0},{"$f":"IF($F$1=\"Drillers\",OFFSET(Drillers!$L$2,ROW(F19),12),IF($F$1=\"Bulls\",OFFSET(Bulls!$L$2,ROW(F19),12),IF($F$1=\"Phantoms\",OFFSET(Phantoms!$L$2,ROW(F19),12),IF($F$1=\"Gators\",OFFSET(Gators!$L$2,ROW(F19),12),IF($F$1=\"Knights\",OFFSET(Knights!$L$2,ROW(F19),12),IF($F$1=\"Hornets\",OFFSET(Hornets!$L$2,ROW(F19),12),IF($F$1=\"Guardians\",OFFSET(Wolves!$L$2,ROW(F19),12),IF($F$1=\"Reds\",OFFSET(Comets!$L$2,ROW(F19),12),))))))))","v":0},{"$f":"IF($F$1=\"Drillers\",OFFSET(Drillers!$L$2,ROW(F19),13),IF($F$1=\"Bulls\",OFFSET(Bulls!$L$2,ROW(F19),13),IF($F$1=\"Phantoms\",OFFSET(Phantoms!$L$2,ROW(F19),13),IF($F$1=\"Gators\",OFFSET(Gators!$L$2,ROW(F19),13),IF($F$1=\"Knights\",OFFSET(Knights!$L$2,ROW(F19),13),IF($F$1=\"Hornets\",OFFSET(Hornets!$L$2,ROW(F19),13),IF($F$1=\"Guardians\",OFFSET(Wolves!$L$2,ROW(F19),13),IF($F$1=\"Reds\",OFFSET(Comets!$L$2,ROW(F19),13),))))))))","v":0},{"$f":"IF($F$1=\"Drillers\",OFFSET(Drillers!$L$2,ROW(F19),14),IF($F$1=\"Bulls\",OFFSET(Bulls!$L$2,ROW(F19),14),IF($F$1=\"Phantoms\",OFFSET(Phantoms!$L$2,ROW(F19),14),IF($F$1=\"Gators\",OFFSET(Gators!$L$2,ROW(F19),14),IF($F$1=\"Knights\",OFFSET(Knights!$L$2,ROW(F19),14),IF($F$1=\"Hornets\",OFFSET(Hornets!$L$2,ROW(F19),14),IF($F$1=\"Guardians\",OFFSET(Wolves!$L$2,ROW(F19),14,),IF($F$1=\"Reds\",OFFSET(Comets!$L$2,ROW(F19),14)))))))))","v":5},{"$f":"IF($F$1=\"Drillers\",OFFSET(Drillers!$L$2,ROW(F19),15),IF($F$1=\"Bulls\",OFFSET(Bulls!$L$2,ROW(F19),15),IF($F$1=\"Phantoms\",OFFSET(Phantoms!$L$2,ROW(F19),15),IF($F$1=\"Gators\",OFFSET(Gators!$L$2,ROW(F19),15),IF($F$1=\"Knights\",OFFSET(Knights!$L$2,ROW(F19),15),IF($F$1=\"Hornets\",OFFSET(Hornets!$L$2,ROW(F19),15),IF($F$1=\"Guardians\",OFFSET(Wolves!$L$2,ROW(F19),15),IF($F$1=\"Reds\",OFFSET(Comets!$L$2,ROW(F19),15)))))))))","v":0},{"$f":"IF($F$1=\"Drillers\",OFFSET(Drillers!$L$2,ROW(F19),16),IF($F$1=\"Bulls\",OFFSET(Bulls!$L$2,ROW(F19),16),IF($F$1=\"Phantoms\",OFFSET(Phantoms!$L$2,ROW(F19),16),IF($F$1=\"Gators\",OFFSET(Gators!$L$2,ROW(F19),16),IF($F$1=\"Knights\",OFFSET(Knights!$L$2,ROW(F19),16),IF($F$1=\"Hornets\",OFFSET(Hornets!$L$2,ROW(F19),16),IF($F$1=\"Guardians\",OFFSET(Wolves!$L$2,ROW(F19),16),IF($F$1=\"Reds\",OFFSET(Comets!$L$2,ROW(F19),16)))))))))","v":0},{"$nulls":8},1,{"$f":"IF($AE$1=\"Drillers\",OFFSET(Drillers!$L$2,ROW($AE19),1),IF($AE$1=\"Bulls\",OFFSET(Bulls!$L$2,ROW($AE19),1),IF($AE$1=\"Phantoms\",OFFSET(Phantoms!$L$2,ROW($AE19),1),IF($AE$1=\"Gators\",OFFSET(Gators!$L$2,ROW($AE19),1),IF($AE$1=\"Knights\",OFFSET(Knights!$L$2,ROW($AE19),1),IF($AE$1=\"Hornets\",OFFSET(Hornets!$L$2,ROW($AE19),1),IF($AE$1=\"Wolves\",OFFSET(Wolves!$L$2,ROW($AE19),1),IF(AE$1=\"Comets\",OFFSET(Comets!$L$2,ROW($AE19),1)))))))))","v":"Joseph"},{"$f":"IF($AE$1=\"Drillers\",OFFSET(Drillers!$L$2,ROW($AF19),2),IF($AE$1=\"Bulls\",OFFSET(Bulls!$L$2,ROW($AF19),2),IF($AE$1=\"Phantoms\",OFFSET(Phantoms!$L$2,ROW($AF19),2),IF($AE$1=\"Gators\",OFFSET(Gators!$L$2,ROW($AF19),2),IF($AE$1=\"Knights\",OFFSET(Knights!$L$2,ROW($AF19),2),IF($AE$1=\"Hornets\",OFFSET(Hornets!$L$2,ROW($AF19),2),IF($AE$1=\"Wolves\",OFFSET(Wolves!$L$2,ROW($AF19),2),IF($AE$1=\"Comets\",OFFSET(Comets!$L$2,ROW($AF19),2)))))))))","v":"Dennis"},{"$f":"IF($AE$1=\"Drillers\",OFFSET(Drillers!$L$2,ROW($AE19),3),IF($AE$1=\"Bulls\",OFFSET(Bulls!$L$2,ROW($AE19),3),IF($AE$1=\"Phantoms\",OFFSET(Phantoms!$L$2,ROW($AE19),3),IF($AE$1=\"Gators\",OFFSET(Gators!$L$2,ROW($AE19),3),IF($AE$1=\"Knights\",OFFSET(Knights!$L$2,ROW($AE19),3),IF($AE$1=\"Hornets\",OFFSET(Hornets!$L$2,ROW($AE19),3),IF($AE$1=\"Wolves\",OFFSET(Wolves!$L$2,ROW($AE19),3),IF($AE$1=\"Comets\",OFFSET(Comets!$L$2,ROW($AE19),3)))))))))","v":"R"},{"$f":"IF($AE$1=\"Drillers\",OFFSET(Drillers!$L$2,ROW($AE19),4),IF($AE$1=\"Bulls\",OFFSET(Bulls!$L$2,ROW($AE19),4),IF($AE$1=\"Phantoms\",OFFSET(Phantoms!$L$2,ROW($AE19),4),IF($AE$1=\"Gators\",OFFSET(Gators!$L$2,ROW($AE19),4),IF($AE$1=\"Knights\",OFFSET(Knights!$L$2,ROW($AE19),4),IF($AE$1=\"Hornets\",OFFSET(Hornets!$L$2,ROW($AE19),4),IF($AE$1=\"Wolves\",OFFSET(Wolves!$L$2,ROW($AE19),4),IF($AE$1=\"Comets\",OFFSET(Comets!$L$2,ROW($AE19),4)))))))))","v":-4},{"$f":"IF($AE$1=\"Drillers\",OFFSET(Drillers!$L$2,ROW($AE19),5),IF($AE$1=\"Bulls\",OFFSET(Bulls!$L$2,ROW($AE19),5),IF($AE$1=\"Phantoms\",OFFSET(Phantoms!$L$2,ROW($AE19),5),IF($AE$1=\"Gators\",OFFSET(Gators!$L$2,ROW($AE19),5),IF($AE$1=\"Knights\",OFFSET(Knights!$L$2,ROW($AE19),5),IF($AE$1=\"Hornets\",OFFSET(Hornets!$L$2,ROW($AE19),5),IF($AE$1=\"Wolves\",OFFSET(Wolves!$L$2,ROW($AE19),5),IF($AE$1=\"Comets\",OFFSET(Comets!$L$2,ROW($AE19),5)))))))))","v":-5},{"$f":"IF($AE$1=\"Drillers\",OFFSET(Drillers!$L$2,ROW($AE19),6),IF($AE$1=\"Bulls\",OFFSET(Bulls!$L$2,ROW($AE19),6),IF($AE$1=\"Phantoms\",OFFSET(Phantoms!$L$2,ROW($AE19),6),IF($AE$1=\"Gators\",OFFSET(Gators!$L$2,ROW($AE19),6),IF($AE$1=\"Knights\",OFFSET(Knights!$L$2,ROW($AE19),6),IF($AE$1=\"Hornets\",OFFSET(Hornets!$L$2,ROW($AE19),6),IF($AE$1=\"Wolves\",OFFSET(Wolves!$L$2,ROW($AE19),6),IF($AE$1=\"Comets\",OFFSET(Comets!$L$2,ROW($AE19),6)))))))))","v":5},{"$f":"IF($AE$1=\"Drillers\",OFFSET(Drillers!$L$2,ROW($AE19),7),IF($AE$1=\"Bulls\",OFFSET(Bulls!$L$2,ROW($AE19),7),IF($AE$1=\"Phantoms\",OFFSET(Phantoms!$L$2,ROW($AE19),7),IF($AE$1=\"Gators\",OFFSET(Gators!$L$2,ROW($AE19),7),IF($AE$1=\"Knights\",OFFSET(Knights!$L$2,ROW($AE19),7),IF($AE$1=\"Hornets\",OFFSET(Hornets!$L$2,ROW($AE19),7),IF($AE$1=\"Wolves\",OFFSET(Wolves!$L$2,ROW($AE19),7),IF($AE$1=\"Comets\",OFFSET(Comets!$L$2,ROW($AE19),7)))))))))","v":0},{"$f":"IF($AE$1=\"Drillers\",OFFSET(Drillers!$L$2,ROW($AE19),8),IF($AE$1=\"Bulls\",OFFSET(Bulls!$L$2,ROW($AE19),8),IF($AE$1=\"Phantoms\",OFFSET(Phantoms!$L$2,ROW($AE19),8),IF($AE$1=\"Gators\",OFFSET(Gators!$L$2,ROW($AE19),8),IF($AE$1=\"Knights\",OFFSET(Knights!$L$2,ROW($AE19),8),IF($AE$1=\"Hornets\",OFFSET(Hornets!$L$2,ROW($AE19),8),IF($AE$1=\"Wolves\",OFFSET(Wolves!$L$2,ROW($AE19),8),IF($AE$1=\"Comets\",OFFSET(Comets!$L$2,ROW($AE19),8)))))))))","v":0},{"$f":"IF($AE$1=\"Drillers\",OFFSET(Drillers!$L$2,ROW($AE19),9),IF($AE$1=\"Bulls\",OFFSET(Bulls!$L$2,ROW($AE19),9),IF($AE$1=\"Phantoms\",OFFSET(Phantoms!$L$2,ROW($AE19),9),IF($AE$1=\"Gators\",OFFSET(Gators!$L$2,ROW($AE19),9),IF($AE$1=\"Knights\",OFFSET(Knights!$L$2,ROW($AE19),9),IF($AE$1=\"Hornets\",OFFSET(Hornets!$L$2,ROW($AE19),9),IF($AE$1=\"Wolves\",OFFSET(Wolves!$L$2,ROW($AE19),9),IF($AE$1=\"Comets\",OFFSET(Comets!$L$2,ROW($AE19),9)))))))))","v":0},{"$f":"IF($AE$1=\"Drillers\",OFFSET(Drillers!$L$2,ROW($AE19),10),IF($AE$1=\"Bulls\",OFFSET(Bulls!$L$2,ROW($AE19),10),IF($AE$1=\"Phantoms\",OFFSET(Phantoms!$L$2,ROW($AE19),10),IF($AE$1=\"Gators\",OFFSET(Gators!$L$2,ROW($AE19),10),IF($AE$1=\"Knights\",OFFSET(Knights!$L$2,ROW($AE19),10),IF($AE$1=\"Hornets\",OFFSET(Hornets!$L$2,ROW($AE19),10),IF($AE$1=\"Wolves\",OFFSET(Wolves!$L$2,ROW($AE19),10),IF($AE$1=\"Comets\",OFFSET(Comets!$L$2,ROW($AE19),10)))))))))","v":0},{"$f":"IF($AE$1=\"Drillers\",OFFSET(Drillers!$L$2,ROW($AE19),11),IF($AE$1=\"Bulls\",OFFSET(Bulls!$L$2,ROW($AE19),11),IF($AE$1=\"Phantoms\",OFFSET(Phantoms!$L$2,ROW($AE19),11),IF($AE$1=\"Gators\",OFFSET(Gators!$L$2,ROW($AE19),11),IF($AE$1=\"Knights\",OFFSET(Knights!$L$2,ROW($AE19),11),IF($AE$1=\"Hornets\",OFFSET(Hornets!$L$2,ROW($AE19),11),IF($AE$1=\"Wolves\",OFFSET(Wolves!$L$2,ROW($AE19),11),IF($AE$1=\"Comets\",OFFSET(Comets!$L$2,ROW($AE19),11)))))))))","v":0},{"$f":"IF($AE$1=\"Drillers\",OFFSET(Drillers!$L$2,ROW($AE19),12),IF($AE$1=\"Bulls\",OFFSET(Bulls!$L$2,ROW($AE19),12),IF($AE$1=\"Phantoms\",OFFSET(Phantoms!$L$2,ROW($AE19),12),IF($AE$1=\"Gators\",OFFSET(Gators!$L$2,ROW($AE19),12),IF($AE$1=\"Knights\",OFFSET(Knights!$L$2,ROW($AE19),12),IF($AE$1=\"Hornets\",OFFSET(Hornets!$L$2,ROW($AE19),12),IF($AE$1=\"Wolves\",OFFSET(Wolves!$L$2,ROW($AE19),12),IF($AE$1=\"Comets\",OFFSET(Comets!$L$2,ROW($AE19),12)))))))))","v":0},{"$f":"IF($AE$1=\"Drillers\",OFFSET(Drillers!$L$2,ROW($AE19),13),IF($AE$1=\"Bulls\",OFFSET(Bulls!$L$2,ROW($AE19),13),IF($AE$1=\"Phantoms\",OFFSET(Phantoms!$L$2,ROW($AE19),13),IF($AE$1=\"Gators\",OFFSET(Gators!$L$2,ROW($AE19),13),IF($AE$1=\"Knights\",OFFSET(Knights!$L$2,ROW($AE19),13),IF($AE$1=\"Hornets\",OFFSET(Hornets!$L$2,ROW($AE19),13),IF($AE$1=\"Wolves\",OFFSET(Wolves!$L$2,ROW($AE19),13),IF($AE$1=\"Comets\",OFFSET(Comets!$L$2,ROW($AE19),13)))))))))","v":0},{"$f":"IF($AE$1=\"Drillers\",OFFSET(Drillers!$L$2,ROW($AE19),14),IF($AE$1=\"Bulls\",OFFSET(Bulls!$L$2,ROW($AE19),14),IF($AE$1=\"Phantoms\",OFFSET(Phantoms!$L$2,ROW($AE19),14),IF($AE$1=\"Gators\",OFFSET(Gators!$L$2,ROW($AE19),14),IF($AE$1=\"Knights\",OFFSET(Knights!$L$2,ROW($AE19),14),IF($AE$1=\"Hornets\",OFFSET(Hornets!$L$2,ROW($AE19),14),IF($AE$1=\"Wolves\",OFFSET(Wolves!$L$2,ROW($AE19),14),IF($AE$1=\"Comets\",OFFSET(Comets!$L$2,ROW($AE19),14)))))))))","v":3},{"$f":"IF(AE$1=\"Drillers\",OFFSET(Drillers!$L$2,ROW(AE19),15),IF(AE$1=\"Bulls\",OFFSET(Bulls!$L$2,ROW(AE19),15),IF(AE$1=\"Phantoms\",OFFSET(Phantoms!$L$2,ROW(AE19),15),IF(AE$1=\"Gators\",OFFSET(Gators!$L$2,ROW(AE19),15),IF(AE$1=\"Knights\",OFFSET(Knights!$L$2,ROW(AE19),15),IF(AE$1=\"Hornets\",OFFSET(Hornets!$L$2,ROW(AE19),15),IF(AE$1=\"Wolves\",OFFSET(Wolves!$L$2,ROW(AE19),15),IF(AE$1=\"Comets\",OFFSET(Comets!$L$2,ROW(AE19),15)))))))))","v":0},{"$f":"IF($AE$1=\"Drillers\",OFFSET(Drillers!$L$2,ROW(AE19),16),IF($AE$1=\"Bulls\",OFFSET(Bulls!$L$2,ROW(AE19),16),IF($AE$1=\"Phantoms\",OFFSET(Phantoms!$L$2,ROW(AE19),16),IF($AE$1=\"Gators\",OFFSET(Gators!$L$2,ROW(AE19),16),IF($AE$1=\"Knights\",OFFSET(Knights!$L$2,ROW(AE19),16),IF($AE$1=\"Hornets\",OFFSET(Hornets!$L$2,ROW(AE19),16),IF($AE$1=\"Wolves\",OFFSET(Wolves!$L$2,ROW(AE19),16),IF($AE$1=\"Comets\",OFFSET(Comets!$L$2,ROW(AE19),16)))))))))","v":0}]
[{"$nulls":4},2,{"$f":"IF($F$1=\"Drillers\",OFFSET(Drillers!$L$2,ROW($F20),1),IF($F$1=\"Bulls\",OFFSET(Bulls!$L$2,ROW($F20),1),IF($F$1=\"Phantoms\",OFFSET(Phantoms!$L$2,ROW($F20),1),IF($F$1=\"Gators\",OFFSET(Gators!$L$2,ROW($F20),1),IF($F$1=\"Knights\",OFFSET(Knights!$L$2,ROW($F20),1),IF($F$1=\"Hornets\",OFFSET(Hornets!$L$2,ROW($F20),1),IF($F$1=\"Reds\",OFFSET(Comets!$L$2,ROW($F20),1),IF($F$1=\"Guardians\",OFFSET(Wolves!$L$2,ROW($F20),1)))))))))","v":"Francis"},{"$f":"IF($F$1=\"Drillers\",OFFSET(Drillers!$L$2,ROW($F20),2),IF($F$1=\"Bulls\",OFFSET(Bulls!$L$2,ROW($F20),2),IF($F$1=\"Phantoms\",OFFSET(Phantoms!$L$2,ROW($F20),2),IF($F$1=\"Gators\",OFFSET(Gators!$L$2,ROW($F20),2),IF($F$1=\"Knights\",OFFSET(Knights!$L$2,ROW($F20),2),IF($F$1=\"Hornets\",OFFSET(Hornets!$L$2,ROW($F20),2),IF($F$1=\"Reds\",OFFSET(Comets!$L$2,ROW($F20),2),IF($F$1=\"Guardians\",OFFSET(Wolves!$L$2,ROW($F20),2)))))))))","v":"Mark"},{"$f":"IF($F$1=\"Drillers\",OFFSET(Drillers!$L$2,ROW($F20),3),IF($F$1=\"Bulls\",OFFSET(Bulls!$L$2,ROW($F20),3),IF($F$1=\"Phantoms\",OFFSET(Phantoms!$L$2,ROW($F20),3),IF($F$1=\"Gators\",OFFSET(Gators!$L$2,ROW($F20),3),IF($F$1=\"Knights\",OFFSET(Knights!$L$2,ROW($F20),3),IF($F$1=\"Hornets\",OFFSET(Hornets!$L$2,ROW($F20),3),IF($F$1=\"Guardians\",OFFSET(Wolves!$L$2,ROW($F20),3),IF($F$1=\"Reds\",OFFSET(Comets!$L$2,ROW($F20),3)))))))))","v":"R"},{"$f":"IF($F$1=\"Drillers\",OFFSET(Drillers!$L$2,ROW($F20),4),IF($F$1=\"Bulls\",OFFSET(Bulls!$L$2,ROW($F20),4),IF($F$1=\"Phantoms\",OFFSET(Phantoms!$L$2,ROW($F20),4),IF($F$1=\"Gators\",OFFSET(Gators!$L$2,ROW($F20),4),IF($F$1=\"Knights\",OFFSET(Knights!$L$2,ROW($F20),4),IF($F$1=\"Hornets\",OFFSET(Hornets!$L$2,ROW($F20),4),IF($F$1=\"Guardians\",OFFSET(Wolves!$L$2,ROW($F20),4),IF($F$1=\"Reds\",OFFSET(Comets!$L$2,ROW($F20),4)))))))))","v":-4},{"$f":"IF($F$1=\"Drillers\",OFFSET(Drillers!$L$2,ROW($F20),5),IF($F$1=\"Bulls\",OFFSET(Bulls!$L$2,ROW($F20),5),IF($F$1=\"Phantoms\",OFFSET(Phantoms!$L$2,ROW($F20),5),IF($F$1=\"Gators\",OFFSET(Gators!$L$2,ROW($F20),5),IF($F$1=\"Knights\",OFFSET(Knights!$L$2,ROW($F20),5),IF($F$1=\"Hornets\",OFFSET(Hornets!$L$2,ROW($F20),5),IF($F$1=\"Guardians\",OFFSET(Wolves!$L$2,ROW($F20),5),IF($F$1=\"Reds\",OFFSET(Comets!$L$2,ROW($F20),5)))))))))","v":-3},{"$f":"IF($F$1=\"Drillers\",OFFSET(Drillers!$L$2,ROW($F20),6),IF($F$1=\"Bulls\",OFFSET(Bulls!$L$2,ROW($F20),6),IF($F$1=\"Phantoms\",OFFSET(Phantoms!$L$2,ROW($F20),6),IF($F$1=\"Gators\",OFFSET(Gators!$L$2,ROW($F20),6),IF($F$1=\"Knights\",OFFSET(Knights!$L$2,ROW($F20),6),IF($F$1=\"Hornets\",OFFSET(Hornets!$L$2,ROW($F20),6),IF($F$1=\"Guardians\",OFFSET(Wolves!$L$2,ROW($F20),6),IF($F$1=\"Reds\",OFFSET(Comets!$L$2,ROW($F20),6)))))))))","v":"5"},{"$f":"IF($F$1=\"Drillers\",OFFSET(Drillers!$L$2,ROW(F20),7),IF($F$1=\"Bulls\",OFFSET(Bulls!$L$2,ROW(F20),7),IF($F$1=\"Phantoms\",OFFSET(Phantoms!$L$2,ROW(F20),7),IF($F$1=\"Gators\",OFFSET(Gators!$L$2,ROW(F20),7),IF($F$1=\"Knights\",OFFSET(Knights!$L$2,ROW(F20),7),IF($F$1=\"Hornets\",OFFSET(Hornets!$L$2,ROW(F20),7),IF($F$1=\"Guardians\",OFFSET(Wolves!$L$2,ROW(F20),7),IF($F$1=\"Reds\",OFFSET(Comets!$L$2,ROW(F20),7),))))))))","v":0},{"$f":"IF($F$1=\"Drillers\",OFFSET(Drillers!$L$2,ROW(F20),8),IF($F$1=\"Bulls\",OFFSET(Bulls!$L$2,ROW(F20),8),IF($F$1=\"Phantoms\",OFFSET(Phantoms!$L$2,ROW(F20),8),IF($F$1=\"Gators\",OFFSET(Gators!$L$2,ROW(F20),8),IF($F$1=\"Knights\",OFFSET(Knights!$L$2,ROW(F20),8),IF($F$1=\"Hornets\",OFFSET(Hornets!$L$2,ROW(F20),8),IF($F$1=\"Guardians\",OFFSET(Wolves!$L$2,ROW(F20),8),IF($F$1=\"Reds\",OFFSET(Comets!$L$2,ROW(F20),8)))))))))","v":0},{"$f":"IF($F$1=\"Drillers\",OFFSET(Drillers!$L$2,ROW($F20),9),IF($F$1=\"Bulls\",OFFSET(Bulls!$L$2,ROW($F20),9),IF($F$1=\"Phantoms\",OFFSET(Phantoms!$L$2,ROW($F20),9),IF($F$1=\"Gators\",OFFSET(Gators!$L$2,ROW($F20),9),IF($F$1=\"Knights\",OFFSET(Knights!$L$2,ROW($F20),9),IF($F$1=\"Hornets\",OFFSET(Hornets!$L$2,ROW(F20),9),IF($F$1=\"Guardians\",OFFSET(Wolves!$L$2,ROW($F20),9),IF($F$1=\"Reds\",OFFSET(Comets!$L$2,ROW($F20),9)))))))))","v":0},{"$f":"IF($F$1=\"Drillers\",OFFSET(Drillers!$L$2,ROW(F20),10),IF($F$1=\"Bulls\",OFFSET(Bulls!$L$2,ROW(F20),10),IF($F$1=\"Phantoms\",OFFSET(Phantoms!$L$2,ROW(F20),10),IF($F$1=\"Gators\",OFFSET(Gators!$L$2,ROW(F20),10),IF($F$1=\"Knights\",OFFSET(Knights!$L$2,ROW(F20),10),IF($F$1=\"Hornets\",OFFSET(Hornets!$L$2,ROW(F20),10),IF($F$1=\"Guardians\",OFFSET(Wolves!$L$2,ROW(F20),10),IF($F$1=\"Reds\",OFFSET(Comets!$L$2,ROW(F20),10)))))))))","v":0},{"$f":"IF($F$1=\"Drillers\",OFFSET(Drillers!$L$2,ROW(F20),11),IF($F$1=\"Bulls\",OFFSET(Bulls!$L$2,ROW(F20),11),IF($F$1=\"Phantoms\",OFFSET(Phantoms!$L$2,ROW(F20),11),IF($F$1=\"Gators\",OFFSET(Gators!$L$2,ROW(F20),11),IF($F$1=\"Knights\",OFFSET(Knights!$L$2,ROW(F20),11),IF($F$1=\"Hornets\",OFFSET(Hornets!$L$2,ROW(F20),11),IF($F$1=\"Guardians\",OFFSET(Wolves!$L$2,ROW(F20),11),IF($F$1=\"Drillers\",OFFSET(Drillers!$L$2,ROW(F20),11),IF($F$1=\"Reds\",OFFSET(Comets!$L$2,ROW(F20),11))))))))))","v":0},{"$f":"IF($F$1=\"Drillers\",OFFSET(Drillers!$L$2,ROW(F20),12),IF($F$1=\"Bulls\",OFFSET(Bulls!$L$2,ROW(F20),12),IF($F$1=\"Phantoms\",OFFSET(Phantoms!$L$2,ROW(F20),12),IF($F$1=\"Gators\",OFFSET(Gators!$L$2,ROW(F20),12),IF($F$1=\"Knights\",OFFSET(Knights!$L$2,ROW(F20),12),IF($F$1=\"Hornets\",OFFSET(Hornets!$L$2,ROW(F20),12),IF($F$1=\"Guardians\",OFFSET(Wolves!$L$2,ROW(F20),12),IF($F$1=\"Reds\",OFFSET(Comets!$L$2,ROW(F20),12),))))))))","v":0},{"$f":"IF($F$1=\"Drillers\",OFFSET(Drillers!$L$2,ROW(F20),13),IF($F$1=\"Bulls\",OFFSET(Bulls!$L$2,ROW(F20),13),IF($F$1=\"Phantoms\",OFFSET(Phantoms!$L$2,ROW(F20),13),IF($F$1=\"Gators\",OFFSET(Gators!$L$2,ROW(F20),13),IF($F$1=\"Knights\",OFFSET(Knights!$L$2,ROW(F20),13),IF($F$1=\"Hornets\",OFFSET(Hornets!$L$2,ROW(F20),13),IF($F$1=\"Guardians\",OFFSET(Wolves!$L$2,ROW(F20),13),IF($F$1=\"Reds\",OFFSET(Comets!$L$2,ROW(F20),13),))))))))","v":0},{"$f":"IF($F$1=\"Drillers\",OFFSET(Drillers!$L$2,ROW(F20),14),IF($F$1=\"Bulls\",OFFSET(Bulls!$L$2,ROW(F20),14),IF($F$1=\"Phantoms\",OFFSET(Phantoms!$L$2,ROW(F20),14),IF($F$1=\"Gators\",OFFSET(Gators!$L$2,ROW(F20),14),IF($F$1=\"Knights\",OFFSET(Knights!$L$2,ROW(F20),14),IF($F$1=\"Hornets\",OFFSET(Hornets!$L$2,ROW(F20),14),IF($F$1=\"Guardians\",OFFSET(Wolves!$L$2,ROW(F20),14,),IF($F$1=\"Reds\",OFFSET(Comets!$L$2,ROW(F20),14)))))))))","v":2},{"$f":"IF($F$1=\"Drillers\",OFFSET(Drillers!$L$2,ROW(F20),15),IF($F$1=\"Bulls\",OFFSET(Bulls!$L$2,ROW(F20),15),IF($F$1=\"Phantoms\",OFFSET(Phantoms!$L$2,ROW(F20),15),IF($F$1=\"Gators\",OFFSET(Gators!$L$2,ROW(F20),15),IF($F$1=\"Knights\",OFFSET(Knights!$L$2,ROW(F20),15),IF($F$1=\"Hornets\",OFFSET(Hornets!$L$2,ROW(F20),15),IF($F$1=\"Guardians\",OFFSET(Wolves!$L$2,ROW(F20),15),IF($F$1=\"Reds\",OFFSET(Comets!$L$2,ROW(F20),15)))))))))","v":0},{"$f":"IF($F$1=\"Drillers\",OFFSET(Drillers!$L$2,ROW(F20),16),IF($F$1=\"Bulls\",OFFSET(Bulls!$L$2,ROW(F20),16),IF($F$1=\"Phantoms\",OFFSET(Phantoms!$L$2,ROW(F20),16),IF($F$1=\"Gators\",OFFSET(Gators!$L$2,ROW(F20),16),IF($F$1=\"Knights\",OFFSET(Knights!$L$2,ROW(F20),16),IF($F$1=\"Hornets\",OFFSET(Hornets!$L$2,ROW(F20),16),IF($F$1=\"Guardians\",OFFSET(Wolves!$L$2,ROW(F20),16),IF($F$1=\"Reds\",OFFSET(Comets!$L$2,ROW(F20),16)))))))))","v":0},{"$nulls":8},2,{"$f":"IF($AE$1=\"Drillers\",OFFSET(Drillers!$L$2,ROW($AE20),1),IF($AE$1=\"Bulls\",OFFSET(Bulls!$L$2,ROW($AE20),1),IF($AE$1=\"Phantoms\",OFFSET(Phantoms!$L$2,ROW($AE20),1),IF($AE$1=\"Gators\",OFFSET(Gators!$L$2,ROW($AE20),1),IF($AE$1=\"Knights\",OFFSET(Knights!$L$2,ROW($AE20),1),IF($AE$1=\"Hornets\",OFFSET(Hornets!$L$2,ROW($AE20),1),IF($AE$1=\"Wolves\",OFFSET(Wolves!$L$2,ROW($AE20),1),IF(AE$1=\"Comets\",OFFSET(Comets!$L$2,ROW($AE20),1)))))))))","v":"Robinson"},{"$f":"IF($AE$1=\"Drillers\",OFFSET(Drillers!$L$2,ROW($AF20),2),IF($AE$1=\"Bulls\",OFFSET(Bulls!$L$2,ROW($AF20),2),IF($AE$1=\"Phantoms\",OFFSET(Phantoms!$L$2,ROW($AF20),2),IF($AE$1=\"Gators\",OFFSET(Gators!$L$2,ROW($AF20),2),IF($AE$1=\"Knights\",OFFSET(Knights!$L$2,ROW($AF20),2),IF($AE$1=\"Hornets\",OFFSET(Hornets!$L$2,ROW($AF20),2),IF($AE$1=\"Wolves\",OFFSET(Wolves!$L$2,ROW($AF20),2),IF($AE$1=\"Comets\",OFFSET(Comets!$L$2,ROW($AF20),2)))))))))","v":"Johnny"},{"$f":"IF($AE$1=\"Drillers\",OFFSET(Drillers!$L$2,ROW($AE20),3),IF($AE$1=\"Bulls\",OFFSET(Bulls!$L$2,ROW($AE20),3),IF($AE$1=\"Phantoms\",OFFSET(Phantoms!$L$2,ROW($AE20),3),IF($AE$1=\"Gators\",OFFSET(Gators!$L$2,ROW($AE20),3),IF($AE$1=\"Knights\",OFFSET(Knights!$L$2,ROW($AE20),3),IF($AE$1=\"Hornets\",OFFSET(Hornets!$L$2,ROW($AE20),3),IF($AE$1=\"Wolves\",OFFSET(Wolves!$L$2,ROW($AE20),3),IF($AE$1=\"Comets\",OFFSET(Comets!$L$2,ROW($AE20),3)))))))))","v":"L"},{"$f":"IF($AE$1=\"Drillers\",OFFSET(Drillers!$L$2,ROW($AE20),4),IF($AE$1=\"Bulls\",OFFSET(Bulls!$L$2,ROW($AE20),4),IF($AE$1=\"Phantoms\",OFFSET(Phantoms!$L$2,ROW($AE20),4),IF($AE$1=\"Gators\",OFFSET(Gators!$L$2,ROW($AE20),4),IF($AE$1=\"Knights\",OFFSET(Knights!$L$2,ROW($AE20),4),IF($AE$1=\"Hornets\",OFFSET(Hornets!$L$2,ROW($AE20),4),IF($AE$1=\"Wolves\",OFFSET(Wolves!$L$2,ROW($AE20),4),IF($AE$1=\"Comets\",OFFSET(Comets!$L$2,ROW($AE20),4)))))))))","v":-4},{"$f":"IF($AE$1=\"Drillers\",OFFSET(Drillers!$L$2,ROW($AE20),5),IF($AE$1=\"Bulls\",OFFSET(Bulls!$L$2,ROW($AE20),5),IF($AE$1=\"Phantoms\",OFFSET(Phantoms!$L$2,ROW($AE20),5),IF($AE$1=\"Gators\",OFFSET(Gators!$L$2,ROW($AE20),5),IF($AE$1=\"Knights\",OFFSET(Knights!$L$2,ROW($AE20),5),IF($AE$1=\"Hornets\",OFFSET(Hornets!$L$2,ROW($AE20),5),IF($AE$1=\"Wolves\",OFFSET(Wolves!$L$2,ROW($AE20),5),IF($AE$1=\"Comets\",OFFSET(Comets!$L$2,ROW($AE20),5)))))))))","v":-3},{"$f":"IF($AE$1=\"Drillers\",OFFSET(Drillers!$L$2,ROW($AE20),6),IF($AE$1=\"Bulls\",OFFSET(Bulls!$L$2,ROW($AE20),6),IF($AE$1=\"Phantoms\",OFFSET(Phantoms!$L$2,ROW($AE20),6),IF($AE$1=\"Gators\",OFFSET(Gators!$L$2,ROW($AE20),6),IF($AE$1=\"Knights\",OFFSET(Knights!$L$2,ROW($AE20),6),IF($AE$1=\"Hornets\",OFFSET(Hornets!$L$2,ROW($AE20),6),IF($AE$1=\"Wolves\",OFFSET(Wolves!$L$2,ROW($AE20),6),IF($AE$1=\"Comets\",OFFSET(Comets!$L$2,ROW($AE20),6)))))))))","v":5},{"$f":"IF($AE$1=\"Drillers\",OFFSET(Drillers!$L$2,ROW($AE20),7),IF($AE$1=\"Bulls\",OFFSET(Bulls!$L$2,ROW($AE20),7),IF($AE$1=\"Phantoms\",OFFSET(Phantoms!$L$2,ROW($AE20),7),IF($AE$1=\"Gators\",OFFSET(Gators!$L$2,ROW($AE20),7),IF($AE$1=\"Knights\",OFFSET(Knights!$L$2,ROW($AE20),7),IF($AE$1=\"Hornets\",OFFSET(Hornets!$L$2,ROW($AE20),7),IF($AE$1=\"Wolves\",OFFSET(Wolves!$L$2,ROW($AE20),7),IF($AE$1=\"Comets\",OFFSET(Comets!$L$2,ROW($AE20),7)))))))))","v":0},{"$f":"IF($AE$1=\"Drillers\",OFFSET(Drillers!$L$2,ROW($AE20),8),IF($AE$1=\"Bulls\",OFFSET(Bulls!$L$2,ROW($AE20),8),IF($AE$1=\"Phantoms\",OFFSET(Phantoms!$L$2,ROW($AE20),8),IF($AE$1=\"Gators\",OFFSET(Gators!$L$2,ROW($AE20),8),IF($AE$1=\"Knights\",OFFSET(Knights!$L$2,ROW($AE20),8),IF($AE$1=\"Hornets\",OFFSET(Hornets!$L$2,ROW($AE20),8),IF($AE$1=\"Wolves\",OFFSET(Wolves!$L$2,ROW($AE20),8),IF($AE$1=\"Comets\",OFFSET(Comets!$L$2,ROW($AE20),8)))))))))","v":0},{"$f":"IF($AE$1=\"Drillers\",OFFSET(Drillers!$L$2,ROW($AE20),9),IF($AE$1=\"Bulls\",OFFSET(Bulls!$L$2,ROW($AE20),9),IF($AE$1=\"Phantoms\",OFFSET(Phantoms!$L$2,ROW($AE20),9),IF($AE$1=\"Gators\",OFFSET(Gators!$L$2,ROW($AE20),9),IF($AE$1=\"Knights\",OFFSET(Knights!$L$2,ROW($AE20),9),IF($AE$1=\"Hornets\",OFFSET(Hornets!$L$2,ROW($AE20),9),IF($AE$1=\"Wolves\",OFFSET(Wolves!$L$2,ROW($AE20),9),IF($AE$1=\"Comets\",OFFSET(Comets!$L$2,ROW($AE20),9)))))))))","v":0},{"$f":"IF($AE$1=\"Drillers\",OFFSET(Drillers!$L$2,ROW($AE20),10),IF($AE$1=\"Bulls\",OFFSET(Bulls!$L$2,ROW($AE20),10),IF($AE$1=\"Phantoms\",OFFSET(Phantoms!$L$2,ROW($AE20),10),IF($AE$1=\"Gators\",OFFSET(Gators!$L$2,ROW($AE20),10),IF($AE$1=\"Knights\",OFFSET(Knights!$L$2,ROW($AE20),10),IF($AE$1=\"Hornets\",OFFSET(Hornets!$L$2,ROW($AE20),10),IF($AE$1=\"Wolves\",OFFSET(Wolves!$L$2,ROW($AE20),10),IF($AE$1=\"Comets\",OFFSET(Comets!$L$2,ROW($AE20),10)))))))))","v":0},{"$f":"IF($AE$1=\"Drillers\",OFFSET(Drillers!$L$2,ROW($AE20),11),IF($AE$1=\"Bulls\",OFFSET(Bulls!$L$2,ROW($AE20),11),IF($AE$1=\"Phantoms\",OFFSET(Phantoms!$L$2,ROW($AE20),11),IF($AE$1=\"Gators\",OFFSET(Gators!$L$2,ROW($AE20),11),IF($AE$1=\"Knights\",OFFSET(Knights!$L$2,ROW($AE20),11),IF($AE$1=\"Hornets\",OFFSET(Hornets!$L$2,ROW($AE20),11),IF($AE$1=\"Wolves\",OFFSET(Wolves!$L$2,ROW($AE20),11),IF($AE$1=\"Comets\",OFFSET(Comets!$L$2,ROW($AE20),11)))))))))","v":0},{"$f":"IF($AE$1=\"Drillers\",OFFSET(Drillers!$L$2,ROW($AE20),12),IF($AE$1=\"Bulls\",OFFSET(Bulls!$L$2,ROW($AE20),12),IF($AE$1=\"Phantoms\",OFFSET(Phantoms!$L$2,ROW($AE20),12),IF($AE$1=\"Gators\",OFFSET(Gators!$L$2,ROW($AE20),12),IF($AE$1=\"Knights\",OFFSET(Knights!$L$2,ROW($AE20),12),IF($AE$1=\"Hornets\",OFFSET(Hornets!$L$2,ROW($AE20),12),IF($AE$1=\"Wolves\",OFFSET(Wolves!$L$2,ROW($AE20),12),IF($AE$1=\"Comets\",OFFSET(Comets!$L$2,ROW($AE20),12)))))))))","v":0},{"$f":"IF($AE$1=\"Drillers\",OFFSET(Drillers!$L$2,ROW($AE20),13),IF($AE$1=\"Bulls\",OFFSET(Bulls!$L$2,ROW($AE20),13),IF($AE$1=\"Phantoms\",OFFSET(Phantoms!$L$2,ROW($AE20),13),IF($AE$1=\"Gators\",OFFSET(Gators!$L$2,ROW($AE20),13),IF($AE$1=\"Knights\",OFFSET(Knights!$L$2,ROW($AE20),13),IF($AE$1=\"Hornets\",OFFSET(Hornets!$L$2,ROW($AE20),13),IF($AE$1=\"Wolves\",OFFSET(Wolves!$L$2,ROW($AE20),13),IF($AE$1=\"Comets\",OFFSET(Comets!$L$2,ROW($AE20),13)))))))))","v":0},{"$f":"IF($AE$1=\"Drillers\",OFFSET(Drillers!$L$2,ROW($AE20),14),IF($AE$1=\"Bulls\",OFFSET(Bulls!$L$2,ROW($AE20),14),IF($AE$1=\"Phantoms\",OFFSET(Phantoms!$L$2,ROW($AE20),14),IF($AE$1=\"Gators\",OFFSET(Gators!$L$2,ROW($AE20),14),IF($AE$1=\"Knights\",OFFSET(Knights!$L$2,ROW($AE20),14),IF($AE$1=\"Hornets\",OFFSET(Hornets!$L$2,ROW($AE20),14),IF($AE$1=\"Wolves\",OFFSET(Wolves!$L$2,ROW($AE20),14),IF($AE$1=\"Comets\",OFFSET(Comets!$L$2,ROW($AE20),14)))))))))","v":2},{"$f":"IF(AE$1=\"Drillers\",OFFSET(Drillers!$L$2,ROW(AE20),15),IF(AE$1=\"Bulls\",OFFSET(Bulls!$L$2,ROW(AE20),15),IF(AE$1=\"Phantoms\",OFFSET(Phantoms!$L$2,ROW(AE20),15),IF(AE$1=\"Gators\",OFFSET(Gators!$L$2,ROW(AE20),15),IF(AE$1=\"Knights\",OFFSET(Knights!$L$2,ROW(AE20),15),IF(AE$1=\"Hornets\",OFFSET(Hornets!$L$2,ROW(AE20),15),IF(AE$1=\"Wolves\",OFFSET(Wolves!$L$2,ROW(AE20),15),IF(AE$1=\"Comets\",OFFSET(Comets!$L$2,ROW(AE20),15)))))))))","v":0},{"$f":"IF($AE$1=\"Drillers\",OFFSET(Drillers!$L$2,ROW(AE20),16),IF($AE$1=\"Bulls\",OFFSET(Bulls!$L$2,ROW(AE20),16),IF($AE$1=\"Phantoms\",OFFSET(Phantoms!$L$2,ROW(AE20),16),IF($AE$1=\"Gators\",OFFSET(Gators!$L$2,ROW(AE20),16),IF($AE$1=\"Knights\",OFFSET(Knights!$L$2,ROW(AE20),16),IF($AE$1=\"Hornets\",OFFSET(Hornets!$L$2,ROW(AE20),16),IF($AE$1=\"Wolves\",OFFSET(Wolves!$L$2,ROW(AE20),16),IF($AE$1=\"Comets\",OFFSET(Comets!$L$2,ROW(AE20),16)))))))))","v":0}]
[{"$nulls":4},3,{"$f":"IF($F$1=\"Drillers\",OFFSET(Drillers!$L$2,ROW($F21),1),IF($F$1=\"Bulls\",OFFSET(Bulls!$L$2,ROW($F21),1),IF($F$1=\"Phantoms\",OFFSET(Phantoms!$L$2,ROW($F21),1),IF($F$1=\"Gators\",OFFSET(Gators!$L$2,ROW($F21),1),IF($F$1=\"Knights\",OFFSET(Knights!$L$2,ROW($F21),1),IF($F$1=\"Hornets\",OFFSET(Hornets!$L$2,ROW($F21),1),IF($F$1=\"Reds\",OFFSET(Comets!$L$2,ROW($F21),1),IF($F$1=\"Guardians\",OFFSET(Wolves!$L$2,ROW($F21),1)))))))))","v":"Hoover"},{"$f":"IF($F$1=\"Drillers\",OFFSET(Drillers!$L$2,ROW($F21),2),IF($F$1=\"Bulls\",OFFSET(Bulls!$L$2,ROW($F21),2),IF($F$1=\"Phantoms\",OFFSET(Phantoms!$L$2,ROW($F21),2),IF($F$1=\"Gators\",OFFSET(Gators!$L$2,ROW($F21),2),IF($F$1=\"Knights\",OFFSET(Knights!$L$2,ROW($F21),2),IF($F$1=\"Hornets\",OFFSET(Hornets!$L$2,ROW($F21),2),IF($F$1=\"Reds\",OFFSET(Comets!$L$2,ROW($F21),2),IF($F$1=\"Guardians\",OFFSET(Wolves!$L$2,ROW($F21),2)))))))))","v":"Stanley"},{"$f":"IF($F$1=\"Drillers\",OFFSET(Drillers!$L$2,ROW($F21),3),IF($F$1=\"Bulls\",OFFSET(Bulls!$L$2,ROW($F21),3),IF($F$1=\"Phantoms\",OFFSET(Phantoms!$L$2,ROW($F21),3),IF($F$1=\"Gators\",OFFSET(Gators!$L$2,ROW($F21),3),IF($F$1=\"Knights\",OFFSET(Knights!$L$2,ROW($F21),3),IF($F$1=\"Hornets\",OFFSET(Hornets!$L$2,ROW($F21),3),IF($F$1=\"Guardians\",OFFSET(Wolves!$L$2,ROW($F21),3),IF($F$1=\"Reds\",OFFSET(Comets!$L$2,ROW($F21),3)))))))))","v":"L"},{"$f":"IF($F$1=\"Drillers\",OFFSET(Drillers!$L$2,ROW($F21),4),IF($F$1=\"Bulls\",OFFSET(Bulls!$L$2,ROW($F21),4),IF($F$1=\"Phantoms\",OFFSET(Phantoms!$L$2,ROW($F21),4),IF($F$1=\"Gators\",OFFSET(Gators!$L$2,ROW($F21),4),IF($F$1=\"Knights\",OFFSET(Knights!$L$2,ROW($F21),4),IF($F$1=\"Hornets\",OFFSET(Hornets!$L$2,ROW($F21),4),IF($F$1=\"Guardians\",OFFSET(Wolves!$L$2,ROW($F21),4),IF($F$1=\"Reds\",OFFSET(Comets!$L$2,ROW($F21),4)))))))))","v":-3},{"$f":"IF($F$1=\"Drillers\",OFFSET(Drillers!$L$2,ROW($F21),5),IF($F$1=\"Bulls\",OFFSET(Bulls!$L$2,ROW($F21),5),IF($F$1=\"Phantoms\",OFFSET(Phantoms!$L$2,ROW($F21),5),IF($F$1=\"Gators\",OFFSET(Gators!$L$2,ROW($F21),5),IF($F$1=\"Knights\",OFFSET(Knights!$L$2,ROW($F21),5),IF($F$1=\"Hornets\",OFFSET(Hornets!$L$2,ROW($F21),5),IF($F$1=\"Guardians\",OFFSET(Wolves!$L$2,ROW($F21),5),IF($F$1=\"Reds\",OFFSET(Comets!$L$2,ROW($F21),5)))))))))","v":-4},{"$f":"IF($F$1=\"Drillers\",OFFSET(Drillers!$L$2,ROW($F21),6),IF($F$1=\"Bulls\",OFFSET(Bulls!$L$2,ROW($F21),6),IF($F$1=\"Phantoms\",OFFSET(Phantoms!$L$2,ROW($F21),6),IF($F$1=\"Gators\",OFFSET(Gators!$L$2,ROW($F21),6),IF($F$1=\"Knights\",OFFSET(Knights!$L$2,ROW($F21),6),IF($F$1=\"Hornets\",OFFSET(Hornets!$L$2,ROW($F21),6),IF($F$1=\"Guardians\",OFFSET(Wolves!$L$2,ROW($F21),6),IF($F$1=\"Reds\",OFFSET(Comets!$L$2,ROW($F21),6)))))))))","v":"4"},{"$f":"IF($F$1=\"Drillers\",OFFSET(Drillers!$L$2,ROW(F21),7),IF($F$1=\"Bulls\",OFFSET(Bulls!$L$2,ROW(F21),7),IF($F$1=\"Phantoms\",OFFSET(Phantoms!$L$2,ROW(F21),7),IF($F$1=\"Gators\",OFFSET(Gators!$L$2,ROW(F21),7),IF($F$1=\"Knights\",OFFSET(Knights!$L$2,ROW(F21),7),IF($F$1=\"Hornets\",OFFSET(Hornets!$L$2,ROW(F21),7),IF($F$1=\"Guardians\",OFFSET(Wolves!$L$2,ROW(F21),7),IF($F$1=\"Reds\",OFFSET(Comets!$L$2,ROW(F21),7),))))))))","v":0},{"$f":"IF($F$1=\"Drillers\",OFFSET(Drillers!$L$2,ROW(F21),8),IF($F$1=\"Bulls\",OFFSET(Bulls!$L$2,ROW(F21),8),IF($F$1=\"Phantoms\",OFFSET(Phantoms!$L$2,ROW(F21),8),IF($F$1=\"Gators\",OFFSET(Gators!$L$2,ROW(F21),8),IF($F$1=\"Knights\",OFFSET(Knights!$L$2,ROW(F21),8),IF($F$1=\"Hornets\",OFFSET(Hornets!$L$2,ROW(F21),8),IF($F$1=\"Guardians\",OFFSET(Wolves!$L$2,ROW(F21),8),IF($F$1=\"Reds\",OFFSET(Comets!$L$2,ROW(F21),8)))))))))","v":0},{"$f":"IF($F$1=\"Drillers\",OFFSET(Drillers!$L$2,ROW($F21),9),IF($F$1=\"Bulls\",OFFSET(Bulls!$L$2,ROW($F21),9),IF($F$1=\"Phantoms\",OFFSET(Phantoms!$L$2,ROW($F21),9),IF($F$1=\"Gators\",OFFSET(Gators!$L$2,ROW($F21),9),IF($F$1=\"Knights\",OFFSET(Knights!$L$2,ROW($F21),9),IF($F$1=\"Hornets\",OFFSET(Hornets!$L$2,ROW(F21),9),IF($F$1=\"Guardians\",OFFSET(Wolves!$L$2,ROW($F21),9),IF($F$1=\"Reds\",OFFSET(Comets!$L$2,ROW($F21),9)))))))))","v":0},{"$f":"IF($F$1=\"Drillers\",OFFSET(Drillers!$L$2,ROW(F21),10),IF($F$1=\"Bulls\",OFFSET(Bulls!$L$2,ROW(F21),10),IF($F$1=\"Phantoms\",OFFSET(Phantoms!$L$2,ROW(F21),10),IF($F$1=\"Gators\",OFFSET(Gators!$L$2,ROW(F21),10),IF($F$1=\"Knights\",OFFSET(Knights!$L$2,ROW(F21),10),IF($F$1=\"Hornets\",OFFSET(Hornets!$L$2,ROW(F21),10),IF($F$1=\"Guardians\",OFFSET(Wolves!$L$2,ROW(F21),10),IF($F$1=\"Reds\",OFFSET(Comets!$L$2,ROW(F21),10)))))))))","v":0},{"$f":"IF($F$1=\"Drillers\",OFFSET(Drillers!$L$2,ROW(F21),11),IF($F$1=\"Bulls\",OFFSET(Bulls!$L$2,ROW(F21),11),IF($F$1=\"Phantoms\",OFFSET(Phantoms!$L$2,ROW(F21),11),IF($F$1=\"Gators\",OFFSET(Gators!$L$2,ROW(F21),11),IF($F$1=\"Knights\",OFFSET(Knights!$L$2,ROW(F21),11),IF($F$1=\"Hornets\",OFFSET(Hornets!$L$2,ROW(F21),11),IF($F$1=\"Guardians\",OFFSET(Wolves!$L$2,ROW(F21),11),IF($F$1=\"Drillers\",OFFSET(Drillers!$L$2,ROW(F21),11),IF($F$1=\"Reds\",OFFSET(Comets!$L$2,ROW(F21),11))))))))))","v":0},{"$f":"IF($F$1=\"Drillers\",OFFSET(Drillers!$L$2,ROW(F21),12),IF($F$1=\"Bulls\",OFFSET(Bulls!$L$2,ROW(F21),12),IF($F$1=\"Phantoms\",OFFSET(Phantoms!$L$2,ROW(F21),12),IF($F$1=\"Gators\",OFFSET(Gators!$L$2,ROW(F21),12),IF($F$1=\"Knights\",OFFSET(Knights!$L$2,ROW(F21),12),IF($F$1=\"Hornets\",OFFSET(Hornets!$L$2,ROW(F21),12),IF($F$1=\"Guardians\",OFFSET(Wolves!$L$2,ROW(F21),12),IF($F$1=\"Reds\",OFFSET(Comets!$L$2,ROW(F21),12),))))))))","v":0},{"$f":"IF($F$1=\"Drillers\",OFFSET(Drillers!$L$2,ROW(F21),13),IF($F$1=\"Bulls\",OFFSET(Bulls!$L$2,ROW(F21),13),IF($F$1=\"Phantoms\",OFFSET(Phantoms!$L$2,ROW(F21),13),IF($F$1=\"Gators\",OFFSET(Gators!$L$2,ROW(F21),13),IF($F$1=\"Knights\",OFFSET(Knights!$L$2,ROW(F21),13),IF($F$1=\"Hornets\",OFFSET(Hornets!$L$2,ROW(F21),13),IF($F$1=\"Guardians\",OFFSET(Wolves!$L$2,ROW(F21),13),IF($F$1=\"Reds\",OFFSET(Comets!$L$2,ROW(F21),13),))))))))","v":0},{"$f":"IF($F$1=\"Drillers\",OFFSET(Drillers!$L$2,ROW(F21),14),IF($F$1=\"Bulls\",OFFSET(Bulls!$L$2,ROW(F21),14),IF($F$1=\"Phantoms\",OFFSET(Phantoms!$L$2,ROW(F21),14),IF($F$1=\"Gators\",OFFSET(Gators!$L$2,ROW(F21),14),IF($F$1=\"Knights\",OFFSET(Knights!$L$2,ROW(F21),14),IF($F$1=\"Hornets\",OFFSET(Hornets!$L$2,ROW(F21),14),IF($F$1=\"Guardians\",OFFSET(Wolves!$L$2,ROW(F21),14,),IF($F$1=\"Reds\",OFFSET(Comets!$L$2,ROW(F21),14)))))))))","v":3},{"$f":"IF($F$1=\"Drillers\",OFFSET(Drillers!$L$2,ROW(F21),15),IF($F$1=\"Bulls\",OFFSET(Bulls!$L$2,ROW(F21),15),IF($F$1=\"Phantoms\",OFFSET(Phantoms!$L$2,ROW(F21),15),IF($F$1=\"Gators\",OFFSET(Gators!$L$2,ROW(F21),15),IF($F$1=\"Knights\",OFFSET(Knights!$L$2,ROW(F21),15),IF($F$1=\"Hornets\",OFFSET(Hornets!$L$2,ROW(F21),15),IF($F$1=\"Guardians\",OFFSET(Wolves!$L$2,ROW(F21),15),IF($F$1=\"Reds\",OFFSET(Comets!$L$2,ROW(F21),15)))))))))","v":0},{"$f":"IF($F$1=\"Drillers\",OFFSET(Drillers!$L$2,ROW(F21),16),IF($F$1=\"Bulls\",OFFSET(Bulls!$L$2,ROW(F21),16),IF($F$1=\"Phantoms\",OFFSET(Phantoms!$L$2,ROW(F21),16),IF($F$1=\"Gators\",OFFSET(Gators!$L$2,ROW(F21),16),IF($F$1=\"Knights\",OFFSET(Knights!$L$2,ROW(F21),16),IF($F$1=\"Hornets\",OFFSET(Hornets!$L$2,ROW(F21),16),IF($F$1=\"Guardians\",OFFSET(Wolves!$L$2,ROW(F21),16),IF($F$1=\"Reds\",OFFSET(Comets!$L$2,ROW(F21),16)))))))))","v":0},{"$nulls":8},3,{"$f":"IF($AE$1=\"Drillers\",OFFSET(Drillers!$L$2,ROW($AE21),1),IF($AE$1=\"Bulls\",OFFSET(Bulls!$L$2,ROW($AE21),1),IF($AE$1=\"Phantoms\",OFFSET(Phantoms!$L$2,ROW($AE21),1),IF($AE$1=\"Gators\",OFFSET(Gators!$L$2,ROW($AE21),1),IF($AE$1=\"Knights\",OFFSET(Knights!$L$2,ROW($AE21),1),IF($AE$1=\"Hornets\",OFFSET(Hornets!$L$2,ROW($AE21),1),IF($AE$1=\"Wolves\",OFFSET(Wolves!$L$2,ROW($AE21),1),IF(AE$1=\"Comets\",OFFSET(Comets!$L$2,ROW($AE21),1)))))))))","v":"Bradford"},{"$f":"IF($AE$1=\"Drillers\",OFFSET(Drillers!$L$2,ROW($AF21),2),IF($AE$1=\"Bulls\",OFFSET(Bulls!$L$2,ROW($AF21),2),IF($AE$1=\"Phantoms\",OFFSET(Phantoms!$L$2,ROW($AF21),2),IF($AE$1=\"Gators\",OFFSET(Gators!$L$2,ROW($AF21),2),IF($AE$1=\"Knights\",OFFSET(Knights!$L$2,ROW($AF21),2),IF($AE$1=\"Hornets\",OFFSET(Hornets!$L$2,ROW($AF21),2),IF($AE$1=\"Wolves\",OFFSET(Wolves!$L$2,ROW($AF21),2),IF($AE$1=\"Comets\",OFFSET(Comets!$L$2,ROW($AF21),2)))))))))","v":"Robert"},{"$f":"IF($AE$1=\"Drillers\",OFFSET(Drillers!$L$2,ROW($AE21),3),IF($AE$1=\"Bulls\",OFFSET(Bulls!$L$2,ROW($AE21),3),IF($AE$1=\"Phantoms\",OFFSET(Phantoms!$L$2,ROW($AE21),3),IF($AE$1=\"Gators\",OFFSET(Gators!$L$2,ROW($AE21),3),IF($AE$1=\"Knights\",OFFSET(Knights!$L$2,ROW($AE21),3),IF($AE$1=\"Hornets\",OFFSET(Hornets!$L$2,ROW($AE21),3),IF($AE$1=\"Wolves\",OFFSET(Wolves!$L$2,ROW($AE21),3),IF($AE$1=\"Comets\",OFFSET(Comets!$L$2,ROW($AE21),3)))))))))","v":"L"},{"$f":"IF($AE$1=\"Drillers\",OFFSET(Drillers!$L$2,ROW($AE21),4),IF($AE$1=\"Bulls\",OFFSET(Bulls!$L$2,ROW($AE21),4),IF($AE$1=\"Phantoms\",OFFSET(Phantoms!$L$2,ROW($AE21),4),IF($AE$1=\"Gators\",OFFSET(Gators!$L$2,ROW($AE21),4),IF($AE$1=\"Knights\",OFFSET(Knights!$L$2,ROW($AE21),4),IF($AE$1=\"Hornets\",OFFSET(Hornets!$L$2,ROW($AE21),4),IF($AE$1=\"Wolves\",OFFSET(Wolves!$L$2,ROW($AE21),4),IF($AE$1=\"Comets\",OFFSET(Comets!$L$2,ROW($AE21),4)))))))))","v":-5},{"$f":"IF($AE$1=\"Drillers\",OFFSET(Drillers!$L$2,ROW($AE21),5),IF($AE$1=\"Bulls\",OFFSET(Bulls!$L$2,ROW($AE21),5),IF($AE$1=\"Phantoms\",OFFSET(Phantoms!$L$2,ROW($AE21),5),IF($AE$1=\"Gators\",OFFSET(Gators!$L$2,ROW($AE21),5),IF($AE$1=\"Knights\",OFFSET(Knights!$L$2,ROW($AE21),5),IF($AE$1=\"Hornets\",OFFSET(Hornets!$L$2,ROW($AE21),5),IF($AE$1=\"Wolves\",OFFSET(Wolves!$L$2,ROW($AE21),5),IF($AE$1=\"Comets\",OFFSET(Comets!$L$2,ROW($AE21),5)))))))))","v":-3},{"$f":"IF($AE$1=\"Drillers\",OFFSET(Drillers!$L$2,ROW($AE21),6),IF($AE$1=\"Bulls\",OFFSET(Bulls!$L$2,ROW($AE21),6),IF($AE$1=\"Phantoms\",OFFSET(Phantoms!$L$2,ROW($AE21),6),IF($AE$1=\"Gators\",OFFSET(Gators!$L$2,ROW($AE21),6),IF($AE$1=\"Knights\",OFFSET(Knights!$L$2,ROW($AE21),6),IF($AE$1=\"Hornets\",OFFSET(Hornets!$L$2,ROW($AE21),6),IF($AE$1=\"Wolves\",OFFSET(Wolves!$L$2,ROW($AE21),6),IF($AE$1=\"Comets\",OFFSET(Comets!$L$2,ROW($AE21),6)))))))))","v":5},{"$f":"IF($AE$1=\"Drillers\",OFFSET(Drillers!$L$2,ROW($AE21),7),IF($AE$1=\"Bulls\",OFFSET(Bulls!$L$2,ROW($AE21),7),IF($AE$1=\"Phantoms\",OFFSET(Phantoms!$L$2,ROW($AE21),7),IF($AE$1=\"Gators\",OFFSET(Gators!$L$2,ROW($AE21),7),IF($AE$1=\"Knights\",OFFSET(Knights!$L$2,ROW($AE21),7),IF($AE$1=\"Hornets\",OFFSET(Hornets!$L$2,ROW($AE21),7),IF($AE$1=\"Wolves\",OFFSET(Wolves!$L$2,ROW($AE21),7),IF($AE$1=\"Comets\",OFFSET(Comets!$L$2,ROW($AE21),7)))))))))","v":0},{"$f":"IF($AE$1=\"Drillers\",OFFSET(Drillers!$L$2,ROW($AE21),8),IF($AE$1=\"Bulls\",OFFSET(Bulls!$L$2,ROW($AE21),8),IF($AE$1=\"Phantoms\",OFFSET(Phantoms!$L$2,ROW($AE21),8),IF($AE$1=\"Gators\",OFFSET(Gators!$L$2,ROW($AE21),8),IF($AE$1=\"Knights\",OFFSET(Knights!$L$2,ROW($AE21),8),IF($AE$1=\"Hornets\",OFFSET(Hornets!$L$2,ROW($AE21),8),IF($AE$1=\"Wolves\",OFFSET(Wolves!$L$2,ROW($AE21),8),IF($AE$1=\"Comets\",OFFSET(Comets!$L$2,ROW($AE21),8)))))))))","v":0},{"$f":"IF($AE$1=\"Drillers\",OFFSET(Drillers!$L$2,ROW($AE21),9),IF($AE$1=\"Bulls\",OFFSET(Bulls!$L$2,ROW($AE21),9),IF($AE$1=\"Phantoms\",OFFSET(Phantoms!$L$2,ROW($AE21),9),IF($AE$1=\"Gators\",OFFSET(Gators!$L$2,ROW($AE21),9),IF($AE$1=\"Knights\",OFFSET(Knights!$L$2,ROW($AE21),9),IF($AE$1=\"Hornets\",OFFSET(Hornets!$L$2,ROW($AE21),9),IF($AE$1=\"Wolves\",OFFSET(Wolves!$L$2,ROW($AE21),9),IF($AE$1=\"Comets\",OFFSET(Comets!$L$2,ROW($AE21),9)))))))))","v":0},{"$f":"IF($AE$1=\"Drillers\",OFFSET(Drillers!$L$2,ROW($AE21),10),IF($AE$1=\"Bulls\",OFFSET(Bulls!$L$2,ROW($AE21),10),IF($AE$1=\"Phantoms\",OFFSET(Phantoms!$L$2,ROW($AE21),10),IF($AE$1=\"Gators\",OFFSET(Gators!$L$2,ROW($AE21),10),IF($AE$1=\"Knights\",OFFSET(Knights!$L$2,ROW($AE21),10),IF($AE$1=\"Hornets\",OFFSET(Hornets!$L$2,ROW($AE21),10),IF($AE$1=\"Wolves\",OFFSET(Wolves!$L$2,ROW($AE21),10),IF($AE$1=\"Comets\",OFFSET(Comets!$L$2,ROW($AE21),10)))))))))","v":0},{"$f":"IF($AE$1=\"Drillers\",OFFSET(Drillers!$L$2,ROW($AE21),11),IF($AE$1=\"Bulls\",OFFSET(Bulls!$L$2,ROW($AE21),11),IF($AE$1=\"Phantoms\",OFFSET(Phantoms!$L$2,ROW($AE21),11),IF($AE$1=\"Gators\",OFFSET(Gators!$L$2,ROW($AE21),11),IF($AE$1=\"Knights\",OFFSET(Knights!$L$2,ROW($AE21),11),IF($AE$1=\"Hornets\",OFFSET(Hornets!$L$2,ROW($AE21),11),IF($AE$1=\"Wolves\",OFFSET(Wolves!$L$2,ROW($AE21),11),IF($AE$1=\"Comets\",OFFSET(Comets!$L$2,ROW($AE21),11)))))))))","v":0},{"$f":"IF($AE$1=\"Drillers\",OFFSET(Drillers!$L$2,ROW($AE21),12),IF($AE$1=\"Bulls\",OFFSET(Bulls!$L$2,ROW($AE21),12),IF($AE$1=\"Phantoms\",OFFSET(Phantoms!$L$2,ROW($AE21),12),IF($AE$1=\"Gators\",OFFSET(Gators!$L$2,ROW($AE21),12),IF($AE$1=\"Knights\",OFFSET(Knights!$L$2,ROW($AE21),12),IF($AE$1=\"Hornets\",OFFSET(Hornets!$L$2,ROW($AE21),12),IF($AE$1=\"Wolves\",OFFSET(Wolves!$L$2,ROW($AE21),12),IF($AE$1=\"Comets\",OFFSET(Comets!$L$2,ROW($AE21),12)))))))))","v":0},{"$f":"IF($AE$1=\"Drillers\",OFFSET(Drillers!$L$2,ROW($AE21),13),IF($AE$1=\"Bulls\",OFFSET(Bulls!$L$2,ROW($AE21),13),IF($AE$1=\"Phantoms\",OFFSET(Phantoms!$L$2,ROW($AE21),13),IF($AE$1=\"Gators\",OFFSET(Gators!$L$2,ROW($AE21),13),IF($AE$1=\"Knights\",OFFSET(Knights!$L$2,ROW($AE21),13),IF($AE$1=\"Hornets\",OFFSET(Hornets!$L$2,ROW($AE21),13),IF($AE$1=\"Wolves\",OFFSET(Wolves!$L$2,ROW($AE21),13),IF($AE$1=\"Comets\",OFFSET(Comets!$L$2,ROW($AE21),13)))))))))","v":" "},{"$f":"IF($AE$1=\"Drillers\",OFFSET(Drillers!$L$2,ROW($AE21),14),IF($AE$1=\"Bulls\",OFFSET(Bulls!$L$2,ROW($AE21),14),IF($AE$1=\"Phantoms\",OFFSET(Phantoms!$L$2,ROW($AE21),14),IF($AE$1=\"Gators\",OFFSET(Gators!$L$2,ROW($AE21),14),IF($AE$1=\"Knights\",OFFSET(Knights!$L$2,ROW($AE21),14),IF($AE$1=\"Hornets\",OFFSET(Hornets!$L$2,ROW($AE21),14),IF($AE$1=\"Wolves\",OFFSET(Wolves!$L$2,ROW($AE21),14),IF($AE$1=\"Comets\",OFFSET(Comets!$L$2,ROW($AE21),14)))))))))","v":3},{"$f":"IF(AE$1=\"Drillers\",OFFSET(Drillers!$L$2,ROW(AE21),15),IF(AE$1=\"Bulls\",OFFSET(Bulls!$L$2,ROW(AE21),15),IF(AE$1=\"Phantoms\",OFFSET(Phantoms!$L$2,ROW(AE21),15),IF(AE$1=\"Gators\",OFFSET(Gators!$L$2,ROW(AE21),15),IF(AE$1=\"Knights\",OFFSET(Knights!$L$2,ROW(AE21),15),IF(AE$1=\"Hornets\",OFFSET(Hornets!$L$2,ROW(AE21),15),IF(AE$1=\"Wolves\",OFFSET(Wolves!$L$2,ROW(AE21),15),IF(AE$1=\"Comets\",OFFSET(Comets!$L$2,ROW(AE21),15)))))))))","v":0},{"$f":"IF($AE$1=\"Drillers\",OFFSET(Drillers!$L$2,ROW(AE21),16),IF($AE$1=\"Bulls\",OFFSET(Bulls!$L$2,ROW(AE21),16),IF($AE$1=\"Phantoms\",OFFSET(Phantoms!$L$2,ROW(AE21),16),IF($AE$1=\"Gators\",OFFSET(Gators!$L$2,ROW(AE21),16),IF($AE$1=\"Knights\",OFFSET(Knights!$L$2,ROW(AE21),16),IF($AE$1=\"Hornets\",OFFSET(Hornets!$L$2,ROW(AE21),16),IF($AE$1=\"Wolves\",OFFSET(Wolves!$L$2,ROW(AE21),16),IF($AE$1=\"Comets\",OFFSET(Comets!$L$2,ROW(AE21),16)))))))))","v":0}]
[{"$nulls":4},4,{"$f":"IF($F$1=\"Drillers\",OFFSET(Drillers!$L$2,ROW($F22),1),IF($F$1=\"Bulls\",OFFSET(Bulls!$L$2,ROW($F22),1),IF($F$1=\"Phantoms\",OFFSET(Phantoms!$L$2,ROW($F22),1),IF($F$1=\"Gators\",OFFSET(Gators!$L$2,ROW($F22),1),IF($F$1=\"Knights\",OFFSET(Knights!$L$2,ROW($F22),1),IF($F$1=\"Hornets\",OFFSET(Hornets!$L$2,ROW($F22),1),IF($F$1=\"Reds\",OFFSET(Comets!$L$2,ROW($F22),1),IF($F$1=\"Guardians\",OFFSET(Wolves!$L$2,ROW($F22),1)))))))))","v":"Rivas"},{"$f":"IF($F$1=\"Drillers\",OFFSET(Drillers!$L$2,ROW($F22),2),IF($F$1=\"Bulls\",OFFSET(Bulls!$L$2,ROW($F22),2),IF($F$1=\"Phantoms\",OFFSET(Phantoms!$L$2,ROW($F22),2),IF($F$1=\"Gators\",OFFSET(Gators!$L$2,ROW($F22),2),IF($F$1=\"Knights\",OFFSET(Knights!$L$2,ROW($F22),2),IF($F$1=\"Hornets\",OFFSET(Hornets!$L$2,ROW($F22),2),IF($F$1=\"Reds\",OFFSET(Comets!$L$2,ROW($F22),2),IF($F$1=\"Guardians\",OFFSET(Wolves!$L$2,ROW($F22),2)))))))))","v":"Antonio"},{"$f":"IF($F$1=\"Drillers\",OFFSET(Drillers!$L$2,ROW($F22),3),IF($F$1=\"Bulls\",OFFSET(Bulls!$L$2,ROW($F22),3),IF($F$1=\"Phantoms\",OFFSET(Phantoms!$L$2,ROW($F22),3),IF($F$1=\"Gators\",OFFSET(Gators!$L$2,ROW($F22),3),IF($F$1=\"Knights\",OFFSET(Knights!$L$2,ROW($F22),3),IF($F$1=\"Hornets\",OFFSET(Hornets!$L$2,ROW($F22),3),IF($F$1=\"Guardians\",OFFSET(Wolves!$L$2,ROW($F22),3),IF($F$1=\"Reds\",OFFSET(Comets!$L$2,ROW($F22),3)))))))))","v":"R"},{"$f":"IF($F$1=\"Drillers\",OFFSET(Drillers!$L$2,ROW($F22),4),IF($F$1=\"Bulls\",OFFSET(Bulls!$L$2,ROW($F22),4),IF($F$1=\"Phantoms\",OFFSET(Phantoms!$L$2,ROW($F22),4),IF($F$1=\"Gators\",OFFSET(Gators!$L$2,ROW($F22),4),IF($F$1=\"Knights\",OFFSET(Knights!$L$2,ROW($F22),4),IF($F$1=\"Hornets\",OFFSET(Hornets!$L$2,ROW($F22),4),IF($F$1=\"Guardians\",OFFSET(Wolves!$L$2,ROW($F22),4),IF($F$1=\"Reds\",OFFSET(Comets!$L$2,ROW($F22),4)))))))))","v":-2},{"$f":"IF($F$1=\"Drillers\",OFFSET(Drillers!$L$2,ROW($F22),5),IF($F$1=\"Bulls\",OFFSET(Bulls!$L$2,ROW($F22),5),IF($F$1=\"Phantoms\",OFFSET(Phantoms!$L$2,ROW($F22),5),IF($F$1=\"Gators\",OFFSET(Gators!$L$2,ROW($F22),5),IF($F$1=\"Knights\",OFFSET(Knights!$L$2,ROW($F22),5),IF($F$1=\"Hornets\",OFFSET(Hornets!$L$2,ROW($F22),5),IF($F$1=\"Guardians\",OFFSET(Wolves!$L$2,ROW($F22),5),IF($F$1=\"Reds\",OFFSET(Comets!$L$2,ROW($F22),5)))))))))","v":-3},{"$f":"IF($F$1=\"Drillers\",OFFSET(Drillers!$L$2,ROW($F22),6),IF($F$1=\"Bulls\",OFFSET(Bulls!$L$2,ROW($F22),6),IF($F$1=\"Phantoms\",OFFSET(Phantoms!$L$2,ROW($F22),6),IF($F$1=\"Gators\",OFFSET(Gators!$L$2,ROW($F22),6),IF($F$1=\"Knights\",OFFSET(Knights!$L$2,ROW($F22),6),IF($F$1=\"Hornets\",OFFSET(Hornets!$L$2,ROW($F22),6),IF($F$1=\"Guardians\",OFFSET(Wolves!$L$2,ROW($F22),6),IF($F$1=\"Reds\",OFFSET(Comets!$L$2,ROW($F22),6)))))))))","v":4},{"$f":"IF($F$1=\"Drillers\",OFFSET(Drillers!$L$2,ROW(F22),7),IF($F$1=\"Bulls\",OFFSET(Bulls!$L$2,ROW(F22),7),IF($F$1=\"Phantoms\",OFFSET(Phantoms!$L$2,ROW(F22),7),IF($F$1=\"Gators\",OFFSET(Gators!$L$2,ROW(F22),7),IF($F$1=\"Knights\",OFFSET(Knights!$L$2,ROW(F22),7),IF($F$1=\"Hornets\",OFFSET(Hornets!$L$2,ROW(F22),7),IF($F$1=\"Guardians\",OFFSET(Wolves!$L$2,ROW(F22),7),IF($F$1=\"Reds\",OFFSET(Comets!$L$2,ROW(F22),7),))))))))","v":0},{"$f":"IF($F$1=\"Drillers\",OFFSET(Drillers!$L$2,ROW(F22),8),IF($F$1=\"Bulls\",OFFSET(Bulls!$L$2,ROW(F22),8),IF($F$1=\"Phantoms\",OFFSET(Phantoms!$L$2,ROW(F22),8),IF($F$1=\"Gators\",OFFSET(Gators!$L$2,ROW(F22),8),IF($F$1=\"Knights\",OFFSET(Knights!$L$2,ROW(F22),8),IF($F$1=\"Hornets\",OFFSET(Hornets!$L$2,ROW(F22),8),IF($F$1=\"Guardians\",OFFSET(Wolves!$L$2,ROW(F22),8),IF($F$1=\"Reds\",OFFSET(Comets!$L$2,ROW(F22),8)))))))))","v":0},{"$f":"IF($F$1=\"Drillers\",OFFSET(Drillers!$L$2,ROW($F22),9),IF($F$1=\"Bulls\",OFFSET(Bulls!$L$2,ROW($F22),9),IF($F$1=\"Phantoms\",OFFSET(Phantoms!$L$2,ROW($F22),9),IF($F$1=\"Gators\",OFFSET(Gators!$L$2,ROW($F22),9),IF($F$1=\"Knights\",OFFSET(Knights!$L$2,ROW($F22),9),IF($F$1=\"Hornets\",OFFSET(Hornets!$L$2,ROW(F22),9),IF($F$1=\"Guardians\",OFFSET(Wolves!$L$2,ROW($F22),9),IF($F$1=\"Reds\",OFFSET(Comets!$L$2,ROW($F22),9)))))))))","v":0},{"$f":"IF($F$1=\"Drillers\",OFFSET(Drillers!$L$2,ROW(F22),10),IF($F$1=\"Bulls\",OFFSET(Bulls!$L$2,ROW(F22),10),IF($F$1=\"Phantoms\",OFFSET(Phantoms!$L$2,ROW(F22),10),IF($F$1=\"Gators\",OFFSET(Gators!$L$2,ROW(F22),10),IF($F$1=\"Knights\",OFFSET(Knights!$L$2,ROW(F22),10),IF($F$1=\"Hornets\",OFFSET(Hornets!$L$2,ROW(F22),10),IF($F$1=\"Guardians\",OFFSET(Wolves!$L$2,ROW(F22),10),IF($F$1=\"Reds\",OFFSET(Comets!$L$2,ROW(F22),10)))))))))","v":0},{"$f":"IF($F$1=\"Drillers\",OFFSET(Drillers!$L$2,ROW(F22),11),IF($F$1=\"Bulls\",OFFSET(Bulls!$L$2,ROW(F22),11),IF($F$1=\"Phantoms\",OFFSET(Phantoms!$L$2,ROW(F22),11),IF($F$1=\"Gators\",OFFSET(Gators!$L$2,ROW(F22),11),IF($F$1=\"Knights\",OFFSET(Knights!$L$2,ROW(F22),11),IF($F$1=\"Hornets\",OFFSET(Hornets!$L$2,ROW(F22),11),IF($F$1=\"Guardians\",OFFSET(Wolves!$L$2,ROW(F22),11),IF($F$1=\"Drillers\",OFFSET(Drillers!$L$2,ROW(F22),11),IF($F$1=\"Reds\",OFFSET(Comets!$L$2,ROW(F22),11))))))))))","v":0},{"$f":"IF($F$1=\"Drillers\",OFFSET(Drillers!$L$2,ROW(F22),12),IF($F$1=\"Bulls\",OFFSET(Bulls!$L$2,ROW(F22),12),IF($F$1=\"Phantoms\",OFFSET(Phantoms!$L$2,ROW(F22),12),IF($F$1=\"Gators\",OFFSET(Gators!$L$2,ROW(F22),12),IF($F$1=\"Knights\",OFFSET(Knights!$L$2,ROW(F22),12),IF($F$1=\"Hornets\",OFFSET(Hornets!$L$2,ROW(F22),12),IF($F$1=\"Guardians\",OFFSET(Wolves!$L$2,ROW(F22),12),IF($F$1=\"Reds\",OFFSET(Comets!$L$2,ROW(F22),12),))))))))","v":0},{"$f":"IF($F$1=\"Drillers\",OFFSET(Drillers!$L$2,ROW(F22),13),IF($F$1=\"Bulls\",OFFSET(Bulls!$L$2,ROW(F22),13),IF($F$1=\"Phantoms\",OFFSET(Phantoms!$L$2,ROW(F22),13),IF($F$1=\"Gators\",OFFSET(Gators!$L$2,ROW(F22),13),IF($F$1=\"Knights\",OFFSET(Knights!$L$2,ROW(F22),13),IF($F$1=\"Hornets\",OFFSET(Hornets!$L$2,ROW(F22),13),IF($F$1=\"Guardians\",OFFSET(Wolves!$L$2,ROW(F22),13),IF($F$1=\"Reds\",OFFSET(Comets!$L$2,ROW(F22),13),))))))))","v":0},{"$f":"IF($F$1=\"Drillers\",OFFSET(Drillers!$L$2,ROW(F22),14),IF($F$1=\"Bulls\",OFFSET(Bulls!$L$2,ROW(F22),14),IF($F$1=\"Phantoms\",OFFSET(Phantoms!$L$2,ROW(F22),14),IF($F$1=\"Gators\",OFFSET(Gators!$L$2,ROW(F22),14),IF($F$1=\"Knights\",OFFSET(Knights!$L$2,ROW(F22),14),IF($F$1=\"Hornets\",OFFSET(Hornets!$L$2,ROW(F22),14),IF($F$1=\"Guardians\",OFFSET(Wolves!$L$2,ROW(F22),14,),IF($F$1=\"Reds\",OFFSET(Comets!$L$2,ROW(F22),14)))))))))","v":2},{"$f":"IF($F$1=\"Drillers\",OFFSET(Drillers!$L$2,ROW(F22),15),IF($F$1=\"Bulls\",OFFSET(Bulls!$L$2,ROW(F22),15),IF($F$1=\"Phantoms\",OFFSET(Phantoms!$L$2,ROW(F22),15),IF($F$1=\"Gators\",OFFSET(Gators!$L$2,ROW(F22),15),IF($F$1=\"Knights\",OFFSET(Knights!$L$2,ROW(F22),15),IF($F$1=\"Hornets\",OFFSET(Hornets!$L$2,ROW(F22),15),IF($F$1=\"Guardians\",OFFSET(Wolves!$L$2,ROW(F22),15),IF($F$1=\"Reds\",OFFSET(Comets!$L$2,ROW(F22),15)))))))))","v":0},{"$f":"IF($F$1=\"Drillers\",OFFSET(Drillers!$L$2,ROW(F22),16),IF($F$1=\"Bulls\",OFFSET(Bulls!$L$2,ROW(F22),16),IF($F$1=\"Phantoms\",OFFSET(Phantoms!$L$2,ROW(F22),16),IF($F$1=\"Gators\",OFFSET(Gators!$L$2,ROW(F22),16),IF($F$1=\"Knights\",OFFSET(Knights!$L$2,ROW(F22),16),IF($F$1=\"Hornets\",OFFSET(Hornets!$L$2,ROW(F22),16),IF($F$1=\"Guardians\",OFFSET(Wolves!$L$2,ROW(F22),16),IF($F$1=\"Reds\",OFFSET(Comets!$L$2,ROW(F22),16)))))))))","v":0},{"$nulls":8},4,{"$f":"IF($AE$1=\"Drillers\",OFFSET(Drillers!$L$2,ROW($AE22),1),IF($AE$1=\"Bulls\",OFFSET(Bulls!$L$2,ROW($AE22),1),IF($AE$1=\"Phantoms\",OFFSET(Phantoms!$L$2,ROW($AE22),1),IF($AE$1=\"Gators\",OFFSET(Gators!$L$2,ROW($AE22),1),IF($AE$1=\"Knights\",OFFSET(Knights!$L$2,ROW($AE22),1),IF($AE$1=\"Hornets\",OFFSET(Hornets!$L$2,ROW($AE22),1),IF($AE$1=\"Wolves\",OFFSET(Wolves!$L$2,ROW($AE22),1),IF(AE$1=\"Comets\",OFFSET(Comets!$L$2,ROW($AE22),1)))))))))","v":"Molina"},{"$f":"IF($AE$1=\"Drillers\",OFFSET(Drillers!$L$2,ROW($AF22),2),IF($AE$1=\"Bulls\",OFFSET(Bulls!$L$2,ROW($AF22),2),IF($AE$1=\"Phantoms\",OFFSET(Phantoms!$L$2,ROW($AF22),2),IF($AE$1=\"Gators\",OFFSET(Gators!$L$2,ROW($AF22),2),IF($AE$1=\"Knights\",OFFSET(Knights!$L$2,ROW($AF22),2),IF($AE$1=\"Hornets\",OFFSET(Hornets!$L$2,ROW($AF22),2),IF($AE$1=\"Wolves\",OFFSET(Wolves!$L$2,ROW($AF22),2),IF($AE$1=\"Comets\",OFFSET(Comets!$L$2,ROW($AF22),2)))))))))","v":"Jesus"},{"$f":"IF($AE$1=\"Drillers\",OFFSET(Drillers!$L$2,ROW($AE22),3),IF($AE$1=\"Bulls\",OFFSET(Bulls!$L$2,ROW($AE22),3),IF($AE$1=\"Phantoms\",OFFSET(Phantoms!$L$2,ROW($AE22),3),IF($AE$1=\"Gators\",OFFSET(Gators!$L$2,ROW($AE22),3),IF($AE$1=\"Knights\",OFFSET(Knights!$L$2,ROW($AE22),3),IF($AE$1=\"Hornets\",OFFSET(Hornets!$L$2,ROW($AE22),3),IF($AE$1=\"Wolves\",OFFSET(Wolves!$L$2,ROW($AE22),3),IF($AE$1=\"Comets\",OFFSET(Comets!$L$2,ROW($AE22),3)))))))))","v":"R"},{"$f":"IF($AE$1=\"Drillers\",OFFSET(Drillers!$L$2,ROW($AE22),4),IF($AE$1=\"Bulls\",OFFSET(Bulls!$L$2,ROW($AE22),4),IF($AE$1=\"Phantoms\",OFFSET(Phantoms!$L$2,ROW($AE22),4),IF($AE$1=\"Gators\",OFFSET(Gators!$L$2,ROW($AE22),4),IF($AE$1=\"Knights\",OFFSET(Knights!$L$2,ROW($AE22),4),IF($AE$1=\"Hornets\",OFFSET(Hornets!$L$2,ROW($AE22),4),IF($AE$1=\"Wolves\",OFFSET(Wolves!$L$2,ROW($AE22),4),IF($AE$1=\"Comets\",OFFSET(Comets!$L$2,ROW($AE22),4)))))))))","v":-3},{"$f":"IF($AE$1=\"Drillers\",OFFSET(Drillers!$L$2,ROW($AE22),5),IF($AE$1=\"Bulls\",OFFSET(Bulls!$L$2,ROW($AE22),5),IF($AE$1=\"Phantoms\",OFFSET(Phantoms!$L$2,ROW($AE22),5),IF($AE$1=\"Gators\",OFFSET(Gators!$L$2,ROW($AE22),5),IF($AE$1=\"Knights\",OFFSET(Knights!$L$2,ROW($AE22),5),IF($AE$1=\"Hornets\",OFFSET(Hornets!$L$2,ROW($AE22),5),IF($AE$1=\"Wolves\",OFFSET(Wolves!$L$2,ROW($AE22),5),IF($AE$1=\"Comets\",OFFSET(Comets!$L$2,ROW($AE22),5)))))))))","v":-3},{"$f":"IF($AE$1=\"Drillers\",OFFSET(Drillers!$L$2,ROW($AE22),6),IF($AE$1=\"Bulls\",OFFSET(Bulls!$L$2,ROW($AE22),6),IF($AE$1=\"Phantoms\",OFFSET(Phantoms!$L$2,ROW($AE22),6),IF($AE$1=\"Gators\",OFFSET(Gators!$L$2,ROW($AE22),6),IF($AE$1=\"Knights\",OFFSET(Knights!$L$2,ROW($AE22),6),IF($AE$1=\"Hornets\",OFFSET(Hornets!$L$2,ROW($AE22),6),IF($AE$1=\"Wolves\",OFFSET(Wolves!$L$2,ROW($AE22),6),IF($AE$1=\"Comets\",OFFSET(Comets!$L$2,ROW($AE22),6)))))))))","v":5},{"$f":"IF($AE$1=\"Drillers\",OFFSET(Drillers!$L$2,ROW($AE22),7),IF($AE$1=\"Bulls\",OFFSET(Bulls!$L$2,ROW($AE22),7),IF($AE$1=\"Phantoms\",OFFSET(Phantoms!$L$2,ROW($AE22),7),IF($AE$1=\"Gators\",OFFSET(Gators!$L$2,ROW($AE22),7),IF($AE$1=\"Knights\",OFFSET(Knights!$L$2,ROW($AE22),7),IF($AE$1=\"Hornets\",OFFSET(Hornets!$L$2,ROW($AE22),7),IF($AE$1=\"Wolves\",OFFSET(Wolves!$L$2,ROW($AE22),7),IF($AE$1=\"Comets\",OFFSET(Comets!$L$2,ROW($AE22),7)))))))))","v":0},{"$f":"IF($AE$1=\"Drillers\",OFFSET(Drillers!$L$2,ROW($AE22),8),IF($AE$1=\"Bulls\",OFFSET(Bulls!$L$2,ROW($AE22),8),IF($AE$1=\"Phantoms\",OFFSET(Phantoms!$L$2,ROW($AE22),8),IF($AE$1=\"Gators\",OFFSET(Gators!$L$2,ROW($AE22),8),IF($AE$1=\"Knights\",OFFSET(Knights!$L$2,ROW($AE22),8),IF($AE$1=\"Hornets\",OFFSET(Hornets!$L$2,ROW($AE22),8),IF($AE$1=\"Wolves\",OFFSET(Wolves!$L$2,ROW($AE22),8),IF($AE$1=\"Comets\",OFFSET(Comets!$L$2,ROW($AE22),8)))))))))","v":0},{"$f":"IF($AE$1=\"Drillers\",OFFSET(Drillers!$L$2,ROW($AE22),9),IF($AE$1=\"Bulls\",OFFSET(Bulls!$L$2,ROW($AE22),9),IF($AE$1=\"Phantoms\",OFFSET(Phantoms!$L$2,ROW($AE22),9),IF($AE$1=\"Gators\",OFFSET(Gators!$L$2,ROW($AE22),9),IF($AE$1=\"Knights\",OFFSET(Knights!$L$2,ROW($AE22),9),IF($AE$1=\"Hornets\",OFFSET(Hornets!$L$2,ROW($AE22),9),IF($AE$1=\"Wolves\",OFFSET(Wolves!$L$2,ROW($AE22),9),IF($AE$1=\"Comets\",OFFSET(Comets!$L$2,ROW($AE22),9)))))))))","v":0},{"$f":"IF($AE$1=\"Drillers\",OFFSET(Drillers!$L$2,ROW($AE22),10),IF($AE$1=\"Bulls\",OFFSET(Bulls!$L$2,ROW($AE22),10),IF($AE$1=\"Phantoms\",OFFSET(Phantoms!$L$2,ROW($AE22),10),IF($AE$1=\"Gators\",OFFSET(Gators!$L$2,ROW($AE22),10),IF($AE$1=\"Knights\",OFFSET(Knights!$L$2,ROW($AE22),10),IF($AE$1=\"Hornets\",OFFSET(Hornets!$L$2,ROW($AE22),10),IF($AE$1=\"Wolves\",OFFSET(Wolves!$L$2,ROW($AE22),10),IF($AE$1=\"Comets\",OFFSET(Comets!$L$2,ROW($AE22),10)))))))))","v":0},{"$f":"IF($AE$1=\"Drillers\",OFFSET(Drillers!$L$2,ROW($AE22),11),IF($AE$1=\"Bulls\",OFFSET(Bulls!$L$2,ROW($AE22),11),IF($AE$1=\"Phantoms\",OFFSET(Phantoms!$L$2,ROW($AE22),11),IF($AE$1=\"Gators\",OFFSET(Gators!$L$2,ROW($AE22),11),IF($AE$1=\"Knights\",OFFSET(Knights!$L$2,ROW($AE22),11),IF($AE$1=\"Hornets\",OFFSET(Hornets!$L$2,ROW($AE22),11),IF($AE$1=\"Wolves\",OFFSET(Wolves!$L$2,ROW($AE22),11),IF($AE$1=\"Comets\",OFFSET(Comets!$L$2,ROW($AE22),11)))))))))","v":0},{"$f":"IF($AE$1=\"Drillers\",OFFSET(Drillers!$L$2,ROW($AE22),12),IF($AE$1=\"Bulls\",OFFSET(Bulls!$L$2,ROW($AE22),12),IF($AE$1=\"Phantoms\",OFFSET(Phantoms!$L$2,ROW($AE22),12),IF($AE$1=\"Gators\",OFFSET(Gators!$L$2,ROW($AE22),12),IF($AE$1=\"Knights\",OFFSET(Knights!$L$2,ROW($AE22),12),IF($AE$1=\"Hornets\",OFFSET(Hornets!$L$2,ROW($AE22),12),IF($AE$1=\"Wolves\",OFFSET(Wolves!$L$2,ROW($AE22),12),IF($AE$1=\"Comets\",OFFSET(Comets!$L$2,ROW($AE22),12)))))))))","v":0},{"$f":"IF($AE$1=\"Drillers\",OFFSET(Drillers!$L$2,ROW($AE22),13),IF($AE$1=\"Bulls\",OFFSET(Bulls!$L$2,ROW($AE22),13),IF($AE$1=\"Phantoms\",OFFSET(Phantoms!$L$2,ROW($AE22),13),IF($AE$1=\"Gators\",OFFSET(Gators!$L$2,ROW($AE22),13),IF($AE$1=\"Knights\",OFFSET(Knights!$L$2,ROW($AE22),13),IF($AE$1=\"Hornets\",OFFSET(Hornets!$L$2,ROW($AE22),13),IF($AE$1=\"Wolves\",OFFSET(Wolves!$L$2,ROW($AE22),13),IF($AE$1=\"Comets\",OFFSET(Comets!$L$2,ROW($AE22),13)))))))))","v":0},{"$f":"IF($AE$1=\"Drillers\",OFFSET(Drillers!$L$2,ROW($AE22),14),IF($AE$1=\"Bulls\",OFFSET(Bulls!$L$2,ROW($AE22),14),IF($AE$1=\"Phantoms\",OFFSET(Phantoms!$L$2,ROW($AE22),14),IF($AE$1=\"Gators\",OFFSET(Gators!$L$2,ROW($AE22),14),IF($AE$1=\"Knights\",OFFSET(Knights!$L$2,ROW($AE22),14),IF($AE$1=\"Hornets\",OFFSET(Hornets!$L$2,ROW($AE22),14),IF($AE$1=\"Wolves\",OFFSET(Wolves!$L$2,ROW($AE22),14),IF($AE$1=\"Comets\",OFFSET(Comets!$L$2,ROW($AE22),14)))))))))","v":3},{"$f":"IF(AE$1=\"Drillers\",OFFSET(Drillers!$L$2,ROW(AE22),15),IF(AE$1=\"Bulls\",OFFSET(Bulls!$L$2,ROW(AE22),15),IF(AE$1=\"Phantoms\",OFFSET(Phantoms!$L$2,ROW(AE22),15),IF(AE$1=\"Gators\",OFFSET(Gators!$L$2,ROW(AE22),15),IF(AE$1=\"Knights\",OFFSET(Knights!$L$2,ROW(AE22),15),IF(AE$1=\"Hornets\",OFFSET(Hornets!$L$2,ROW(AE22),15),IF(AE$1=\"Wolves\",OFFSET(Wolves!$L$2,ROW(AE22),15),IF(AE$1=\"Comets\",OFFSET(Comets!$L$2,ROW(AE22),15)))))))))","v":0},{"$f":"IF($AE$1=\"Drillers\",OFFSET(Drillers!$L$2,ROW(AE22),16),IF($AE$1=\"Bulls\",OFFSET(Bulls!$L$2,ROW(AE22),16),IF($AE$1=\"Phantoms\",OFFSET(Phantoms!$L$2,ROW(AE22),16),IF($AE$1=\"Gators\",OFFSET(Gators!$L$2,ROW(AE22),16),IF($AE$1=\"Knights\",OFFSET(Knights!$L$2,ROW(AE22),16),IF($AE$1=\"Hornets\",OFFSET(Hornets!$L$2,ROW(AE22),16),IF($AE$1=\"Wolves\",OFFSET(Wolves!$L$2,ROW(AE22),16),IF($AE$1=\"Comets\",OFFSET(Comets!$L$2,ROW(AE22),16)))))))))","v":0}]
[{"$nulls":4},5,{"$f":"IF($F$1=\"Drillers\",OFFSET(Drillers!$L$2,ROW($F23),1),IF($F$1=\"Bulls\",OFFSET(Bulls!$L$2,ROW($F23),1),IF($F$1=\"Phantoms\",OFFSET(Phantoms!$L$2,ROW($F23),1),IF($F$1=\"Gators\",OFFSET(Gators!$L$2,ROW($F23),1),IF($F$1=\"Knights\",OFFSET(Knights!$L$2,ROW($F23),1),IF($F$1=\"Hornets\",OFFSET(Hornets!$L$2,ROW($F23),1),IF($F$1=\"Reds\",OFFSET(Comets!$L$2,ROW($F23),1),IF($F$1=\"Guardians\",OFFSET(Wolves!$L$2,ROW($F23),1)))))))))","v":"Serrano"},{"$f":"IF($F$1=\"Drillers\",OFFSET(Drillers!$L$2,ROW($F23),2),IF($F$1=\"Bulls\",OFFSET(Bulls!$L$2,ROW($F23),2),IF($F$1=\"Phantoms\",OFFSET(Phantoms!$L$2,ROW($F23),2),IF($F$1=\"Gators\",OFFSET(Gators!$L$2,ROW($F23),2),IF($F$1=\"Knights\",OFFSET(Knights!$L$2,ROW($F23),2),IF($F$1=\"Hornets\",OFFSET(Hornets!$L$2,ROW($F23),2),IF($F$1=\"Reds\",OFFSET(Comets!$L$2,ROW($F23),2),IF($F$1=\"Guardians\",OFFSET(Wolves!$L$2,ROW($F23),2)))))))))","v":"Jose"},{"$f":"IF($F$1=\"Drillers\",OFFSET(Drillers!$L$2,ROW($F23),3),IF($F$1=\"Bulls\",OFFSET(Bulls!$L$2,ROW($F23),3),IF($F$1=\"Phantoms\",OFFSET(Phantoms!$L$2,ROW($F23),3),IF($F$1=\"Gators\",OFFSET(Gators!$L$2,ROW($F23),3),IF($F$1=\"Knights\",OFFSET(Knights!$L$2,ROW($F23),3),IF($F$1=\"Hornets\",OFFSET(Hornets!$L$2,ROW($F23),3),IF($F$1=\"Guardians\",OFFSET(Wolves!$L$2,ROW($F23),3),IF($F$1=\"Reds\",OFFSET(Comets!$L$2,ROW($F23),3)))))))))","v":"R"},{"$f":"IF($F$1=\"Drillers\",OFFSET(Drillers!$L$2,ROW($F23),4),IF($F$1=\"Bulls\",OFFSET(Bulls!$L$2,ROW($F23),4),IF($F$1=\"Phantoms\",OFFSET(Phantoms!$L$2,ROW($F23),4),IF($F$1=\"Gators\",OFFSET(Gators!$L$2,ROW($F23),4),IF($F$1=\"Knights\",OFFSET(Knights!$L$2,ROW($F23),4),IF($F$1=\"Hornets\",OFFSET(Hornets!$L$2,ROW($F23),4),IF($F$1=\"Guardians\",OFFSET(Wolves!$L$2,ROW($F23),4),IF($F$1=\"Reds\",OFFSET(Comets!$L$2,ROW($F23),4)))))))))","v":-2},{"$f":"IF($F$1=\"Drillers\",OFFSET(Drillers!$L$2,ROW($F23),5),IF($F$1=\"Bulls\",OFFSET(Bulls!$L$2,ROW($F23),5),IF($F$1=\"Phantoms\",OFFSET(Phantoms!$L$2,ROW($F23),5),IF($F$1=\"Gators\",OFFSET(Gators!$L$2,ROW($F23),5),IF($F$1=\"Knights\",OFFSET(Knights!$L$2,ROW($F23),5),IF($F$1=\"Hornets\",OFFSET(Hornets!$L$2,ROW($F23),5),IF($F$1=\"Guardians\",OFFSET(Wolves!$L$2,ROW($F23),5),IF($F$1=\"Reds\",OFFSET(Comets!$L$2,ROW($F23),5)))))))))","v":-2},{"$f":"IF($F$1=\"Drillers\",OFFSET(Drillers!$L$2,ROW($F23),6),IF($F$1=\"Bulls\",OFFSET(Bulls!$L$2,ROW($F23),6),IF($F$1=\"Phantoms\",OFFSET(Phantoms!$L$2,ROW($F23),6),IF($F$1=\"Gators\",OFFSET(Gators!$L$2,ROW($F23),6),IF($F$1=\"Knights\",OFFSET(Knights!$L$2,ROW($F23),6),IF($F$1=\"Hornets\",OFFSET(Hornets!$L$2,ROW($F23),6),IF($F$1=\"Guardians\",OFFSET(Wolves!$L$2,ROW($F23),6),IF($F$1=\"Reds\",OFFSET(Comets!$L$2,ROW($F23),6)))))))))","v":5},{"$f":"IF($F$1=\"Drillers\",OFFSET(Drillers!$L$2,ROW(F23),7),IF($F$1=\"Bulls\",OFFSET(Bulls!$L$2,ROW(F23),7),IF($F$1=\"Phantoms\",OFFSET(Phantoms!$L$2,ROW(F23),7),IF($F$1=\"Gators\",OFFSET(Gators!$L$2,ROW(F23),7),IF($F$1=\"Knights\",OFFSET(Knights!$L$2,ROW(F23),7),IF($F$1=\"Hornets\",OFFSET(Hornets!$L$2,ROW(F23),7),IF($F$1=\"Guardians\",OFFSET(Wolves!$L$2,ROW(F23),7),IF($F$1=\"Reds\",OFFSET(Comets!$L$2,ROW(F23),7),))))))))","v":0},{"$f":"IF($F$1=\"Drillers\",OFFSET(Drillers!$L$2,ROW(F23),8),IF($F$1=\"Bulls\",OFFSET(Bulls!$L$2,ROW(F23),8),IF($F$1=\"Phantoms\",OFFSET(Phantoms!$L$2,ROW(F23),8),IF($F$1=\"Gators\",OFFSET(Gators!$L$2,ROW(F23),8),IF($F$1=\"Knights\",OFFSET(Knights!$L$2,ROW(F23),8),IF($F$1=\"Hornets\",OFFSET(Hornets!$L$2,ROW(F23),8),IF($F$1=\"Guardians\",OFFSET(Wolves!$L$2,ROW(F23),8),IF($F$1=\"Reds\",OFFSET(Comets!$L$2,ROW(F23),8)))))))))","v":0},{"$f":"IF($F$1=\"Drillers\",OFFSET(Drillers!$L$2,ROW($F23),9),IF($F$1=\"Bulls\",OFFSET(Bulls!$L$2,ROW($F23),9),IF($F$1=\"Phantoms\",OFFSET(Phantoms!$L$2,ROW($F23),9),IF($F$1=\"Gators\",OFFSET(Gators!$L$2,ROW($F23),9),IF($F$1=\"Knights\",OFFSET(Knights!$L$2,ROW($F23),9),IF($F$1=\"Hornets\",OFFSET(Hornets!$L$2,ROW(F23),9),IF($F$1=\"Guardians\",OFFSET(Wolves!$L$2,ROW($F23),9),IF($F$1=\"Reds\",OFFSET(Comets!$L$2,ROW($F23),9)))))))))","v":0},{"$f":"IF($F$1=\"Drillers\",OFFSET(Drillers!$L$2,ROW(F23),10),IF($F$1=\"Bulls\",OFFSET(Bulls!$L$2,ROW(F23),10),IF($F$1=\"Phantoms\",OFFSET(Phantoms!$L$2,ROW(F23),10),IF($F$1=\"Gators\",OFFSET(Gators!$L$2,ROW(F23),10),IF($F$1=\"Knights\",OFFSET(Knights!$L$2,ROW(F23),10),IF($F$1=\"Hornets\",OFFSET(Hornets!$L$2,ROW(F23),10),IF($F$1=\"Guardians\",OFFSET(Wolves!$L$2,ROW(F23),10),IF($F$1=\"Reds\",OFFSET(Comets!$L$2,ROW(F23),10)))))))))","v":0},{"$f":"IF($F$1=\"Drillers\",OFFSET(Drillers!$L$2,ROW(F23),11),IF($F$1=\"Bulls\",OFFSET(Bulls!$L$2,ROW(F23),11),IF($F$1=\"Phantoms\",OFFSET(Phantoms!$L$2,ROW(F23),11),IF($F$1=\"Gators\",OFFSET(Gators!$L$2,ROW(F23),11),IF($F$1=\"Knights\",OFFSET(Knights!$L$2,ROW(F23),11),IF($F$1=\"Hornets\",OFFSET(Hornets!$L$2,ROW(F23),11),IF($F$1=\"Guardians\",OFFSET(Wolves!$L$2,ROW(F23),11),IF($F$1=\"Drillers\",OFFSET(Drillers!$L$2,ROW(F23),11),IF($F$1=\"Reds\",OFFSET(Comets!$L$2,ROW(F23),11))))))))))","v":0},{"$f":"IF($F$1=\"Drillers\",OFFSET(Drillers!$L$2,ROW(F23),12),IF($F$1=\"Bulls\",OFFSET(Bulls!$L$2,ROW(F23),12),IF($F$1=\"Phantoms\",OFFSET(Phantoms!$L$2,ROW(F23),12),IF($F$1=\"Gators\",OFFSET(Gators!$L$2,ROW(F23),12),IF($F$1=\"Knights\",OFFSET(Knights!$L$2,ROW(F23),12),IF($F$1=\"Hornets\",OFFSET(Hornets!$L$2,ROW(F23),12),IF($F$1=\"Guardians\",OFFSET(Wolves!$L$2,ROW(F23),12),IF($F$1=\"Reds\",OFFSET(Comets!$L$2,ROW(F23),12),))))))))","v":0},{"$f":"IF($F$1=\"Drillers\",OFFSET(Drillers!$L$2,ROW(F23),13),IF($F$1=\"Bulls\",OFFSET(Bulls!$L$2,ROW(F23),13),IF($F$1=\"Phantoms\",OFFSET(Phantoms!$L$2,ROW(F23),13),IF($F$1=\"Gators\",OFFSET(Gators!$L$2,ROW(F23),13),IF($F$1=\"Knights\",OFFSET(Knights!$L$2,ROW(F23),13),IF($F$1=\"Hornets\",OFFSET(Hornets!$L$2,ROW(F23),13),IF($F$1=\"Guardians\",OFFSET(Wolves!$L$2,ROW(F23),13),IF($F$1=\"Reds\",OFFSET(Comets!$L$2,ROW(F23),13),))))))))","v":0},{"$f":"IF($F$1=\"Drillers\",OFFSET(Drillers!$L$2,ROW(F23),14),IF($F$1=\"Bulls\",OFFSET(Bulls!$L$2,ROW(F23),14),IF($F$1=\"Phantoms\",OFFSET(Phantoms!$L$2,ROW(F23),14),IF($F$1=\"Gators\",OFFSET(Gators!$L$2,ROW(F23),14),IF($F$1=\"Knights\",OFFSET(Knights!$L$2,ROW(F23),14),IF($F$1=\"Hornets\",OFFSET(Hornets!$L$2,ROW(F23),14),IF($F$1=\"Guardians\",OFFSET(Wolves!$L$2,ROW(F23),14,),IF($F$1=\"Reds\",OFFSET(Comets!$L$2,ROW(F23),14)))))))))","v":5},{"$f":"IF($F$1=\"Drillers\",OFFSET(Drillers!$L$2,ROW(F23),15),IF($F$1=\"Bulls\",OFFSET(Bulls!$L$2,ROW(F23),15),IF($F$1=\"Phantoms\",OFFSET(Phantoms!$L$2,ROW(F23),15),IF($F$1=\"Gators\",OFFSET(Gators!$L$2,ROW(F23),15),IF($F$1=\"Knights\",OFFSET(Knights!$L$2,ROW(F23),15),IF($F$1=\"Hornets\",OFFSET(Hornets!$L$2,ROW(F23),15),IF($F$1=\"Guardians\",OFFSET(Wolves!$L$2,ROW(F23),15),IF($F$1=\"Reds\",OFFSET(Comets!$L$2,ROW(F23),15)))))))))","v":0},{"$f":"IF($F$1=\"Drillers\",OFFSET(Drillers!$L$2,ROW(F23),16),IF($F$1=\"Bulls\",OFFSET(Bulls!$L$2,ROW(F23),16),IF($F$1=\"Phantoms\",OFFSET(Phantoms!$L$2,ROW(F23),16),IF($F$1=\"Gators\",OFFSET(Gators!$L$2,ROW(F23),16),IF($F$1=\"Knights\",OFFSET(Knights!$L$2,ROW(F23),16),IF($F$1=\"Hornets\",OFFSET(Hornets!$L$2,ROW(F23),16),IF($F$1=\"Guardians\",OFFSET(Wolves!$L$2,ROW(F23),16),IF($F$1=\"Reds\",OFFSET(Comets!$L$2,ROW(F23),16)))))))))","v":0},{"$nulls":8},5,{"$f":"IF($AE$1=\"Drillers\",OFFSET(Drillers!$L$2,ROW($AE23),1),IF($AE$1=\"Bulls\",OFFSET(Bulls!$L$2,ROW($AE23),1),IF($AE$1=\"Phantoms\",OFFSET(Phantoms!$L$2,ROW($AE23),1),IF($AE$1=\"Gators\",OFFSET(Gators!$L$2,ROW($AE23),1),IF($AE$1=\"Knights\",OFFSET(Knights!$L$2,ROW($AE23),1),IF($AE$1=\"Hornets\",OFFSET(Hornets!$L$2,ROW($AE23),1),IF($AE$1=\"Wolves\",OFFSET(Wolves!$L$2,ROW($AE23),1),IF(AE$1=\"Comets\",OFFSET(Comets!$L$2,ROW($AE23),1)))))))))","v":"Philips"},{"$f":"IF($AE$1=\"Drillers\",OFFSET(Drillers!$L$2,ROW($AF23),2),IF($AE$1=\"Bulls\",OFFSET(Bulls!$L$2,ROW($AF23),2),IF($AE$1=\"Phantoms\",OFFSET(Phantoms!$L$2,ROW($AF23),2),IF($AE$1=\"Gators\",OFFSET(Gators!$L$2,ROW($AF23),2),IF($AE$1=\"Knights\",OFFSET(Knights!$L$2,ROW($AF23),2),IF($AE$1=\"Hornets\",OFFSET(Hornets!$L$2,ROW($AF23),2),IF($AE$1=\"Wolves\",OFFSET(Wolves!$L$2,ROW($AF23),2),IF($AE$1=\"Comets\",OFFSET(Comets!$L$2,ROW($AF23),2)))))))))","v":"Julian"},{"$f":"IF($AE$1=\"Drillers\",OFFSET(Drillers!$L$2,ROW($AE23),3),IF($AE$1=\"Bulls\",OFFSET(Bulls!$L$2,ROW($AE23),3),IF($AE$1=\"Phantoms\",OFFSET(Phantoms!$L$2,ROW($AE23),3),IF($AE$1=\"Gators\",OFFSET(Gators!$L$2,ROW($AE23),3),IF($AE$1=\"Knights\",OFFSET(Knights!$L$2,ROW($AE23),3),IF($AE$1=\"Hornets\",OFFSET(Hornets!$L$2,ROW($AE23),3),IF($AE$1=\"Wolves\",OFFSET(Wolves!$L$2,ROW($AE23),3),IF($AE$1=\"Comets\",OFFSET(Comets!$L$2,ROW($AE23),3)))))))))","v":"L"},{"$f":"IF($AE$1=\"Drillers\",OFFSET(Drillers!$L$2,ROW($AE23),4),IF($AE$1=\"Bulls\",OFFSET(Bulls!$L$2,ROW($AE23),4),IF($AE$1=\"Phantoms\",OFFSET(Phantoms!$L$2,ROW($AE23),4),IF($AE$1=\"Gators\",OFFSET(Gators!$L$2,ROW($AE23),4),IF($AE$1=\"Knights\",OFFSET(Knights!$L$2,ROW($AE23),4),IF($AE$1=\"Hornets\",OFFSET(Hornets!$L$2,ROW($AE23),4),IF($AE$1=\"Wolves\",OFFSET(Wolves!$L$2,ROW($AE23),4),IF($AE$1=\"Comets\",OFFSET(Comets!$L$2,ROW($AE23),4)))))))))","v":-4},{"$f":"IF($AE$1=\"Drillers\",OFFSET(Drillers!$L$2,ROW($AE23),5),IF($AE$1=\"Bulls\",OFFSET(Bulls!$L$2,ROW($AE23),5),IF($AE$1=\"Phantoms\",OFFSET(Phantoms!$L$2,ROW($AE23),5),IF($AE$1=\"Gators\",OFFSET(Gators!$L$2,ROW($AE23),5),IF($AE$1=\"Knights\",OFFSET(Knights!$L$2,ROW($AE23),5),IF($AE$1=\"Hornets\",OFFSET(Hornets!$L$2,ROW($AE23),5),IF($AE$1=\"Wolves\",OFFSET(Wolves!$L$2,ROW($AE23),5),IF($AE$1=\"Comets\",OFFSET(Comets!$L$2,ROW($AE23),5)))))))))","v":-3},{"$f":"IF($AE$1=\"Drillers\",OFFSET(Drillers!$L$2,ROW($AE23),6),IF($AE$1=\"Bulls\",OFFSET(Bulls!$L$2,ROW($AE23),6),IF($AE$1=\"Phantoms\",OFFSET(Phantoms!$L$2,ROW($AE23),6),IF($AE$1=\"Gators\",OFFSET(Gators!$L$2,ROW($AE23),6),IF($AE$1=\"Knights\",OFFSET(Knights!$L$2,ROW($AE23),6),IF($AE$1=\"Hornets\",OFFSET(Hornets!$L$2,ROW($AE23),6),IF($AE$1=\"Wolves\",OFFSET(Wolves!$L$2,ROW($AE23),6),IF($AE$1=\"Comets\",OFFSET(Comets!$L$2,ROW($AE23),6)))))))))","v":5},{"$f":"IF($AE$1=\"Drillers\",OFFSET(Drillers!$L$2,ROW($AE23),7),IF($AE$1=\"Bulls\",OFFSET(Bulls!$L$2,ROW($AE23),7),IF($AE$1=\"Phantoms\",OFFSET(Phantoms!$L$2,ROW($AE23),7),IF($AE$1=\"Gators\",OFFSET(Gators!$L$2,ROW($AE23),7),IF($AE$1=\"Knights\",OFFSET(Knights!$L$2,ROW($AE23),7),IF($AE$1=\"Hornets\",OFFSET(Hornets!$L$2,ROW($AE23),7),IF($AE$1=\"Wolves\",OFFSET(Wolves!$L$2,ROW($AE23),7),IF($AE$1=\"Comets\",OFFSET(Comets!$L$2,ROW($AE23),7)))))))))","v":0},{"$f":"IF($AE$1=\"Drillers\",OFFSET(Drillers!$L$2,ROW($AE23),8),IF($AE$1=\"Bulls\",OFFSET(Bulls!$L$2,ROW($AE23),8),IF($AE$1=\"Phantoms\",OFFSET(Phantoms!$L$2,ROW($AE23),8),IF($AE$1=\"Gators\",OFFSET(Gators!$L$2,ROW($AE23),8),IF($AE$1=\"Knights\",OFFSET(Knights!$L$2,ROW($AE23),8),IF($AE$1=\"Hornets\",OFFSET(Hornets!$L$2,ROW($AE23),8),IF($AE$1=\"Wolves\",OFFSET(Wolves!$L$2,ROW($AE23),8),IF($AE$1=\"Comets\",OFFSET(Comets!$L$2,ROW($AE23),8)))))))))","v":0},{"$f":"IF($AE$1=\"Drillers\",OFFSET(Drillers!$L$2,ROW($AE23),9),IF($AE$1=\"Bulls\",OFFSET(Bulls!$L$2,ROW($AE23),9),IF($AE$1=\"Phantoms\",OFFSET(Phantoms!$L$2,ROW($AE23),9),IF($AE$1=\"Gators\",OFFSET(Gators!$L$2,ROW($AE23),9),IF($AE$1=\"Knights\",OFFSET(Knights!$L$2,ROW($AE23),9),IF($AE$1=\"Hornets\",OFFSET(Hornets!$L$2,ROW($AE23),9),IF($AE$1=\"Wolves\",OFFSET(Wolves!$L$2,ROW($AE23),9),IF($AE$1=\"Comets\",OFFSET(Comets!$L$2,ROW($AE23),9)))))))))","v":0},{"$f":"IF($AE$1=\"Drillers\",OFFSET(Drillers!$L$2,ROW($AE23),10),IF($AE$1=\"Bulls\",OFFSET(Bulls!$L$2,ROW($AE23),10),IF($AE$1=\"Phantoms\",OFFSET(Phantoms!$L$2,ROW($AE23),10),IF($AE$1=\"Gators\",OFFSET(Gators!$L$2,ROW($AE23),10),IF($AE$1=\"Knights\",OFFSET(Knights!$L$2,ROW($AE23),10),IF($AE$1=\"Hornets\",OFFSET(Hornets!$L$2,ROW($AE23),10),IF($AE$1=\"Wolves\",OFFSET(Wolves!$L$2,ROW($AE23),10),IF($AE$1=\"Comets\",OFFSET(Comets!$L$2,ROW($AE23),10)))))))))","v":0},{"$f":"IF($AE$1=\"Drillers\",OFFSET(Drillers!$L$2,ROW($AE23),11),IF($AE$1=\"Bulls\",OFFSET(Bulls!$L$2,ROW($AE23),11),IF($AE$1=\"Phantoms\",OFFSET(Phantoms!$L$2,ROW($AE23),11),IF($AE$1=\"Gators\",OFFSET(Gators!$L$2,ROW($AE23),11),IF($AE$1=\"Knights\",OFFSET(Knights!$L$2,ROW($AE23),11),IF($AE$1=\"Hornets\",OFFSET(Hornets!$L$2,ROW($AE23),11),IF($AE$1=\"Wolves\",OFFSET(Wolves!$L$2,ROW($AE23),11),IF($AE$1=\"Comets\",OFFSET(Comets!$L$2,ROW($AE23),11)))))))))","v":0},{"$f":"IF($AE$1=\"Drillers\",OFFSET(Drillers!$L$2,ROW($AE23),12),IF($AE$1=\"Bulls\",OFFSET(Bulls!$L$2,ROW($AE23),12),IF($AE$1=\"Phantoms\",OFFSET(Phantoms!$L$2,ROW($AE23),12),IF($AE$1=\"Gators\",OFFSET(Gators!$L$2,ROW($AE23),12),IF($AE$1=\"Knights\",OFFSET(Knights!$L$2,ROW($AE23),12),IF($AE$1=\"Hornets\",OFFSET(Hornets!$L$2,ROW($AE23),12),IF($AE$1=\"Wolves\",OFFSET(Wolves!$L$2,ROW($AE23),12),IF($AE$1=\"Comets\",OFFSET(Comets!$L$2,ROW($AE23),12)))))))))","v":0},{"$f":"IF($AE$1=\"Drillers\",OFFSET(Drillers!$L$2,ROW($AE23),13),IF($AE$1=\"Bulls\",OFFSET(Bulls!$L$2,ROW($AE23),13),IF($AE$1=\"Phantoms\",OFFSET(Phantoms!$L$2,ROW($AE23),13),IF($AE$1=\"Gators\",OFFSET(Gators!$L$2,ROW($AE23),13),IF($AE$1=\"Knights\",OFFSET(Knights!$L$2,ROW($AE23),13),IF($AE$1=\"Hornets\",OFFSET(Hornets!$L$2,ROW($AE23),13),IF($AE$1=\"Wolves\",OFFSET(Wolves!$L$2,ROW($AE23),13),IF($AE$1=\"Comets\",OFFSET(Comets!$L$2,ROW($AE23),13)))))))))","v":0},{"$f":"IF($AE$1=\"Drillers\",OFFSET(Drillers!$L$2,ROW($AE23),14),IF($AE$1=\"Bulls\",OFFSET(Bulls!$L$2,ROW($AE23),14),IF($AE$1=\"Phantoms\",OFFSET(Phantoms!$L$2,ROW($AE23),14),IF($AE$1=\"Gators\",OFFSET(Gators!$L$2,ROW($AE23),14),IF($AE$1=\"Knights\",OFFSET(Knights!$L$2,ROW($AE23),14),IF($AE$1=\"Hornets\",OFFSET(Hornets!$L$2,ROW($AE23),14),IF($AE$1=\"Wolves\",OFFSET(Wolves!$L$2,ROW($AE23),14),IF($AE$1=\"Comets\",OFFSET(Comets!$L$2,ROW($AE23),14)))))))))","v":2},{"$f":"IF(AE$1=\"Drillers\",OFFSET(Drillers!$L$2,ROW(AE23),15),IF(AE$1=\"Bulls\",OFFSET(Bulls!$L$2,ROW(AE23),15),IF(AE$1=\"Phantoms\",OFFSET(Phantoms!$L$2,ROW(AE23),15),IF(AE$1=\"Gators\",OFFSET(Gators!$L$2,ROW(AE23),15),IF(AE$1=\"Knights\",OFFSET(Knights!$L$2,ROW(AE23),15),IF(AE$1=\"Hornets\",OFFSET(Hornets!$L$2,ROW(AE23),15),IF(AE$1=\"Wolves\",OFFSET(Wolves!$L$2,ROW(AE23),15),IF(AE$1=\"Comets\",OFFSET(Comets!$L$2,ROW(AE23),15)))))))))","v":0},{"$f":"IF($AE$1=\"Drillers\",OFFSET(Drillers!$L$2,ROW(AE23),16),IF($AE$1=\"Bulls\",OFFSET(Bulls!$L$2,ROW(AE23),16),IF($AE$1=\"Phantoms\",OFFSET(Phantoms!$L$2,ROW(AE23),16),IF($AE$1=\"Gators\",OFFSET(Gators!$L$2,ROW(AE23),16),IF($AE$1=\"Knights\",OFFSET(Knights!$L$2,ROW(AE23),16),IF($AE$1=\"Hornets\",OFFSET(Hornets!$L$2,ROW(AE23),16),IF($AE$1=\"Wolves\",OFFSET(Wolves!$L$2,ROW(AE23),16),IF($AE$1=\"Comets\",OFFSET(Comets!$L$2,ROW(AE23),16)))))))))","v":0}]
[{"$nulls":4},6,{"$f":"IF($F$1=\"Drillers\",OFFSET(Drillers!$L$2,ROW($F24),1),IF($F$1=\"Bulls\",OFFSET(Bulls!$L$2,ROW($F24),1),IF($F$1=\"Phantoms\",OFFSET(Phantoms!$L$2,ROW($F24),1),IF($F$1=\"Gators\",OFFSET(Gators!$L$2,ROW($F24),1),IF($F$1=\"Knights\",OFFSET(Knights!$L$2,ROW($F24),1),IF($F$1=\"Hornets\",OFFSET(Hornets!$L$2,ROW($F24),1),IF($F$1=\"Reds\",OFFSET(Comets!$L$2,ROW($F24),1),IF($F$1=\"Guardians\",OFFSET(Wolves!$L$2,ROW($F24),1)))))))))","v":"Garcim"},{"$f":"IF($F$1=\"Drillers\",OFFSET(Drillers!$L$2,ROW($F24),2),IF($F$1=\"Bulls\",OFFSET(Bulls!$L$2,ROW($F24),2),IF($F$1=\"Phantoms\",OFFSET(Phantoms!$L$2,ROW($F24),2),IF($F$1=\"Gators\",OFFSET(Gators!$L$2,ROW($F24),2),IF($F$1=\"Knights\",OFFSET(Knights!$L$2,ROW($F24),2),IF($F$1=\"Hornets\",OFFSET(Hornets!$L$2,ROW($F24),2),IF($F$1=\"Reds\",OFFSET(Comets!$L$2,ROW($F24),2),IF($F$1=\"Guardians\",OFFSET(Wolves!$L$2,ROW($F24),2)))))))))","v":"Tony"},{"$f":"IF($F$1=\"Drillers\",OFFSET(Drillers!$L$2,ROW($F24),3),IF($F$1=\"Bulls\",OFFSET(Bulls!$L$2,ROW($F24),3),IF($F$1=\"Phantoms\",OFFSET(Phantoms!$L$2,ROW($F24),3),IF($F$1=\"Gators\",OFFSET(Gators!$L$2,ROW($F24),3),IF($F$1=\"Knights\",OFFSET(Knights!$L$2,ROW($F24),3),IF($F$1=\"Hornets\",OFFSET(Hornets!$L$2,ROW($F24),3),IF($F$1=\"Guardians\",OFFSET(Wolves!$L$2,ROW($F24),3),IF($F$1=\"Reds\",OFFSET(Comets!$L$2,ROW($F24),3)))))))))","v":"L"},{"$f":"IF($F$1=\"Drillers\",OFFSET(Drillers!$L$2,ROW($F24),4),IF($F$1=\"Bulls\",OFFSET(Bulls!$L$2,ROW($F24),4),IF($F$1=\"Phantoms\",OFFSET(Phantoms!$L$2,ROW($F24),4),IF($F$1=\"Gators\",OFFSET(Gators!$L$2,ROW($F24),4),IF($F$1=\"Knights\",OFFSET(Knights!$L$2,ROW($F24),4),IF($F$1=\"Hornets\",OFFSET(Hornets!$L$2,ROW($F24),4),IF($F$1=\"Guardians\",OFFSET(Wolves!$L$2,ROW($F24),4),IF($F$1=\"Reds\",OFFSET(Comets!$L$2,ROW($F24),4)))))))))","v":-4},{"$f":"IF($F$1=\"Drillers\",OFFSET(Drillers!$L$2,ROW($F24),5),IF($F$1=\"Bulls\",OFFSET(Bulls!$L$2,ROW($F24),5),IF($F$1=\"Phantoms\",OFFSET(Phantoms!$L$2,ROW($F24),5),IF($F$1=\"Gators\",OFFSET(Gators!$L$2,ROW($F24),5),IF($F$1=\"Knights\",OFFSET(Knights!$L$2,ROW($F24),5),IF($F$1=\"Hornets\",OFFSET(Hornets!$L$2,ROW($F24),5),IF($F$1=\"Guardians\",OFFSET(Wolves!$L$2,ROW($F24),5),IF($F$1=\"Reds\",OFFSET(Comets!$L$2,ROW($F24),5)))))))))","v":-3},{"$f":"IF($F$1=\"Drillers\",OFFSET(Drillers!$L$2,ROW($F24),6),IF($F$1=\"Bulls\",OFFSET(Bulls!$L$2,ROW($F24),6),IF($F$1=\"Phantoms\",OFFSET(Phantoms!$L$2,ROW($F24),6),IF($F$1=\"Gators\",OFFSET(Gators!$L$2,ROW($F24),6),IF($F$1=\"Knights\",OFFSET(Knights!$L$2,ROW($F24),6),IF($F$1=\"Hornets\",OFFSET(Hornets!$L$2,ROW($F24),6),IF($F$1=\"Guardians\",OFFSET(Wolves!$L$2,ROW($F24),6),IF($F$1=\"Reds\",OFFSET(Comets!$L$2,ROW($F24),6)))))))))","v":1},{"$f":"IF($F$1=\"Drillers\",OFFSET(Drillers!$L$2,ROW(F24),7),IF($F$1=\"Bulls\",OFFSET(Bulls!$L$2,ROW(F24),7),IF($F$1=\"Phantoms\",OFFSET(Phantoms!$L$2,ROW(F24),7),IF($F$1=\"Gators\",OFFSET(Gators!$L$2,ROW(F24),7),IF($F$1=\"Knights\",OFFSET(Knights!$L$2,ROW(F24),7),IF($F$1=\"Hornets\",OFFSET(Hornets!$L$2,ROW(F24),7),IF($F$1=\"Guardians\",OFFSET(Wolves!$L$2,ROW(F24),7),IF($F$1=\"Reds\",OFFSET(Comets!$L$2,ROW(F24),7),))))))))","v":0},{"$f":"IF($F$1=\"Drillers\",OFFSET(Drillers!$L$2,ROW(F24),8),IF($F$1=\"Bulls\",OFFSET(Bulls!$L$2,ROW(F24),8),IF($F$1=\"Phantoms\",OFFSET(Phantoms!$L$2,ROW(F24),8),IF($F$1=\"Gators\",OFFSET(Gators!$L$2,ROW(F24),8),IF($F$1=\"Knights\",OFFSET(Knights!$L$2,ROW(F24),8),IF($F$1=\"Hornets\",OFFSET(Hornets!$L$2,ROW(F24),8),IF($F$1=\"Guardians\",OFFSET(Wolves!$L$2,ROW(F24),8),IF($F$1=\"Reds\",OFFSET(Comets!$L$2,ROW(F24),8)))))))))","v":0},{"$f":"IF($F$1=\"Drillers\",OFFSET(Drillers!$L$2,ROW($F24),9),IF($F$1=\"Bulls\",OFFSET(Bulls!$L$2,ROW($F24),9),IF($F$1=\"Phantoms\",OFFSET(Phantoms!$L$2,ROW($F24),9),IF($F$1=\"Gators\",OFFSET(Gators!$L$2,ROW($F24),9),IF($F$1=\"Knights\",OFFSET(Knights!$L$2,ROW($F24),9),IF($F$1=\"Hornets\",OFFSET(Hornets!$L$2,ROW(F24),9),IF($F$1=\"Guardians\",OFFSET(Wolves!$L$2,ROW($F24),9),IF($F$1=\"Reds\",OFFSET(Comets!$L$2,ROW($F24),9)))))))))","v":0},{"$f":"IF($F$1=\"Drillers\",OFFSET(Drillers!$L$2,ROW(F24),10),IF($F$1=\"Bulls\",OFFSET(Bulls!$L$2,ROW(F24),10),IF($F$1=\"Phantoms\",OFFSET(Phantoms!$L$2,ROW(F24),10),IF($F$1=\"Gators\",OFFSET(Gators!$L$2,ROW(F24),10),IF($F$1=\"Knights\",OFFSET(Knights!$L$2,ROW(F24),10),IF($F$1=\"Hornets\",OFFSET(Hornets!$L$2,ROW(F24),10),IF($F$1=\"Guardians\",OFFSET(Wolves!$L$2,ROW(F24),10),IF($F$1=\"Reds\",OFFSET(Comets!$L$2,ROW(F24),10)))))))))","v":0},{"$f":"IF($F$1=\"Drillers\",OFFSET(Drillers!$L$2,ROW(F24),11),IF($F$1=\"Bulls\",OFFSET(Bulls!$L$2,ROW(F24),11),IF($F$1=\"Phantoms\",OFFSET(Phantoms!$L$2,ROW(F24),11),IF($F$1=\"Gators\",OFFSET(Gators!$L$2,ROW(F24),11),IF($F$1=\"Knights\",OFFSET(Knights!$L$2,ROW(F24),11),IF($F$1=\"Hornets\",OFFSET(Hornets!$L$2,ROW(F24),11),IF($F$1=\"Guardians\",OFFSET(Wolves!$L$2,ROW(F24),11),IF($F$1=\"Drillers\",OFFSET(Drillers!$L$2,ROW(F24),11),IF($F$1=\"Reds\",OFFSET(Comets!$L$2,ROW(F24),11))))))))))","v":0},{"$f":"IF($F$1=\"Drillers\",OFFSET(Drillers!$L$2,ROW(F24),12),IF($F$1=\"Bulls\",OFFSET(Bulls!$L$2,ROW(F24),12),IF($F$1=\"Phantoms\",OFFSET(Phantoms!$L$2,ROW(F24),12),IF($F$1=\"Gators\",OFFSET(Gators!$L$2,ROW(F24),12),IF($F$1=\"Knights\",OFFSET(Knights!$L$2,ROW(F24),12),IF($F$1=\"Hornets\",OFFSET(Hornets!$L$2,ROW(F24),12),IF($F$1=\"Guardians\",OFFSET(Wolves!$L$2,ROW(F24),12),IF($F$1=\"Reds\",OFFSET(Comets!$L$2,ROW(F24),12),))))))))","v":0},{"$f":"IF($F$1=\"Drillers\",OFFSET(Drillers!$L$2,ROW(F24),13),IF($F$1=\"Bulls\",OFFSET(Bulls!$L$2,ROW(F24),13),IF($F$1=\"Phantoms\",OFFSET(Phantoms!$L$2,ROW(F24),13),IF($F$1=\"Gators\",OFFSET(Gators!$L$2,ROW(F24),13),IF($F$1=\"Knights\",OFFSET(Knights!$L$2,ROW(F24),13),IF($F$1=\"Hornets\",OFFSET(Hornets!$L$2,ROW(F24),13),IF($F$1=\"Guardians\",OFFSET(Wolves!$L$2,ROW(F24),13),IF($F$1=\"Reds\",OFFSET(Comets!$L$2,ROW(F24),13),))))))))","v":0},{"$f":"IF($F$1=\"Drillers\",OFFSET(Drillers!$L$2,ROW(F24),14),IF($F$1=\"Bulls\",OFFSET(Bulls!$L$2,ROW(F24),14),IF($F$1=\"Phantoms\",OFFSET(Phantoms!$L$2,ROW(F24),14),IF($F$1=\"Gators\",OFFSET(Gators!$L$2,ROW(F24),14),IF($F$1=\"Knights\",OFFSET(Knights!$L$2,ROW(F24),14),IF($F$1=\"Hornets\",OFFSET(Hornets!$L$2,ROW(F24),14),IF($F$1=\"Guardians\",OFFSET(Wolves!$L$2,ROW(F24),14,),IF($F$1=\"Reds\",OFFSET(Comets!$L$2,ROW(F24),14)))))))))","v":5},{"$f":"IF($F$1=\"Drillers\",OFFSET(Drillers!$L$2,ROW(F24),15),IF($F$1=\"Bulls\",OFFSET(Bulls!$L$2,ROW(F24),15),IF($F$1=\"Phantoms\",OFFSET(Phantoms!$L$2,ROW(F24),15),IF($F$1=\"Gators\",OFFSET(Gators!$L$2,ROW(F24),15),IF($F$1=\"Knights\",OFFSET(Knights!$L$2,ROW(F24),15),IF($F$1=\"Hornets\",OFFSET(Hornets!$L$2,ROW(F24),15),IF($F$1=\"Guardians\",OFFSET(Wolves!$L$2,ROW(F24),15),IF($F$1=\"Reds\",OFFSET(Comets!$L$2,ROW(F24),15)))))))))","v":0},{"$f":"IF($F$1=\"Drillers\",OFFSET(Drillers!$L$2,ROW(F24),16),IF($F$1=\"Bulls\",OFFSET(Bulls!$L$2,ROW(F24),16),IF($F$1=\"Phantoms\",OFFSET(Phantoms!$L$2,ROW(F24),16),IF($F$1=\"Gators\",OFFSET(Gators!$L$2,ROW(F24),16),IF($F$1=\"Knights\",OFFSET(Knights!$L$2,ROW(F24),16),IF($F$1=\"Hornets\",OFFSET(Hornets!$L$2,ROW(F24),16),IF($F$1=\"Guardians\",OFFSET(Wolves!$L$2,ROW(F24),16),IF($F$1=\"Reds\",OFFSET(Comets!$L$2,ROW(F24),16)))))))))","v":0},{"$nulls":8},6,{"$f":"IF($AE$1=\"Drillers\",OFFSET(Drillers!$L$2,ROW($AE24),1),IF($AE$1=\"Bulls\",OFFSET(Bulls!$L$2,ROW($AE24),1),IF($AE$1=\"Phantoms\",OFFSET(Phantoms!$L$2,ROW($AE24),1),IF($AE$1=\"Gators\",OFFSET(Gators!$L$2,ROW($AE24),1),IF($AE$1=\"Knights\",OFFSET(Knights!$L$2,ROW($AE24),1),IF($AE$1=\"Hornets\",OFFSET(Hornets!$L$2,ROW($AE24),1),IF($AE$1=\"Wolves\",OFFSET(Wolves!$L$2,ROW($AE24),1),IF(AE$1=\"Comets\",OFFSET(Comets!$L$2,ROW($AE24),1)))))))))","v":"Samuels"},{"$f":"IF($AE$1=\"Drillers\",OFFSET(Drillers!$L$2,ROW($AF24),2),IF($AE$1=\"Bulls\",OFFSET(Bulls!$L$2,ROW($AF24),2),IF($AE$1=\"Phantoms\",OFFSET(Phantoms!$L$2,ROW($AF24),2),IF($AE$1=\"Gators\",OFFSET(Gators!$L$2,ROW($AF24),2),IF($AE$1=\"Knights\",OFFSET(Knights!$L$2,ROW($AF24),2),IF($AE$1=\"Hornets\",OFFSET(Hornets!$L$2,ROW($AF24),2),IF($AE$1=\"Wolves\",OFFSET(Wolves!$L$2,ROW($AF24),2),IF($AE$1=\"Comets\",OFFSET(Comets!$L$2,ROW($AF24),2)))))))))","v":"Keith"},{"$f":"IF($AE$1=\"Drillers\",OFFSET(Drillers!$L$2,ROW($AE24),3),IF($AE$1=\"Bulls\",OFFSET(Bulls!$L$2,ROW($AE24),3),IF($AE$1=\"Phantoms\",OFFSET(Phantoms!$L$2,ROW($AE24),3),IF($AE$1=\"Gators\",OFFSET(Gators!$L$2,ROW($AE24),3),IF($AE$1=\"Knights\",OFFSET(Knights!$L$2,ROW($AE24),3),IF($AE$1=\"Hornets\",OFFSET(Hornets!$L$2,ROW($AE24),3),IF($AE$1=\"Wolves\",OFFSET(Wolves!$L$2,ROW($AE24),3),IF($AE$1=\"Comets\",OFFSET(Comets!$L$2,ROW($AE24),3)))))))))","v":"L"},{"$f":"IF($AE$1=\"Drillers\",OFFSET(Drillers!$L$2,ROW($AE24),4),IF($AE$1=\"Bulls\",OFFSET(Bulls!$L$2,ROW($AE24),4),IF($AE$1=\"Phantoms\",OFFSET(Phantoms!$L$2,ROW($AE24),4),IF($AE$1=\"Gators\",OFFSET(Gators!$L$2,ROW($AE24),4),IF($AE$1=\"Knights\",OFFSET(Knights!$L$2,ROW($AE24),4),IF($AE$1=\"Hornets\",OFFSET(Hornets!$L$2,ROW($AE24),4),IF($AE$1=\"Wolves\",OFFSET(Wolves!$L$2,ROW($AE24),4),IF($AE$1=\"Comets\",OFFSET(Comets!$L$2,ROW($AE24),4)))))))))","v":-5},{"$f":"IF($AE$1=\"Drillers\",OFFSET(Drillers!$L$2,ROW($AE24),5),IF($AE$1=\"Bulls\",OFFSET(Bulls!$L$2,ROW($AE24),5),IF($AE$1=\"Phantoms\",OFFSET(Phantoms!$L$2,ROW($AE24),5),IF($AE$1=\"Gators\",OFFSET(Gators!$L$2,ROW($AE24),5),IF($AE$1=\"Knights\",OFFSET(Knights!$L$2,ROW($AE24),5),IF($AE$1=\"Hornets\",OFFSET(Hornets!$L$2,ROW($AE24),5),IF($AE$1=\"Wolves\",OFFSET(Wolves!$L$2,ROW($AE24),5),IF($AE$1=\"Comets\",OFFSET(Comets!$L$2,ROW($AE24),5)))))))))","v":-4},{"$f":"IF($AE$1=\"Drillers\",OFFSET(Drillers!$L$2,ROW($AE24),6),IF($AE$1=\"Bulls\",OFFSET(Bulls!$L$2,ROW($AE24),6),IF($AE$1=\"Phantoms\",OFFSET(Phantoms!$L$2,ROW($AE24),6),IF($AE$1=\"Gators\",OFFSET(Gators!$L$2,ROW($AE24),6),IF($AE$1=\"Knights\",OFFSET(Knights!$L$2,ROW($AE24),6),IF($AE$1=\"Hornets\",OFFSET(Hornets!$L$2,ROW($AE24),6),IF($AE$1=\"Wolves\",OFFSET(Wolves!$L$2,ROW($AE24),6),IF($AE$1=\"Comets\",OFFSET(Comets!$L$2,ROW($AE24),6)))))))))","v":1},{"$f":"IF($AE$1=\"Drillers\",OFFSET(Drillers!$L$2,ROW($AE24),7),IF($AE$1=\"Bulls\",OFFSET(Bulls!$L$2,ROW($AE24),7),IF($AE$1=\"Phantoms\",OFFSET(Phantoms!$L$2,ROW($AE24),7),IF($AE$1=\"Gators\",OFFSET(Gators!$L$2,ROW($AE24),7),IF($AE$1=\"Knights\",OFFSET(Knights!$L$2,ROW($AE24),7),IF($AE$1=\"Hornets\",OFFSET(Hornets!$L$2,ROW($AE24),7),IF($AE$1=\"Wolves\",OFFSET(Wolves!$L$2,ROW($AE24),7),IF($AE$1=\"Comets\",OFFSET(Comets!$L$2,ROW($AE24),7)))))))))","v":0},{"$f":"IF($AE$1=\"Drillers\",OFFSET(Drillers!$L$2,ROW($AE24),8),IF($AE$1=\"Bulls\",OFFSET(Bulls!$L$2,ROW($AE24),8),IF($AE$1=\"Phantoms\",OFFSET(Phantoms!$L$2,ROW($AE24),8),IF($AE$1=\"Gators\",OFFSET(Gators!$L$2,ROW($AE24),8),IF($AE$1=\"Knights\",OFFSET(Knights!$L$2,ROW($AE24),8),IF($AE$1=\"Hornets\",OFFSET(Hornets!$L$2,ROW($AE24),8),IF($AE$1=\"Wolves\",OFFSET(Wolves!$L$2,ROW($AE24),8),IF($AE$1=\"Comets\",OFFSET(Comets!$L$2,ROW($AE24),8)))))))))","v":0},{"$f":"IF($AE$1=\"Drillers\",OFFSET(Drillers!$L$2,ROW($AE24),9),IF($AE$1=\"Bulls\",OFFSET(Bulls!$L$2,ROW($AE24),9),IF($AE$1=\"Phantoms\",OFFSET(Phantoms!$L$2,ROW($AE24),9),IF($AE$1=\"Gators\",OFFSET(Gators!$L$2,ROW($AE24),9),IF($AE$1=\"Knights\",OFFSET(Knights!$L$2,ROW($AE24),9),IF($AE$1=\"Hornets\",OFFSET(Hornets!$L$2,ROW($AE24),9),IF($AE$1=\"Wolves\",OFFSET(Wolves!$L$2,ROW($AE24),9),IF($AE$1=\"Comets\",OFFSET(Comets!$L$2,ROW($AE24),9)))))))))","v":0},{"$f":"IF($AE$1=\"Drillers\",OFFSET(Drillers!$L$2,ROW($AE24),10),IF($AE$1=\"Bulls\",OFFSET(Bulls!$L$2,ROW($AE24),10),IF($AE$1=\"Phantoms\",OFFSET(Phantoms!$L$2,ROW($AE24),10),IF($AE$1=\"Gators\",OFFSET(Gators!$L$2,ROW($AE24),10),IF($AE$1=\"Knights\",OFFSET(Knights!$L$2,ROW($AE24),10),IF($AE$1=\"Hornets\",OFFSET(Hornets!$L$2,ROW($AE24),10),IF($AE$1=\"Wolves\",OFFSET(Wolves!$L$2,ROW($AE24),10),IF($AE$1=\"Comets\",OFFSET(Comets!$L$2,ROW($AE24),10)))))))))","v":0},{"$f":"IF($AE$1=\"Drillers\",OFFSET(Drillers!$L$2,ROW($AE24),11),IF($AE$1=\"Bulls\",OFFSET(Bulls!$L$2,ROW($AE24),11),IF($AE$1=\"Phantoms\",OFFSET(Phantoms!$L$2,ROW($AE24),11),IF($AE$1=\"Gators\",OFFSET(Gators!$L$2,ROW($AE24),11),IF($AE$1=\"Knights\",OFFSET(Knights!$L$2,ROW($AE24),11),IF($AE$1=\"Hornets\",OFFSET(Hornets!$L$2,ROW($AE24),11),IF($AE$1=\"Wolves\",OFFSET(Wolves!$L$2,ROW($AE24),11),IF($AE$1=\"Comets\",OFFSET(Comets!$L$2,ROW($AE24),11)))))))))","v":0},{"$f":"IF($AE$1=\"Drillers\",OFFSET(Drillers!$L$2,ROW($AE24),12),IF($AE$1=\"Bulls\",OFFSET(Bulls!$L$2,ROW($AE24),12),IF($AE$1=\"Phantoms\",OFFSET(Phantoms!$L$2,ROW($AE24),12),IF($AE$1=\"Gators\",OFFSET(Gators!$L$2,ROW($AE24),12),IF($AE$1=\"Knights\",OFFSET(Knights!$L$2,ROW($AE24),12),IF($AE$1=\"Hornets\",OFFSET(Hornets!$L$2,ROW($AE24),12),IF($AE$1=\"Wolves\",OFFSET(Wolves!$L$2,ROW($AE24),12),IF($AE$1=\"Comets\",OFFSET(Comets!$L$2,ROW($AE24),12)))))))))","v":0},{"$f":"IF($AE$1=\"Drillers\",OFFSET(Drillers!$L$2,ROW($AE24),13),IF($AE$1=\"Bulls\",OFFSET(Bulls!$L$2,ROW($AE24),13),IF($AE$1=\"Phantoms\",OFFSET(Phantoms!$L$2,ROW($AE24),13),IF($AE$1=\"Gators\",OFFSET(Gators!$L$2,ROW($AE24),13),IF($AE$1=\"Knights\",OFFSET(Knights!$L$2,ROW($AE24),13),IF($AE$1=\"Hornets\",OFFSET(Hornets!$L$2,ROW($AE24),13),IF($AE$1=\"Wolves\",OFFSET(Wolves!$L$2,ROW($AE24),13),IF($AE$1=\"Comets\",OFFSET(Comets!$L$2,ROW($AE24),13)))))))))","v":0},{"$f":"IF($AE$1=\"Drillers\",OFFSET(Drillers!$L$2,ROW($AE24),14),IF($AE$1=\"Bulls\",OFFSET(Bulls!$L$2,ROW($AE24),14),IF($AE$1=\"Phantoms\",OFFSET(Phantoms!$L$2,ROW($AE24),14),IF($AE$1=\"Gators\",OFFSET(Gators!$L$2,ROW($AE24),14),IF($AE$1=\"Knights\",OFFSET(Knights!$L$2,ROW($AE24),14),IF($AE$1=\"Hornets\",OFFSET(Hornets!$L$2,ROW($AE24),14),IF($AE$1=\"Wolves\",OFFSET(Wolves!$L$2,ROW($AE24),14),IF($AE$1=\"Comets\",OFFSET(Comets!$L$2,ROW($AE24),14)))))))))","v":4},{"$f":"IF(AE$1=\"Drillers\",OFFSET(Drillers!$L$2,ROW(AE24),15),IF(AE$1=\"Bulls\",OFFSET(Bulls!$L$2,ROW(AE24),15),IF(AE$1=\"Phantoms\",OFFSET(Phantoms!$L$2,ROW(AE24),15),IF(AE$1=\"Gators\",OFFSET(Gators!$L$2,ROW(AE24),15),IF(AE$1=\"Knights\",OFFSET(Knights!$L$2,ROW(AE24),15),IF(AE$1=\"Hornets\",OFFSET(Hornets!$L$2,ROW(AE24),15),IF(AE$1=\"Wolves\",OFFSET(Wolves!$L$2,ROW(AE24),15),IF(AE$1=\"Comets\",OFFSET(Comets!$L$2,ROW(AE24),15)))))))))","v":0},{"$f":"IF($AE$1=\"Drillers\",OFFSET(Drillers!$L$2,ROW(AE24),16),IF($AE$1=\"Bulls\",OFFSET(Bulls!$L$2,ROW(AE24),16),IF($AE$1=\"Phantoms\",OFFSET(Phantoms!$L$2,ROW(AE24),16),IF($AE$1=\"Gators\",OFFSET(Gators!$L$2,ROW(AE24),16),IF($AE$1=\"Knights\",OFFSET(Knights!$L$2,ROW(AE24),16),IF($AE$1=\"Hornets\",OFFSET(Hornets!$L$2,ROW(AE24),16),IF($AE$1=\"Wolves\",OFFSET(Wolves!$L$2,ROW(AE24),16),IF($AE$1=\"Comets\",OFFSET(Comets!$L$2,ROW(AE24),16)))))))))","v":0}]
[{"$nulls":4},7,{"$f":"IF($F$1=\"Drillers\",OFFSET(Drillers!$L$2,ROW($F25),1),IF($F$1=\"Bulls\",OFFSET(Bulls!$L$2,ROW($F25),1),IF($F$1=\"Phantoms\",OFFSET(Phantoms!$L$2,ROW($F25),1),IF($F$1=\"Gators\",OFFSET(Gators!$L$2,ROW($F25),1),IF($F$1=\"Knights\",OFFSET(Knights!$L$2,ROW($F25),1),IF($F$1=\"Hornets\",OFFSET(Hornets!$L$2,ROW($F25),1),IF($F$1=\"Reds\",OFFSET(Comets!$L$2,ROW($F25),1),IF($F$1=\"Guardians\",OFFSET(Wolves!$L$2,ROW($F25),1)))))))))","v":"Kelley"},{"$f":"IF($F$1=\"Drillers\",OFFSET(Drillers!$L$2,ROW($F25),2),IF($F$1=\"Bulls\",OFFSET(Bulls!$L$2,ROW($F25),2),IF($F$1=\"Phantoms\",OFFSET(Phantoms!$L$2,ROW($F25),2),IF($F$1=\"Gators\",OFFSET(Gators!$L$2,ROW($F25),2),IF($F$1=\"Knights\",OFFSET(Knights!$L$2,ROW($F25),2),IF($F$1=\"Hornets\",OFFSET(Hornets!$L$2,ROW($F25),2),IF($F$1=\"Reds\",OFFSET(Comets!$L$2,ROW($F25),2),IF($F$1=\"Guardians\",OFFSET(Wolves!$L$2,ROW($F25),2)))))))))","v":"John"},{"$f":"IF($F$1=\"Drillers\",OFFSET(Drillers!$L$2,ROW($F25),3),IF($F$1=\"Bulls\",OFFSET(Bulls!$L$2,ROW($F25),3),IF($F$1=\"Phantoms\",OFFSET(Phantoms!$L$2,ROW($F25),3),IF($F$1=\"Gators\",OFFSET(Gators!$L$2,ROW($F25),3),IF($F$1=\"Knights\",OFFSET(Knights!$L$2,ROW($F25),3),IF($F$1=\"Hornets\",OFFSET(Hornets!$L$2,ROW($F25),3),IF($F$1=\"Guardians\",OFFSET(Wolves!$L$2,ROW($F25),3),IF($F$1=\"Reds\",OFFSET(Comets!$L$2,ROW($F25),3)))))))))","v":"R"},{"$f":"IF($F$1=\"Drillers\",OFFSET(Drillers!$L$2,ROW($F25),4),IF($F$1=\"Bulls\",OFFSET(Bulls!$L$2,ROW($F25),4),IF($F$1=\"Phantoms\",OFFSET(Phantoms!$L$2,ROW($F25),4),IF($F$1=\"Gators\",OFFSET(Gators!$L$2,ROW($F25),4),IF($F$1=\"Knights\",OFFSET(Knights!$L$2,ROW($F25),4),IF($F$1=\"Hornets\",OFFSET(Hornets!$L$2,ROW($F25),4),IF($F$1=\"Guardians\",OFFSET(Wolves!$L$2,ROW($F25),4),IF($F$1=\"Reds\",OFFSET(Comets!$L$2,ROW($F25),4)))))))))","v":-3},{"$f":"IF($F$1=\"Drillers\",OFFSET(Drillers!$L$2,ROW($F25),5),IF($F$1=\"Bulls\",OFFSET(Bulls!$L$2,ROW($F25),5),IF($F$1=\"Phantoms\",OFFSET(Phantoms!$L$2,ROW($F25),5),IF($F$1=\"Gators\",OFFSET(Gators!$L$2,ROW($F25),5),IF($F$1=\"Knights\",OFFSET(Knights!$L$2,ROW($F25),5),IF($F$1=\"Hornets\",OFFSET(Hornets!$L$2,ROW($F25),5),IF($F$1=\"Guardians\",OFFSET(Wolves!$L$2,ROW($F25),5),IF($F$1=\"Reds\",OFFSET(Comets!$L$2,ROW($F25),5)))))))))","v":-4},{"$f":"IF($F$1=\"Drillers\",OFFSET(Drillers!$L$2,ROW($F25),6),IF($F$1=\"Bulls\",OFFSET(Bulls!$L$2,ROW($F25),6),IF($F$1=\"Phantoms\",OFFSET(Phantoms!$L$2,ROW($F25),6),IF($F$1=\"Gators\",OFFSET(Gators!$L$2,ROW($F25),6),IF($F$1=\"Knights\",OFFSET(Knights!$L$2,ROW($F25),6),IF($F$1=\"Hornets\",OFFSET(Hornets!$L$2,ROW($F25),6),IF($F$1=\"Guardians\",OFFSET(Wolves!$L$2,ROW($F25),6),IF($F$1=\"Reds\",OFFSET(Comets!$L$2,ROW($F25),6)))))))))","v":1},{"$f":"IF($F$1=\"Drillers\",OFFSET(Drillers!$L$2,ROW(F25),7),IF($F$1=\"Bulls\",OFFSET(Bulls!$L$2,ROW(F25),7),IF($F$1=\"Phantoms\",OFFSET(Phantoms!$L$2,ROW(F25),7),IF($F$1=\"Gators\",OFFSET(Gators!$L$2,ROW(F25),7),IF($F$1=\"Knights\",OFFSET(Knights!$L$2,ROW(F25),7),IF($F$1=\"Hornets\",OFFSET(Hornets!$L$2,ROW(F25),7),IF($F$1=\"Guardians\",OFFSET(Wolves!$L$2,ROW(F25),7),IF($F$1=\"Reds\",OFFSET(Comets!$L$2,ROW(F25),7),))))))))","v":0},{"$f":"IF($F$1=\"Drillers\",OFFSET(Drillers!$L$2,ROW(F25),8),IF($F$1=\"Bulls\",OFFSET(Bulls!$L$2,ROW(F25),8),IF($F$1=\"Phantoms\",OFFSET(Phantoms!$L$2,ROW(F25),8),IF($F$1=\"Gators\",OFFSET(Gators!$L$2,ROW(F25),8),IF($F$1=\"Knights\",OFFSET(Knights!$L$2,ROW(F25),8),IF($F$1=\"Hornets\",OFFSET(Hornets!$L$2,ROW(F25),8),IF($F$1=\"Guardians\",OFFSET(Wolves!$L$2,ROW(F25),8),IF($F$1=\"Reds\",OFFSET(Comets!$L$2,ROW(F25),8)))))))))","v":0},{"$f":"IF($F$1=\"Drillers\",OFFSET(Drillers!$L$2,ROW($F25),9),IF($F$1=\"Bulls\",OFFSET(Bulls!$L$2,ROW($F25),9),IF($F$1=\"Phantoms\",OFFSET(Phantoms!$L$2,ROW($F25),9),IF($F$1=\"Gators\",OFFSET(Gators!$L$2,ROW($F25),9),IF($F$1=\"Knights\",OFFSET(Knights!$L$2,ROW($F25),9),IF($F$1=\"Hornets\",OFFSET(Hornets!$L$2,ROW(F25),9),IF($F$1=\"Guardians\",OFFSET(Wolves!$L$2,ROW($F25),9),IF($F$1=\"Reds\",OFFSET(Comets!$L$2,ROW($F25),9)))))))))","v":0},{"$f":"IF($F$1=\"Drillers\",OFFSET(Drillers!$L$2,ROW(F25),10),IF($F$1=\"Bulls\",OFFSET(Bulls!$L$2,ROW(F25),10),IF($F$1=\"Phantoms\",OFFSET(Phantoms!$L$2,ROW(F25),10),IF($F$1=\"Gators\",OFFSET(Gators!$L$2,ROW(F25),10),IF($F$1=\"Knights\",OFFSET(Knights!$L$2,ROW(F25),10),IF($F$1=\"Hornets\",OFFSET(Hornets!$L$2,ROW(F25),10),IF($F$1=\"Guardians\",OFFSET(Wolves!$L$2,ROW(F25),10),IF($F$1=\"Reds\",OFFSET(Comets!$L$2,ROW(F25),10)))))))))","v":0},{"$f":"IF($F$1=\"Drillers\",OFFSET(Drillers!$L$2,ROW(F25),11),IF($F$1=\"Bulls\",OFFSET(Bulls!$L$2,ROW(F25),11),IF($F$1=\"Phantoms\",OFFSET(Phantoms!$L$2,ROW(F25),11),IF($F$1=\"Gators\",OFFSET(Gators!$L$2,ROW(F25),11),IF($F$1=\"Knights\",OFFSET(Knights!$L$2,ROW(F25),11),IF($F$1=\"Hornets\",OFFSET(Hornets!$L$2,ROW(F25),11),IF($F$1=\"Guardians\",OFFSET(Wolves!$L$2,ROW(F25),11),IF($F$1=\"Drillers\",OFFSET(Drillers!$L$2,ROW(F25),11),IF($F$1=\"Reds\",OFFSET(Comets!$L$2,ROW(F25),11))))))))))","v":0},{"$f":"IF($F$1=\"Drillers\",OFFSET(Drillers!$L$2,ROW(F25),12),IF($F$1=\"Bulls\",OFFSET(Bulls!$L$2,ROW(F25),12),IF($F$1=\"Phantoms\",OFFSET(Phantoms!$L$2,ROW(F25),12),IF($F$1=\"Gators\",OFFSET(Gators!$L$2,ROW(F25),12),IF($F$1=\"Knights\",OFFSET(Knights!$L$2,ROW(F25),12),IF($F$1=\"Hornets\",OFFSET(Hornets!$L$2,ROW(F25),12),IF($F$1=\"Guardians\",OFFSET(Wolves!$L$2,ROW(F25),12),IF($F$1=\"Reds\",OFFSET(Comets!$L$2,ROW(F25),12),))))))))","v":0},{"$f":"IF($F$1=\"Drillers\",OFFSET(Drillers!$L$2,ROW(F25),13),IF($F$1=\"Bulls\",OFFSET(Bulls!$L$2,ROW(F25),13),IF($F$1=\"Phantoms\",OFFSET(Phantoms!$L$2,ROW(F25),13),IF($F$1=\"Gators\",OFFSET(Gators!$L$2,ROW(F25),13),IF($F$1=\"Knights\",OFFSET(Knights!$L$2,ROW(F25),13),IF($F$1=\"Hornets\",OFFSET(Hornets!$L$2,ROW(F25),13),IF($F$1=\"Guardians\",OFFSET(Wolves!$L$2,ROW(F25),13),IF($F$1=\"Reds\",OFFSET(Comets!$L$2,ROW(F25),13),))))))))","v":0},{"$f":"IF($F$1=\"Drillers\",OFFSET(Drillers!$L$2,ROW(F25),14),IF($F$1=\"Bulls\",OFFSET(Bulls!$L$2,ROW(F25),14),IF($F$1=\"Phantoms\",OFFSET(Phantoms!$L$2,ROW(F25),14),IF($F$1=\"Gators\",OFFSET(Gators!$L$2,ROW(F25),14),IF($F$1=\"Knights\",OFFSET(Knights!$L$2,ROW(F25),14),IF($F$1=\"Hornets\",OFFSET(Hornets!$L$2,ROW(F25),14),IF($F$1=\"Guardians\",OFFSET(Wolves!$L$2,ROW(F25),14,),IF($F$1=\"Reds\",OFFSET(Comets!$L$2,ROW(F25),14)))))))))","v":4},{"$f":"IF($F$1=\"Drillers\",OFFSET(Drillers!$L$2,ROW(F25),15),IF($F$1=\"Bulls\",OFFSET(Bulls!$L$2,ROW(F25),15),IF($F$1=\"Phantoms\",OFFSET(Phantoms!$L$2,ROW(F25),15),IF($F$1=\"Gators\",OFFSET(Gators!$L$2,ROW(F25),15),IF($F$1=\"Knights\",OFFSET(Knights!$L$2,ROW(F25),15),IF($F$1=\"Hornets\",OFFSET(Hornets!$L$2,ROW(F25),15),IF($F$1=\"Guardians\",OFFSET(Wolves!$L$2,ROW(F25),15),IF($F$1=\"Reds\",OFFSET(Comets!$L$2,ROW(F25),15)))))))))","v":0},{"$f":"IF($F$1=\"Drillers\",OFFSET(Drillers!$L$2,ROW(F25),16),IF($F$1=\"Bulls\",OFFSET(Bulls!$L$2,ROW(F25),16),IF($F$1=\"Phantoms\",OFFSET(Phantoms!$L$2,ROW(F25),16),IF($F$1=\"Gators\",OFFSET(Gators!$L$2,ROW(F25),16),IF($F$1=\"Knights\",OFFSET(Knights!$L$2,ROW(F25),16),IF($F$1=\"Hornets\",OFFSET(Hornets!$L$2,ROW(F25),16),IF($F$1=\"Guardians\",OFFSET(Wolves!$L$2,ROW(F25),16),IF($F$1=\"Reds\",OFFSET(Comets!$L$2,ROW(F25),16)))))))))","v":0},{"$nulls":8},7,{"$f":"IF($AE$1=\"Drillers\",OFFSET(Drillers!$L$2,ROW($AE25),1),IF($AE$1=\"Bulls\",OFFSET(Bulls!$L$2,ROW($AE25),1),IF($AE$1=\"Phantoms\",OFFSET(Phantoms!$L$2,ROW($AE25),1),IF($AE$1=\"Gators\",OFFSET(Gators!$L$2,ROW($AE25),1),IF($AE$1=\"Knights\",OFFSET(Knights!$L$2,ROW($AE25),1),IF($AE$1=\"Hornets\",OFFSET(Hornets!$L$2,ROW($AE25),1),IF($AE$1=\"Wolves\",OFFSET(Wolves!$L$2,ROW($AE25),1),IF(AE$1=\"Comets\",OFFSET(Comets!$L$2,ROW($AE25),1)))))))))","v":"Berry"},{"$f":"IF($AE$1=\"Drillers\",OFFSET(Drillers!$L$2,ROW($AF25),2),IF($AE$1=\"Bulls\",OFFSET(Bulls!$L$2,ROW($AF25),2),IF($AE$1=\"Phantoms\",OFFSET(Phantoms!$L$2,ROW($AF25),2),IF($AE$1=\"Gators\",OFFSET(Gators!$L$2,ROW($AF25),2),IF($AE$1=\"Knights\",OFFSET(Knights!$L$2,ROW($AF25),2),IF($AE$1=\"Hornets\",OFFSET(Hornets!$L$2,ROW($AF25),2),IF($AE$1=\"Wolves\",OFFSET(Wolves!$L$2,ROW($AF25),2),IF($AE$1=\"Comets\",OFFSET(Comets!$L$2,ROW($AF25),2)))))))))","v":"Vince"},{"$f":"IF($AE$1=\"Drillers\",OFFSET(Drillers!$L$2,ROW($AE25),3),IF($AE$1=\"Bulls\",OFFSET(Bulls!$L$2,ROW($AE25),3),IF($AE$1=\"Phantoms\",OFFSET(Phantoms!$L$2,ROW($AE25),3),IF($AE$1=\"Gators\",OFFSET(Gators!$L$2,ROW($AE25),3),IF($AE$1=\"Knights\",OFFSET(Knights!$L$2,ROW($AE25),3),IF($AE$1=\"Hornets\",OFFSET(Hornets!$L$2,ROW($AE25),3),IF($AE$1=\"Wolves\",OFFSET(Wolves!$L$2,ROW($AE25),3),IF($AE$1=\"Comets\",OFFSET(Comets!$L$2,ROW($AE25),3)))))))))","v":"R"},{"$f":"IF($AE$1=\"Drillers\",OFFSET(Drillers!$L$2,ROW($AE25),4),IF($AE$1=\"Bulls\",OFFSET(Bulls!$L$2,ROW($AE25),4),IF($AE$1=\"Phantoms\",OFFSET(Phantoms!$L$2,ROW($AE25),4),IF($AE$1=\"Gators\",OFFSET(Gators!$L$2,ROW($AE25),4),IF($AE$1=\"Knights\",OFFSET(Knights!$L$2,ROW($AE25),4),IF($AE$1=\"Hornets\",OFFSET(Hornets!$L$2,ROW($AE25),4),IF($AE$1=\"Wolves\",OFFSET(Wolves!$L$2,ROW($AE25),4),IF($AE$1=\"Comets\",OFFSET(Comets!$L$2,ROW($AE25),4)))))))))","v":-2},{"$f":"IF($AE$1=\"Drillers\",OFFSET(Drillers!$L$2,ROW($AE25),5),IF($AE$1=\"Bulls\",OFFSET(Bulls!$L$2,ROW($AE25),5),IF($AE$1=\"Phantoms\",OFFSET(Phantoms!$L$2,ROW($AE25),5),IF($AE$1=\"Gators\",OFFSET(Gators!$L$2,ROW($AE25),5),IF($AE$1=\"Knights\",OFFSET(Knights!$L$2,ROW($AE25),5),IF($AE$1=\"Hornets\",OFFSET(Hornets!$L$2,ROW($AE25),5),IF($AE$1=\"Wolves\",OFFSET(Wolves!$L$2,ROW($AE25),5),IF($AE$1=\"Comets\",OFFSET(Comets!$L$2,ROW($AE25),5)))))))))","v":-4},{"$f":"IF($AE$1=\"Drillers\",OFFSET(Drillers!$L$2,ROW($AE25),6),IF($AE$1=\"Bulls\",OFFSET(Bulls!$L$2,ROW($AE25),6),IF($AE$1=\"Phantoms\",OFFSET(Phantoms!$L$2,ROW($AE25),6),IF($AE$1=\"Gators\",OFFSET(Gators!$L$2,ROW($AE25),6),IF($AE$1=\"Knights\",OFFSET(Knights!$L$2,ROW($AE25),6),IF($AE$1=\"Hornets\",OFFSET(Hornets!$L$2,ROW($AE25),6),IF($AE$1=\"Wolves\",OFFSET(Wolves!$L$2,ROW($AE25),6),IF($AE$1=\"Comets\",OFFSET(Comets!$L$2,ROW($AE25),6)))))))))","v":1},{"$f":"IF($AE$1=\"Drillers\",OFFSET(Drillers!$L$2,ROW($AE25),7),IF($AE$1=\"Bulls\",OFFSET(Bulls!$L$2,ROW($AE25),7),IF($AE$1=\"Phantoms\",OFFSET(Phantoms!$L$2,ROW($AE25),7),IF($AE$1=\"Gators\",OFFSET(Gators!$L$2,ROW($AE25),7),IF($AE$1=\"Knights\",OFFSET(Knights!$L$2,ROW($AE25),7),IF($AE$1=\"Hornets\",OFFSET(Hornets!$L$2,ROW($AE25),7),IF($AE$1=\"Wolves\",OFFSET(Wolves!$L$2,ROW($AE25),7),IF($AE$1=\"Comets\",OFFSET(Comets!$L$2,ROW($AE25),7)))))))))","v":0},{"$f":"IF($AE$1=\"Drillers\",OFFSET(Drillers!$L$2,ROW($AE25),8),IF($AE$1=\"Bulls\",OFFSET(Bulls!$L$2,ROW($AE25),8),IF($AE$1=\"Phantoms\",OFFSET(Phantoms!$L$2,ROW($AE25),8),IF($AE$1=\"Gators\",OFFSET(Gators!$L$2,ROW($AE25),8),IF($AE$1=\"Knights\",OFFSET(Knights!$L$2,ROW($AE25),8),IF($AE$1=\"Hornets\",OFFSET(Hornets!$L$2,ROW($AE25),8),IF($AE$1=\"Wolves\",OFFSET(Wolves!$L$2,ROW($AE25),8),IF($AE$1=\"Comets\",OFFSET(Comets!$L$2,ROW($AE25),8)))))))))","v":0},{"$f":"IF($AE$1=\"Drillers\",OFFSET(Drillers!$L$2,ROW($AE25),9),IF($AE$1=\"Bulls\",OFFSET(Bulls!$L$2,ROW($AE25),9),IF($AE$1=\"Phantoms\",OFFSET(Phantoms!$L$2,ROW($AE25),9),IF($AE$1=\"Gators\",OFFSET(Gators!$L$2,ROW($AE25),9),IF($AE$1=\"Knights\",OFFSET(Knights!$L$2,ROW($AE25),9),IF($AE$1=\"Hornets\",OFFSET(Hornets!$L$2,ROW($AE25),9),IF($AE$1=\"Wolves\",OFFSET(Wolves!$L$2,ROW($AE25),9),IF($AE$1=\"Comets\",OFFSET(Comets!$L$2,ROW($AE25),9)))))))))","v":0},{"$f":"IF($AE$1=\"Drillers\",OFFSET(Drillers!$L$2,ROW($AE25),10),IF($AE$1=\"Bulls\",OFFSET(Bulls!$L$2,ROW($AE25),10),IF($AE$1=\"Phantoms\",OFFSET(Phantoms!$L$2,ROW($AE25),10),IF($AE$1=\"Gators\",OFFSET(Gators!$L$2,ROW($AE25),10),IF($AE$1=\"Knights\",OFFSET(Knights!$L$2,ROW($AE25),10),IF($AE$1=\"Hornets\",OFFSET(Hornets!$L$2,ROW($AE25),10),IF($AE$1=\"Wolves\",OFFSET(Wolves!$L$2,ROW($AE25),10),IF($AE$1=\"Comets\",OFFSET(Comets!$L$2,ROW($AE25),10)))))))))","v":0},{"$f":"IF($AE$1=\"Drillers\",OFFSET(Drillers!$L$2,ROW($AE25),11),IF($AE$1=\"Bulls\",OFFSET(Bulls!$L$2,ROW($AE25),11),IF($AE$1=\"Phantoms\",OFFSET(Phantoms!$L$2,ROW($AE25),11),IF($AE$1=\"Gators\",OFFSET(Gators!$L$2,ROW($AE25),11),IF($AE$1=\"Knights\",OFFSET(Knights!$L$2,ROW($AE25),11),IF($AE$1=\"Hornets\",OFFSET(Hornets!$L$2,ROW($AE25),11),IF($AE$1=\"Wolves\",OFFSET(Wolves!$L$2,ROW($AE25),11),IF($AE$1=\"Comets\",OFFSET(Comets!$L$2,ROW($AE25),11)))))))))","v":0},{"$f":"IF($AE$1=\"Drillers\",OFFSET(Drillers!$L$2,ROW($AE25),12),IF($AE$1=\"Bulls\",OFFSET(Bulls!$L$2,ROW($AE25),12),IF($AE$1=\"Phantoms\",OFFSET(Phantoms!$L$2,ROW($AE25),12),IF($AE$1=\"Gators\",OFFSET(Gators!$L$2,ROW($AE25),12),IF($AE$1=\"Knights\",OFFSET(Knights!$L$2,ROW($AE25),12),IF($AE$1=\"Hornets\",OFFSET(Hornets!$L$2,ROW($AE25),12),IF($AE$1=\"Wolves\",OFFSET(Wolves!$L$2,ROW($AE25),12),IF($AE$1=\"Comets\",OFFSET(Comets!$L$2,ROW($AE25),12)))))))))","v":0},{"$f":"IF($AE$1=\"Drillers\",OFFSET(Drillers!$L$2,ROW($AE25),13),IF($AE$1=\"Bulls\",OFFSET(Bulls!$L$2,ROW($AE25),13),IF($AE$1=\"Phantoms\",OFFSET(Phantoms!$L$2,ROW($AE25),13),IF($AE$1=\"Gators\",OFFSET(Gators!$L$2,ROW($AE25),13),IF($AE$1=\"Knights\",OFFSET(Knights!$L$2,ROW($AE25),13),IF($AE$1=\"Hornets\",OFFSET(Hornets!$L$2,ROW($AE25),13),IF($AE$1=\"Wolves\",OFFSET(Wolves!$L$2,ROW($AE25),13),IF($AE$1=\"Comets\",OFFSET(Comets!$L$2,ROW($AE25),13)))))))))","v":0},{"$f":"IF($AE$1=\"Drillers\",OFFSET(Drillers!$L$2,ROW($AE25),14),IF($AE$1=\"Bulls\",OFFSET(Bulls!$L$2,ROW($AE25),14),IF($AE$1=\"Phantoms\",OFFSET(Phantoms!$L$2,ROW($AE25),14),IF($AE$1=\"Gators\",OFFSET(Gators!$L$2,ROW($AE25),14),IF($AE$1=\"Knights\",OFFSET(Knights!$L$2,ROW($AE25),14),IF($AE$1=\"Hornets\",OFFSET(Hornets!$L$2,ROW($AE25),14),IF($AE$1=\"Wolves\",OFFSET(Wolves!$L$2,ROW($AE25),14),IF($AE$1=\"Comets\",OFFSET(Comets!$L$2,ROW($AE25),14)))))))))","v":4},{"$f":"IF(AE$1=\"Drillers\",OFFSET(Drillers!$L$2,ROW(AE25),15),IF(AE$1=\"Bulls\",OFFSET(Bulls!$L$2,ROW(AE25),15),IF(AE$1=\"Phantoms\",OFFSET(Phantoms!$L$2,ROW(AE25),15),IF(AE$1=\"Gators\",OFFSET(Gators!$L$2,ROW(AE25),15),IF(AE$1=\"Knights\",OFFSET(Knights!$L$2,ROW(AE25),15),IF(AE$1=\"Hornets\",OFFSET(Hornets!$L$2,ROW(AE25),15),IF(AE$1=\"Wolves\",OFFSET(Wolves!$L$2,ROW(AE25),15),IF(AE$1=\"Comets\",OFFSET(Comets!$L$2,ROW(AE25),15)))))))))","v":0},{"$f":"IF($AE$1=\"Drillers\",OFFSET(Drillers!$L$2,ROW(AE25),16),IF($AE$1=\"Bulls\",OFFSET(Bulls!$L$2,ROW(AE25),16),IF($AE$1=\"Phantoms\",OFFSET(Phantoms!$L$2,ROW(AE25),16),IF($AE$1=\"Gators\",OFFSET(Gators!$L$2,ROW(AE25),16),IF($AE$1=\"Knights\",OFFSET(Knights!$L$2,ROW(AE25),16),IF($AE$1=\"Hornets\",OFFSET(Hornets!$L$2,ROW(AE25),16),IF($AE$1=\"Wolves\",OFFSET(Wolves!$L$2,ROW(AE25),16),IF($AE$1=\"Comets\",OFFSET(Comets!$L$2,ROW(AE25),16)))))))))","v":0}]
[{"$nulls":4},8,{"$f":"IF($F$1=\"Drillers\",OFFSET(Drillers!$L$2,ROW($F26),1),IF($F$1=\"Bulls\",OFFSET(Bulls!$L$2,ROW($F26),1),IF($F$1=\"Phantoms\",OFFSET(Phantoms!$L$2,ROW($F26),1),IF($F$1=\"Gators\",OFFSET(Gators!$L$2,ROW($F26),1),IF($F$1=\"Knights\",OFFSET(Knights!$L$2,ROW($F26),1),IF($F$1=\"Hornets\",OFFSET(Hornets!$L$2,ROW($F26),1),IF($F$1=\"Reds\",OFFSET(Comets!$L$2,ROW($F26),1),IF($F$1=\"Guardians\",OFFSET(Wolves!$L$2,ROW($F26),1)))))))))","v":"McAughy"},{"$f":"IF($F$1=\"Drillers\",OFFSET(Drillers!$L$2,ROW($F26),2),IF($F$1=\"Bulls\",OFFSET(Bulls!$L$2,ROW($F26),2),IF($F$1=\"Phantoms\",OFFSET(Phantoms!$L$2,ROW($F26),2),IF($F$1=\"Gators\",OFFSET(Gators!$L$2,ROW($F26),2),IF($F$1=\"Knights\",OFFSET(Knights!$L$2,ROW($F26),2),IF($F$1=\"Hornets\",OFFSET(Hornets!$L$2,ROW($F26),2),IF($F$1=\"Reds\",OFFSET(Comets!$L$2,ROW($F26),2),IF($F$1=\"Guardians\",OFFSET(Wolves!$L$2,ROW($F26),2)))))))))","v":"Shane"},{"$f":"IF($F$1=\"Drillers\",OFFSET(Drillers!$L$2,ROW($F26),3),IF($F$1=\"Bulls\",OFFSET(Bulls!$L$2,ROW($F26),3),IF($F$1=\"Phantoms\",OFFSET(Phantoms!$L$2,ROW($F26),3),IF($F$1=\"Gators\",OFFSET(Gators!$L$2,ROW($F26),3),IF($F$1=\"Knights\",OFFSET(Knights!$L$2,ROW($F26),3),IF($F$1=\"Hornets\",OFFSET(Hornets!$L$2,ROW($F26),3),IF($F$1=\"Guardians\",OFFSET(Wolves!$L$2,ROW($F26),3),IF($F$1=\"Reds\",OFFSET(Comets!$L$2,ROW($F26),3)))))))))","v":"R"},{"$f":"IF($F$1=\"Drillers\",OFFSET(Drillers!$L$2,ROW($F26),4),IF($F$1=\"Bulls\",OFFSET(Bulls!$L$2,ROW($F26),4),IF($F$1=\"Phantoms\",OFFSET(Phantoms!$L$2,ROW($F26),4),IF($F$1=\"Gators\",OFFSET(Gators!$L$2,ROW($F26),4),IF($F$1=\"Knights\",OFFSET(Knights!$L$2,ROW($F26),4),IF($F$1=\"Hornets\",OFFSET(Hornets!$L$2,ROW($F26),4),IF($F$1=\"Guardians\",OFFSET(Wolves!$L$2,ROW($F26),4),IF($F$1=\"Reds\",OFFSET(Comets!$L$2,ROW($F26),4)))))))))","v":-4},{"$f":"IF($F$1=\"Drillers\",OFFSET(Drillers!$L$2,ROW($F26),5),IF($F$1=\"Bulls\",OFFSET(Bulls!$L$2,ROW($F26),5),IF($F$1=\"Phantoms\",OFFSET(Phantoms!$L$2,ROW($F26),5),IF($F$1=\"Gators\",OFFSET(Gators!$L$2,ROW($F26),5),IF($F$1=\"Knights\",OFFSET(Knights!$L$2,ROW($F26),5),IF($F$1=\"Hornets\",OFFSET(Hornets!$L$2,ROW($F26),5),IF($F$1=\"Guardians\",OFFSET(Wolves!$L$2,ROW($F26),5),IF($F$1=\"Reds\",OFFSET(Comets!$L$2,ROW($F26),5)))))))))","v":-3},{"$f":"IF($F$1=\"Drillers\",OFFSET(Drillers!$L$2,ROW($F26),6),IF($F$1=\"Bulls\",OFFSET(Bulls!$L$2,ROW($F26),6),IF($F$1=\"Phantoms\",OFFSET(Phantoms!$L$2,ROW($F26),6),IF($F$1=\"Gators\",OFFSET(Gators!$L$2,ROW($F26),6),IF($F$1=\"Knights\",OFFSET(Knights!$L$2,ROW($F26),6),IF($F$1=\"Hornets\",OFFSET(Hornets!$L$2,ROW($F26),6),IF($F$1=\"Guardians\",OFFSET(Wolves!$L$2,ROW($F26),6),IF($F$1=\"Reds\",OFFSET(Comets!$L$2,ROW($F26),6)))))))))","v":1},{"$f":"IF($F$1=\"Drillers\",OFFSET(Drillers!$L$2,ROW(F26),7),IF($F$1=\"Bulls\",OFFSET(Bulls!$L$2,ROW(F26),7),IF($F$1=\"Phantoms\",OFFSET(Phantoms!$L$2,ROW(F26),7),IF($F$1=\"Gators\",OFFSET(Gators!$L$2,ROW(F26),7),IF($F$1=\"Knights\",OFFSET(Knights!$L$2,ROW(F26),7),IF($F$1=\"Hornets\",OFFSET(Hornets!$L$2,ROW(F26),7),IF($F$1=\"Guardians\",OFFSET(Wolves!$L$2,ROW(F26),7),IF($F$1=\"Reds\",OFFSET(Comets!$L$2,ROW(F26),7),))))))))","v":0},{"$f":"IF($F$1=\"Drillers\",OFFSET(Drillers!$L$2,ROW(F26),8),IF($F$1=\"Bulls\",OFFSET(Bulls!$L$2,ROW(F26),8),IF($F$1=\"Phantoms\",OFFSET(Phantoms!$L$2,ROW(F26),8),IF($F$1=\"Gators\",OFFSET(Gators!$L$2,ROW(F26),8),IF($F$1=\"Knights\",OFFSET(Knights!$L$2,ROW(F26),8),IF($F$1=\"Hornets\",OFFSET(Hornets!$L$2,ROW(F26),8),IF($F$1=\"Guardians\",OFFSET(Wolves!$L$2,ROW(F26),8),IF($F$1=\"Reds\",OFFSET(Comets!$L$2,ROW(F26),8)))))))))","v":0},{"$f":"IF($F$1=\"Drillers\",OFFSET(Drillers!$L$2,ROW($F26),9),IF($F$1=\"Bulls\",OFFSET(Bulls!$L$2,ROW($F26),9),IF($F$1=\"Phantoms\",OFFSET(Phantoms!$L$2,ROW($F26),9),IF($F$1=\"Gators\",OFFSET(Gators!$L$2,ROW($F26),9),IF($F$1=\"Knights\",OFFSET(Knights!$L$2,ROW($F26),9),IF($F$1=\"Hornets\",OFFSET(Hornets!$L$2,ROW(F26),9),IF($F$1=\"Guardians\",OFFSET(Wolves!$L$2,ROW($F26),9),IF($F$1=\"Reds\",OFFSET(Comets!$L$2,ROW($F26),9)))))))))","v":0},{"$f":"IF($F$1=\"Drillers\",OFFSET(Drillers!$L$2,ROW(F26),10),IF($F$1=\"Bulls\",OFFSET(Bulls!$L$2,ROW(F26),10),IF($F$1=\"Phantoms\",OFFSET(Phantoms!$L$2,ROW(F26),10),IF($F$1=\"Gators\",OFFSET(Gators!$L$2,ROW(F26),10),IF($F$1=\"Knights\",OFFSET(Knights!$L$2,ROW(F26),10),IF($F$1=\"Hornets\",OFFSET(Hornets!$L$2,ROW(F26),10),IF($F$1=\"Guardians\",OFFSET(Wolves!$L$2,ROW(F26),10),IF($F$1=\"Reds\",OFFSET(Comets!$L$2,ROW(F26),10)))))))))","v":0},{"$f":"IF($F$1=\"Drillers\",OFFSET(Drillers!$L$2,ROW(F26),11),IF($F$1=\"Bulls\",OFFSET(Bulls!$L$2,ROW(F26),11),IF($F$1=\"Phantoms\",OFFSET(Phantoms!$L$2,ROW(F26),11),IF($F$1=\"Gators\",OFFSET(Gators!$L$2,ROW(F26),11),IF($F$1=\"Knights\",OFFSET(Knights!$L$2,ROW(F26),11),IF($F$1=\"Hornets\",OFFSET(Hornets!$L$2,ROW(F26),11),IF($F$1=\"Guardians\",OFFSET(Wolves!$L$2,ROW(F26),11),IF($F$1=\"Drillers\",OFFSET(Drillers!$L$2,ROW(F26),11),IF($F$1=\"Reds\",OFFSET(Comets!$L$2,ROW(F26),11))))))))))","v":0},{"$f":"IF($F$1=\"Drillers\",OFFSET(Drillers!$L$2,ROW(F26),12),IF($F$1=\"Bulls\",OFFSET(Bulls!$L$2,ROW(F26),12),IF($F$1=\"Phantoms\",OFFSET(Phantoms!$L$2,ROW(F26),12),IF($F$1=\"Gators\",OFFSET(Gators!$L$2,ROW(F26),12),IF($F$1=\"Knights\",OFFSET(Knights!$L$2,ROW(F26),12),IF($F$1=\"Hornets\",OFFSET(Hornets!$L$2,ROW(F26),12),IF($F$1=\"Guardians\",OFFSET(Wolves!$L$2,ROW(F26),12),IF($F$1=\"Reds\",OFFSET(Comets!$L$2,ROW(F26),12),))))))))","v":0},{"$f":"IF($F$1=\"Drillers\",OFFSET(Drillers!$L$2,ROW(F26),13),IF($F$1=\"Bulls\",OFFSET(Bulls!$L$2,ROW(F26),13),IF($F$1=\"Phantoms\",OFFSET(Phantoms!$L$2,ROW(F26),13),IF($F$1=\"Gators\",OFFSET(Gators!$L$2,ROW(F26),13),IF($F$1=\"Knights\",OFFSET(Knights!$L$2,ROW(F26),13),IF($F$1=\"Hornets\",OFFSET(Hornets!$L$2,ROW(F26),13),IF($F$1=\"Guardians\",OFFSET(Wolves!$L$2,ROW(F26),13),IF($F$1=\"Reds\",OFFSET(Comets!$L$2,ROW(F26),13),))))))))","v":0},{"$f":"IF($F$1=\"Drillers\",OFFSET(Drillers!$L$2,ROW(F26),14),IF($F$1=\"Bulls\",OFFSET(Bulls!$L$2,ROW(F26),14),IF($F$1=\"Phantoms\",OFFSET(Phantoms!$L$2,ROW(F26),14),IF($F$1=\"Gators\",OFFSET(Gators!$L$2,ROW(F26),14),IF($F$1=\"Knights\",OFFSET(Knights!$L$2,ROW(F26),14),IF($F$1=\"Hornets\",OFFSET(Hornets!$L$2,ROW(F26),14),IF($F$1=\"Guardians\",OFFSET(Wolves!$L$2,ROW(F26),14,),IF($F$1=\"Reds\",OFFSET(Comets!$L$2,ROW(F26),14)))))))))","v":3},{"$f":"IF($F$1=\"Drillers\",OFFSET(Drillers!$L$2,ROW(F26),15),IF($F$1=\"Bulls\",OFFSET(Bulls!$L$2,ROW(F26),15),IF($F$1=\"Phantoms\",OFFSET(Phantoms!$L$2,ROW(F26),15),IF($F$1=\"Gators\",OFFSET(Gators!$L$2,ROW(F26),15),IF($F$1=\"Knights\",OFFSET(Knights!$L$2,ROW(F26),15),IF($F$1=\"Hornets\",OFFSET(Hornets!$L$2,ROW(F26),15),IF($F$1=\"Guardians\",OFFSET(Wolves!$L$2,ROW(F26),15),IF($F$1=\"Reds\",OFFSET(Comets!$L$2,ROW(F26),15)))))))))","v":0},{"$f":"IF($F$1=\"Drillers\",OFFSET(Drillers!$L$2,ROW(F26),16),IF($F$1=\"Bulls\",OFFSET(Bulls!$L$2,ROW(F26),16),IF($F$1=\"Phantoms\",OFFSET(Phantoms!$L$2,ROW(F26),16),IF($F$1=\"Gators\",OFFSET(Gators!$L$2,ROW(F26),16),IF($F$1=\"Knights\",OFFSET(Knights!$L$2,ROW(F26),16),IF($F$1=\"Hornets\",OFFSET(Hornets!$L$2,ROW(F26),16),IF($F$1=\"Guardians\",OFFSET(Wolves!$L$2,ROW(F26),16),IF($F$1=\"Reds\",OFFSET(Comets!$L$2,ROW(F26),16)))))))))","v":0},{"$nulls":8},8,{"$f":"IF($AE$1=\"Drillers\",OFFSET(Drillers!$L$2,ROW($AE26),1),IF($AE$1=\"Bulls\",OFFSET(Bulls!$L$2,ROW($AE26),1),IF($AE$1=\"Phantoms\",OFFSET(Phantoms!$L$2,ROW($AE26),1),IF($AE$1=\"Gators\",OFFSET(Gators!$L$2,ROW($AE26),1),IF($AE$1=\"Knights\",OFFSET(Knights!$L$2,ROW($AE26),1),IF($AE$1=\"Hornets\",OFFSET(Hornets!$L$2,ROW($AE26),1),IF($AE$1=\"Wolves\",OFFSET(Wolves!$L$2,ROW($AE26),1),IF(AE$1=\"Comets\",OFFSET(Comets!$L$2,ROW($AE26),1)))))))))","v":"Little"},{"$f":"IF($AE$1=\"Drillers\",OFFSET(Drillers!$L$2,ROW($AF26),2),IF($AE$1=\"Bulls\",OFFSET(Bulls!$L$2,ROW($AF26),2),IF($AE$1=\"Phantoms\",OFFSET(Phantoms!$L$2,ROW($AF26),2),IF($AE$1=\"Gators\",OFFSET(Gators!$L$2,ROW($AF26),2),IF($AE$1=\"Knights\",OFFSET(Knights!$L$2,ROW($AF26),2),IF($AE$1=\"Hornets\",OFFSET(Hornets!$L$2,ROW($AF26),2),IF($AE$1=\"Wolves\",OFFSET(Wolves!$L$2,ROW($AF26),2),IF($AE$1=\"Comets\",OFFSET(Comets!$L$2,ROW($AF26),2)))))))))","v":"Derek"},{"$f":"IF($AE$1=\"Drillers\",OFFSET(Drillers!$L$2,ROW($AE26),3),IF($AE$1=\"Bulls\",OFFSET(Bulls!$L$2,ROW($AE26),3),IF($AE$1=\"Phantoms\",OFFSET(Phantoms!$L$2,ROW($AE26),3),IF($AE$1=\"Gators\",OFFSET(Gators!$L$2,ROW($AE26),3),IF($AE$1=\"Knights\",OFFSET(Knights!$L$2,ROW($AE26),3),IF($AE$1=\"Hornets\",OFFSET(Hornets!$L$2,ROW($AE26),3),IF($AE$1=\"Wolves\",OFFSET(Wolves!$L$2,ROW($AE26),3),IF($AE$1=\"Comets\",OFFSET(Comets!$L$2,ROW($AE26),3)))))))))","v":"L"},{"$f":"IF($AE$1=\"Drillers\",OFFSET(Drillers!$L$2,ROW($AE26),4),IF($AE$1=\"Bulls\",OFFSET(Bulls!$L$2,ROW($AE26),4),IF($AE$1=\"Phantoms\",OFFSET(Phantoms!$L$2,ROW($AE26),4),IF($AE$1=\"Gators\",OFFSET(Gators!$L$2,ROW($AE26),4),IF($AE$1=\"Knights\",OFFSET(Knights!$L$2,ROW($AE26),4),IF($AE$1=\"Hornets\",OFFSET(Hornets!$L$2,ROW($AE26),4),IF($AE$1=\"Wolves\",OFFSET(Wolves!$L$2,ROW($AE26),4),IF($AE$1=\"Comets\",OFFSET(Comets!$L$2,ROW($AE26),4)))))))))","v":-4},{"$f":"IF($AE$1=\"Drillers\",OFFSET(Drillers!$L$2,ROW($AE26),5),IF($AE$1=\"Bulls\",OFFSET(Bulls!$L$2,ROW($AE26),5),IF($AE$1=\"Phantoms\",OFFSET(Phantoms!$L$2,ROW($AE26),5),IF($AE$1=\"Gators\",OFFSET(Gators!$L$2,ROW($AE26),5),IF($AE$1=\"Knights\",OFFSET(Knights!$L$2,ROW($AE26),5),IF($AE$1=\"Hornets\",OFFSET(Hornets!$L$2,ROW($AE26),5),IF($AE$1=\"Wolves\",OFFSET(Wolves!$L$2,ROW($AE26),5),IF($AE$1=\"Comets\",OFFSET(Comets!$L$2,ROW($AE26),5)))))))))","v":-2},{"$f":"IF($AE$1=\"Drillers\",OFFSET(Drillers!$L$2,ROW($AE26),6),IF($AE$1=\"Bulls\",OFFSET(Bulls!$L$2,ROW($AE26),6),IF($AE$1=\"Phantoms\",OFFSET(Phantoms!$L$2,ROW($AE26),6),IF($AE$1=\"Gators\",OFFSET(Gators!$L$2,ROW($AE26),6),IF($AE$1=\"Knights\",OFFSET(Knights!$L$2,ROW($AE26),6),IF($AE$1=\"Hornets\",OFFSET(Hornets!$L$2,ROW($AE26),6),IF($AE$1=\"Wolves\",OFFSET(Wolves!$L$2,ROW($AE26),6),IF($AE$1=\"Comets\",OFFSET(Comets!$L$2,ROW($AE26),6)))))))))","v":1},{"$f":"IF($AE$1=\"Drillers\",OFFSET(Drillers!$L$2,ROW($AE26),7),IF($AE$1=\"Bulls\",OFFSET(Bulls!$L$2,ROW($AE26),7),IF($AE$1=\"Phantoms\",OFFSET(Phantoms!$L$2,ROW($AE26),7),IF($AE$1=\"Gators\",OFFSET(Gators!$L$2,ROW($AE26),7),IF($AE$1=\"Knights\",OFFSET(Knights!$L$2,ROW($AE26),7),IF($AE$1=\"Hornets\",OFFSET(Hornets!$L$2,ROW($AE26),7),IF($AE$1=\"Wolves\",OFFSET(Wolves!$L$2,ROW($AE26),7),IF($AE$1=\"Comets\",OFFSET(Comets!$L$2,ROW($AE26),7)))))))))","v":0},{"$f":"IF($AE$1=\"Drillers\",OFFSET(Drillers!$L$2,ROW($AE26),8),IF($AE$1=\"Bulls\",OFFSET(Bulls!$L$2,ROW($AE26),8),IF($AE$1=\"Phantoms\",OFFSET(Phantoms!$L$2,ROW($AE26),8),IF($AE$1=\"Gators\",OFFSET(Gators!$L$2,ROW($AE26),8),IF($AE$1=\"Knights\",OFFSET(Knights!$L$2,ROW($AE26),8),IF($AE$1=\"Hornets\",OFFSET(Hornets!$L$2,ROW($AE26),8),IF($AE$1=\"Wolves\",OFFSET(Wolves!$L$2,ROW($AE26),8),IF($AE$1=\"Comets\",OFFSET(Comets!$L$2,ROW($AE26),8)))))))))","v":0},{"$f":"IF($AE$1=\"Drillers\",OFFSET(Drillers!$L$2,ROW($AE26),9),IF($AE$1=\"Bulls\",OFFSET(Bulls!$L$2,ROW($AE26),9),IF($AE$1=\"Phantoms\",OFFSET(Phantoms!$L$2,ROW($AE26),9),IF($AE$1=\"Gators\",OFFSET(Gators!$L$2,ROW($AE26),9),IF($AE$1=\"Knights\",OFFSET(Knights!$L$2,ROW($AE26),9),IF($AE$1=\"Hornets\",OFFSET(Hornets!$L$2,ROW($AE26),9),IF($AE$1=\"Wolves\",OFFSET(Wolves!$L$2,ROW($AE26),9),IF($AE$1=\"Comets\",OFFSET(Comets!$L$2,ROW($AE26),9)))))))))","v":0},{"$f":"IF($AE$1=\"Drillers\",OFFSET(Drillers!$L$2,ROW($AE26),10),IF($AE$1=\"Bulls\",OFFSET(Bulls!$L$2,ROW($AE26),10),IF($AE$1=\"Phantoms\",OFFSET(Phantoms!$L$2,ROW($AE26),10),IF($AE$1=\"Gators\",OFFSET(Gators!$L$2,ROW($AE26),10),IF($AE$1=\"Knights\",OFFSET(Knights!$L$2,ROW($AE26),10),IF($AE$1=\"Hornets\",OFFSET(Hornets!$L$2,ROW($AE26),10),IF($AE$1=\"Wolves\",OFFSET(Wolves!$L$2,ROW($AE26),10),IF($AE$1=\"Comets\",OFFSET(Comets!$L$2,ROW($AE26),10)))))))))","v":0},{"$f":"IF($AE$1=\"Drillers\",OFFSET(Drillers!$L$2,ROW($AE26),11),IF($AE$1=\"Bulls\",OFFSET(Bulls!$L$2,ROW($AE26),11),IF($AE$1=\"Phantoms\",OFFSET(Phantoms!$L$2,ROW($AE26),11),IF($AE$1=\"Gators\",OFFSET(Gators!$L$2,ROW($AE26),11),IF($AE$1=\"Knights\",OFFSET(Knights!$L$2,ROW($AE26),11),IF($AE$1=\"Hornets\",OFFSET(Hornets!$L$2,ROW($AE26),11),IF($AE$1=\"Wolves\",OFFSET(Wolves!$L$2,ROW($AE26),11),IF($AE$1=\"Comets\",OFFSET(Comets!$L$2,ROW($AE26),11)))))))))","v":0},{"$f":"IF($AE$1=\"Drillers\",OFFSET(Drillers!$L$2,ROW($AE26),12),IF($AE$1=\"Bulls\",OFFSET(Bulls!$L$2,ROW($AE26),12),IF($AE$1=\"Phantoms\",OFFSET(Phantoms!$L$2,ROW($AE26),12),IF($AE$1=\"Gators\",OFFSET(Gators!$L$2,ROW($AE26),12),IF($AE$1=\"Knights\",OFFSET(Knights!$L$2,ROW($AE26),12),IF($AE$1=\"Hornets\",OFFSET(Hornets!$L$2,ROW($AE26),12),IF($AE$1=\"Wolves\",OFFSET(Wolves!$L$2,ROW($AE26),12),IF($AE$1=\"Comets\",OFFSET(Comets!$L$2,ROW($AE26),12)))))))))","v":0},{"$f":"IF($AE$1=\"Drillers\",OFFSET(Drillers!$L$2,ROW($AE26),13),IF($AE$1=\"Bulls\",OFFSET(Bulls!$L$2,ROW($AE26),13),IF($AE$1=\"Phantoms\",OFFSET(Phantoms!$L$2,ROW($AE26),13),IF($AE$1=\"Gators\",OFFSET(Gators!$L$2,ROW($AE26),13),IF($AE$1=\"Knights\",OFFSET(Knights!$L$2,ROW($AE26),13),IF($AE$1=\"Hornets\",OFFSET(Hornets!$L$2,ROW($AE26),13),IF($AE$1=\"Wolves\",OFFSET(Wolves!$L$2,ROW($AE26),13),IF($AE$1=\"Comets\",OFFSET(Comets!$L$2,ROW($AE26),13)))))))))","v":0},{"$f":"IF($AE$1=\"Drillers\",OFFSET(Drillers!$L$2,ROW($AE26),14),IF($AE$1=\"Bulls\",OFFSET(Bulls!$L$2,ROW($AE26),14),IF($AE$1=\"Phantoms\",OFFSET(Phantoms!$L$2,ROW($AE26),14),IF($AE$1=\"Gators\",OFFSET(Gators!$L$2,ROW($AE26),14),IF($AE$1=\"Knights\",OFFSET(Knights!$L$2,ROW($AE26),14),IF($AE$1=\"Hornets\",OFFSET(Hornets!$L$2,ROW($AE26),14),IF($AE$1=\"Wolves\",OFFSET(Wolves!$L$2,ROW($AE26),14),IF($AE$1=\"Comets\",OFFSET(Comets!$L$2,ROW($AE26),14)))))))))","v":3},{"$f":"IF(AE$1=\"Drillers\",OFFSET(Drillers!$L$2,ROW(AE26),15),IF(AE$1=\"Bulls\",OFFSET(Bulls!$L$2,ROW(AE26),15),IF(AE$1=\"Phantoms\",OFFSET(Phantoms!$L$2,ROW(AE26),15),IF(AE$1=\"Gators\",OFFSET(Gators!$L$2,ROW(AE26),15),IF(AE$1=\"Knights\",OFFSET(Knights!$L$2,ROW(AE26),15),IF(AE$1=\"Hornets\",OFFSET(Hornets!$L$2,ROW(AE26),15),IF(AE$1=\"Wolves\",OFFSET(Wolves!$L$2,ROW(AE26),15),IF(AE$1=\"Comets\",OFFSET(Comets!$L$2,ROW(AE26),15)))))))))","v":0},{"$f":"IF($AE$1=\"Drillers\",OFFSET(Drillers!$L$2,ROW(AE26),16),IF($AE$1=\"Bulls\",OFFSET(Bulls!$L$2,ROW(AE26),16),IF($AE$1=\"Phantoms\",OFFSET(Phantoms!$L$2,ROW(AE26),16),IF($AE$1=\"Gators\",OFFSET(Gators!$L$2,ROW(AE26),16),IF($AE$1=\"Knights\",OFFSET(Knights!$L$2,ROW(AE26),16),IF($AE$1=\"Hornets\",OFFSET(Hornets!$L$2,ROW(AE26),16),IF($AE$1=\"Wolves\",OFFSET(Wolves!$L$2,ROW(AE26),16),IF($AE$1=\"Comets\",OFFSET(Comets!$L$2,ROW(AE26),16)))))))))","v":0}]
[{"$nulls":4},9,{"$f":"IF($F$1=\"Drillers\",OFFSET(Drillers!$L$2,ROW($F27),1),IF($F$1=\"Bulls\",OFFSET(Bulls!$L$2,ROW($F27),1),IF($F$1=\"Phantoms\",OFFSET(Phantoms!$L$2,ROW($F27),1),IF($F$1=\"Gators\",OFFSET(Gators!$L$2,ROW($F27),1),IF($F$1=\"Knights\",OFFSET(Knights!$L$2,ROW($F27),1),IF($F$1=\"Hornets\",OFFSET(Hornets!$L$2,ROW($F27),1),IF($F$1=\"Reds\",OFFSET(Comets!$L$2,ROW($F27),1),IF($F$1=\"Guardians\",OFFSET(Wolves!$L$2,ROW($F27),1)))))))))","v":"Marino"},{"$f":"IF($F$1=\"Drillers\",OFFSET(Drillers!$L$2,ROW($F27),2),IF($F$1=\"Bulls\",OFFSET(Bulls!$L$2,ROW($F27),2),IF($F$1=\"Phantoms\",OFFSET(Phantoms!$L$2,ROW($F27),2),IF($F$1=\"Gators\",OFFSET(Gators!$L$2,ROW($F27),2),IF($F$1=\"Knights\",OFFSET(Knights!$L$2,ROW($F27),2),IF($F$1=\"Hornets\",OFFSET(Hornets!$L$2,ROW($F27),2),IF($F$1=\"Reds\",OFFSET(Comets!$L$2,ROW($F27),2),IF($F$1=\"Guardians\",OFFSET(Wolves!$L$2,ROW($F27),2)))))))))","v":"Francisco"},{"$f":"IF($F$1=\"Drillers\",OFFSET(Drillers!$L$2,ROW($F27),3),IF($F$1=\"Bulls\",OFFSET(Bulls!$L$2,ROW($F27),3),IF($F$1=\"Phantoms\",OFFSET(Phantoms!$L$2,ROW($F27),3),IF($F$1=\"Gators\",OFFSET(Gators!$L$2,ROW($F27),3),IF($F$1=\"Knights\",OFFSET(Knights!$L$2,ROW($F27),3),IF($F$1=\"Hornets\",OFFSET(Hornets!$L$2,ROW($F27),3),IF($F$1=\"Guardians\",OFFSET(Wolves!$L$2,ROW($F27),3),IF($F$1=\"Reds\",OFFSET(Comets!$L$2,ROW($F27),3)))))))))","v":"R"},{"$f":"IF($F$1=\"Drillers\",OFFSET(Drillers!$L$2,ROW($F27),4),IF($F$1=\"Bulls\",OFFSET(Bulls!$L$2,ROW($F27),4),IF($F$1=\"Phantoms\",OFFSET(Phantoms!$L$2,ROW($F27),4),IF($F$1=\"Gators\",OFFSET(Gators!$L$2,ROW($F27),4),IF($F$1=\"Knights\",OFFSET(Knights!$L$2,ROW($F27),4),IF($F$1=\"Hornets\",OFFSET(Hornets!$L$2,ROW($F27),4),IF($F$1=\"Guardians\",OFFSET(Wolves!$L$2,ROW($F27),4),IF($F$1=\"Reds\",OFFSET(Comets!$L$2,ROW($F27),4)))))))))","v":-2},{"$f":"IF($F$1=\"Drillers\",OFFSET(Drillers!$L$2,ROW($F27),5),IF($F$1=\"Bulls\",OFFSET(Bulls!$L$2,ROW($F27),5),IF($F$1=\"Phantoms\",OFFSET(Phantoms!$L$2,ROW($F27),5),IF($F$1=\"Gators\",OFFSET(Gators!$L$2,ROW($F27),5),IF($F$1=\"Knights\",OFFSET(Knights!$L$2,ROW($F27),5),IF($F$1=\"Hornets\",OFFSET(Hornets!$L$2,ROW($F27),5),IF($F$1=\"Guardians\",OFFSET(Wolves!$L$2,ROW($F27),5),IF($F$1=\"Reds\",OFFSET(Comets!$L$2,ROW($F27),5)))))))))","v":-2},{"$f":"IF($F$1=\"Drillers\",OFFSET(Drillers!$L$2,ROW($F27),6),IF($F$1=\"Bulls\",OFFSET(Bulls!$L$2,ROW($F27),6),IF($F$1=\"Phantoms\",OFFSET(Phantoms!$L$2,ROW($F27),6),IF($F$1=\"Gators\",OFFSET(Gators!$L$2,ROW($F27),6),IF($F$1=\"Knights\",OFFSET(Knights!$L$2,ROW($F27),6),IF($F$1=\"Hornets\",OFFSET(Hornets!$L$2,ROW($F27),6),IF($F$1=\"Guardians\",OFFSET(Wolves!$L$2,ROW($F27),6),IF($F$1=\"Reds\",OFFSET(Comets!$L$2,ROW($F27),6)))))))))","v":4},{"$f":"IF($F$1=\"Drillers\",OFFSET(Drillers!$L$2,ROW(F27),7),IF($F$1=\"Bulls\",OFFSET(Bulls!$L$2,ROW(F27),7),IF($F$1=\"Phantoms\",OFFSET(Phantoms!$L$2,ROW(F27),7),IF($F$1=\"Gators\",OFFSET(Gators!$L$2,ROW(F27),7),IF($F$1=\"Knights\",OFFSET(Knights!$L$2,ROW(F27),7),IF($F$1=\"Hornets\",OFFSET(Hornets!$L$2,ROW(F27),7),IF($F$1=\"Guardians\",OFFSET(Wolves!$L$2,ROW(F27),7),IF($F$1=\"Reds\",OFFSET(Comets!$L$2,ROW(F27),7),))))))))","v":0},{"$f":"IF($F$1=\"Drillers\",OFFSET(Drillers!$L$2,ROW(F27),8),IF($F$1=\"Bulls\",OFFSET(Bulls!$L$2,ROW(F27),8),IF($F$1=\"Phantoms\",OFFSET(Phantoms!$L$2,ROW(F27),8),IF($F$1=\"Gators\",OFFSET(Gators!$L$2,ROW(F27),8),IF($F$1=\"Knights\",OFFSET(Knights!$L$2,ROW(F27),8),IF($F$1=\"Hornets\",OFFSET(Hornets!$L$2,ROW(F27),8),IF($F$1=\"Guardians\",OFFSET(Wolves!$L$2,ROW(F27),8),IF($F$1=\"Reds\",OFFSET(Comets!$L$2,ROW(F27),8)))))))))","v":0},{"$f":"IF($F$1=\"Drillers\",OFFSET(Drillers!$L$2,ROW($F27),9),IF($F$1=\"Bulls\",OFFSET(Bulls!$L$2,ROW($F27),9),IF($F$1=\"Phantoms\",OFFSET(Phantoms!$L$2,ROW($F27),9),IF($F$1=\"Gators\",OFFSET(Gators!$L$2,ROW($F27),9),IF($F$1=\"Knights\",OFFSET(Knights!$L$2,ROW($F27),9),IF($F$1=\"Hornets\",OFFSET(Hornets!$L$2,ROW(F27),9),IF($F$1=\"Guardians\",OFFSET(Wolves!$L$2,ROW($F27),9),IF($F$1=\"Reds\",OFFSET(Comets!$L$2,ROW($F27),9)))))))))","v":0},{"$f":"IF($F$1=\"Drillers\",OFFSET(Drillers!$L$2,ROW(F27),10),IF($F$1=\"Bulls\",OFFSET(Bulls!$L$2,ROW(F27),10),IF($F$1=\"Phantoms\",OFFSET(Phantoms!$L$2,ROW(F27),10),IF($F$1=\"Gators\",OFFSET(Gators!$L$2,ROW(F27),10),IF($F$1=\"Knights\",OFFSET(Knights!$L$2,ROW(F27),10),IF($F$1=\"Hornets\",OFFSET(Hornets!$L$2,ROW(F27),10),IF($F$1=\"Guardians\",OFFSET(Wolves!$L$2,ROW(F27),10),IF($F$1=\"Reds\",OFFSET(Comets!$L$2,ROW(F27),10)))))))))","v":0},{"$f":"IF($F$1=\"Drillers\",OFFSET(Drillers!$L$2,ROW(F27),11),IF($F$1=\"Bulls\",OFFSET(Bulls!$L$2,ROW(F27),11),IF($F$1=\"Phantoms\",OFFSET(Phantoms!$L$2,ROW(F27),11),IF($F$1=\"Gators\",OFFSET(Gators!$L$2,ROW(F27),11),IF($F$1=\"Knights\",OFFSET(Knights!$L$2,ROW(F27),11),IF($F$1=\"Hornets\",OFFSET(Hornets!$L$2,ROW(F27),11),IF($F$1=\"Guardians\",OFFSET(Wolves!$L$2,ROW(F27),11),IF($F$1=\"Drillers\",OFFSET(Drillers!$L$2,ROW(F27),11),IF($F$1=\"Reds\",OFFSET(Comets!$L$2,ROW(F27),11))))))))))","v":0},{"$f":"IF($F$1=\"Drillers\",OFFSET(Drillers!$L$2,ROW(F27),12),IF($F$1=\"Bulls\",OFFSET(Bulls!$L$2,ROW(F27),12),IF($F$1=\"Phantoms\",OFFSET(Phantoms!$L$2,ROW(F27),12),IF($F$1=\"Gators\",OFFSET(Gators!$L$2,ROW(F27),12),IF($F$1=\"Knights\",OFFSET(Knights!$L$2,ROW(F27),12),IF($F$1=\"Hornets\",OFFSET(Hornets!$L$2,ROW(F27),12),IF($F$1=\"Guardians\",OFFSET(Wolves!$L$2,ROW(F27),12),IF($F$1=\"Reds\",OFFSET(Comets!$L$2,ROW(F27),12),))))))))","v":0},{"$f":"IF($F$1=\"Drillers\",OFFSET(Drillers!$L$2,ROW(F27),13),IF($F$1=\"Bulls\",OFFSET(Bulls!$L$2,ROW(F27),13),IF($F$1=\"Phantoms\",OFFSET(Phantoms!$L$2,ROW(F27),13),IF($F$1=\"Gators\",OFFSET(Gators!$L$2,ROW(F27),13),IF($F$1=\"Knights\",OFFSET(Knights!$L$2,ROW(F27),13),IF($F$1=\"Hornets\",OFFSET(Hornets!$L$2,ROW(F27),13),IF($F$1=\"Guardians\",OFFSET(Wolves!$L$2,ROW(F27),13),IF($F$1=\"Reds\",OFFSET(Comets!$L$2,ROW(F27),13),))))))))","v":0},{"$f":"IF($F$1=\"Drillers\",OFFSET(Drillers!$L$2,ROW(F27),14),IF($F$1=\"Bulls\",OFFSET(Bulls!$L$2,ROW(F27),14),IF($F$1=\"Phantoms\",OFFSET(Phantoms!$L$2,ROW(F27),14),IF($F$1=\"Gators\",OFFSET(Gators!$L$2,ROW(F27),14),IF($F$1=\"Knights\",OFFSET(Knights!$L$2,ROW(F27),14),IF($F$1=\"Hornets\",OFFSET(Hornets!$L$2,ROW(F27),14),IF($F$1=\"Guardians\",OFFSET(Wolves!$L$2,ROW(F27),14,),IF($F$1=\"Reds\",OFFSET(Comets!$L$2,ROW(F27),14)))))))))","v":3},{"$f":"IF($F$1=\"Drillers\",OFFSET(Drillers!$L$2,ROW(F27),15),IF($F$1=\"Bulls\",OFFSET(Bulls!$L$2,ROW(F27),15),IF($F$1=\"Phantoms\",OFFSET(Phantoms!$L$2,ROW(F27),15),IF($F$1=\"Gators\",OFFSET(Gators!$L$2,ROW(F27),15),IF($F$1=\"Knights\",OFFSET(Knights!$L$2,ROW(F27),15),IF($F$1=\"Hornets\",OFFSET(Hornets!$L$2,ROW(F27),15),IF($F$1=\"Guardians\",OFFSET(Wolves!$L$2,ROW(F27),15),IF($F$1=\"Reds\",OFFSET(Comets!$L$2,ROW(F27),15)))))))))","v":0},{"$f":"IF($F$1=\"Drillers\",OFFSET(Drillers!$L$2,ROW(F27),16),IF($F$1=\"Bulls\",OFFSET(Bulls!$L$2,ROW(F27),16),IF($F$1=\"Phantoms\",OFFSET(Phantoms!$L$2,ROW(F27),16),IF($F$1=\"Gators\",OFFSET(Gators!$L$2,ROW(F27),16),IF($F$1=\"Knights\",OFFSET(Knights!$L$2,ROW(F27),16),IF($F$1=\"Hornets\",OFFSET(Hornets!$L$2,ROW(F27),16),IF($F$1=\"Guardians\",OFFSET(Wolves!$L$2,ROW(F27),16),IF($F$1=\"Reds\",OFFSET(Comets!$L$2,ROW(F27),16)))))))))","v":0},{"$nulls":8},9,{"$f":"IF($AE$1=\"Drillers\",OFFSET(Drillers!$L$2,ROW($AE27),1),IF($AE$1=\"Bulls\",OFFSET(Bulls!$L$2,ROW($AE27),1),IF($AE$1=\"Phantoms\",OFFSET(Phantoms!$L$2,ROW($AE27),1),IF($AE$1=\"Gators\",OFFSET(Gators!$L$2,ROW($AE27),1),IF($AE$1=\"Knights\",OFFSET(Knights!$L$2,ROW($AE27),1),IF($AE$1=\"Hornets\",OFFSET(Hornets!$L$2,ROW($AE27),1),IF($AE$1=\"Wolves\",OFFSET(Wolves!$L$2,ROW($AE27),1),IF(AE$1=\"Comets\",OFFSET(Comets!$L$2,ROW($AE27),1)))))))))","v":"Pierson"},{"$f":"IF($AE$1=\"Drillers\",OFFSET(Drillers!$L$2,ROW($AF27),2),IF($AE$1=\"Bulls\",OFFSET(Bulls!$L$2,ROW($AF27),2),IF($AE$1=\"Phantoms\",OFFSET(Phantoms!$L$2,ROW($AF27),2),IF($AE$1=\"Gators\",OFFSET(Gators!$L$2,ROW($AF27),2),IF($AE$1=\"Knights\",OFFSET(Knights!$L$2,ROW($AF27),2),IF($AE$1=\"Hornets\",OFFSET(Hornets!$L$2,ROW($AF27),2),IF($AE$1=\"Wolves\",OFFSET(Wolves!$L$2,ROW($AF27),2),IF($AE$1=\"Comets\",OFFSET(Comets!$L$2,ROW($AF27),2)))))))))","v":"Gary"},{"$f":"IF($AE$1=\"Drillers\",OFFSET(Drillers!$L$2,ROW($AE27),3),IF($AE$1=\"Bulls\",OFFSET(Bulls!$L$2,ROW($AE27),3),IF($AE$1=\"Phantoms\",OFFSET(Phantoms!$L$2,ROW($AE27),3),IF($AE$1=\"Gators\",OFFSET(Gators!$L$2,ROW($AE27),3),IF($AE$1=\"Knights\",OFFSET(Knights!$L$2,ROW($AE27),3),IF($AE$1=\"Hornets\",OFFSET(Hornets!$L$2,ROW($AE27),3),IF($AE$1=\"Wolves\",OFFSET(Wolves!$L$2,ROW($AE27),3),IF($AE$1=\"Comets\",OFFSET(Comets!$L$2,ROW($AE27),3)))))))))","v":"R"},{"$f":"IF($AE$1=\"Drillers\",OFFSET(Drillers!$L$2,ROW($AE27),4),IF($AE$1=\"Bulls\",OFFSET(Bulls!$L$2,ROW($AE27),4),IF($AE$1=\"Phantoms\",OFFSET(Phantoms!$L$2,ROW($AE27),4),IF($AE$1=\"Gators\",OFFSET(Gators!$L$2,ROW($AE27),4),IF($AE$1=\"Knights\",OFFSET(Knights!$L$2,ROW($AE27),4),IF($AE$1=\"Hornets\",OFFSET(Hornets!$L$2,ROW($AE27),4),IF($AE$1=\"Wolves\",OFFSET(Wolves!$L$2,ROW($AE27),4),IF($AE$1=\"Comets\",OFFSET(Comets!$L$2,ROW($AE27),4)))))))))","v":-2},{"$f":"IF($AE$1=\"Drillers\",OFFSET(Drillers!$L$2,ROW($AE27),5),IF($AE$1=\"Bulls\",OFFSET(Bulls!$L$2,ROW($AE27),5),IF($AE$1=\"Phantoms\",OFFSET(Phantoms!$L$2,ROW($AE27),5),IF($AE$1=\"Gators\",OFFSET(Gators!$L$2,ROW($AE27),5),IF($AE$1=\"Knights\",OFFSET(Knights!$L$2,ROW($AE27),5),IF($AE$1=\"Hornets\",OFFSET(Hornets!$L$2,ROW($AE27),5),IF($AE$1=\"Wolves\",OFFSET(Wolves!$L$2,ROW($AE27),5),IF($AE$1=\"Comets\",OFFSET(Comets!$L$2,ROW($AE27),5)))))))))","v":-3},{"$f":"IF($AE$1=\"Drillers\",OFFSET(Drillers!$L$2,ROW($AE27),6),IF($AE$1=\"Bulls\",OFFSET(Bulls!$L$2,ROW($AE27),6),IF($AE$1=\"Phantoms\",OFFSET(Phantoms!$L$2,ROW($AE27),6),IF($AE$1=\"Gators\",OFFSET(Gators!$L$2,ROW($AE27),6),IF($AE$1=\"Knights\",OFFSET(Knights!$L$2,ROW($AE27),6),IF($AE$1=\"Hornets\",OFFSET(Hornets!$L$2,ROW($AE27),6),IF($AE$1=\"Wolves\",OFFSET(Wolves!$L$2,ROW($AE27),6),IF($AE$1=\"Comets\",OFFSET(Comets!$L$2,ROW($AE27),6)))))))))","v":2},{"$f":"IF($AE$1=\"Drillers\",OFFSET(Drillers!$L$2,ROW($AE27),7),IF($AE$1=\"Bulls\",OFFSET(Bulls!$L$2,ROW($AE27),7),IF($AE$1=\"Phantoms\",OFFSET(Phantoms!$L$2,ROW($AE27),7),IF($AE$1=\"Gators\",OFFSET(Gators!$L$2,ROW($AE27),7),IF($AE$1=\"Knights\",OFFSET(Knights!$L$2,ROW($AE27),7),IF($AE$1=\"Hornets\",OFFSET(Hornets!$L$2,ROW($AE27),7),IF($AE$1=\"Wolves\",OFFSET(Wolves!$L$2,ROW($AE27),7),IF($AE$1=\"Comets\",OFFSET(Comets!$L$2,ROW($AE27),7)))))))))","v":0},{"$f":"IF($AE$1=\"Drillers\",OFFSET(Drillers!$L$2,ROW($AE27),8),IF($AE$1=\"Bulls\",OFFSET(Bulls!$L$2,ROW($AE27),8),IF($AE$1=\"Phantoms\",OFFSET(Phantoms!$L$2,ROW($AE27),8),IF($AE$1=\"Gators\",OFFSET(Gators!$L$2,ROW($AE27),8),IF($AE$1=\"Knights\",OFFSET(Knights!$L$2,ROW($AE27),8),IF($AE$1=\"Hornets\",OFFSET(Hornets!$L$2,ROW($AE27),8),IF($AE$1=\"Wolves\",OFFSET(Wolves!$L$2,ROW($AE27),8),IF($AE$1=\"Comets\",OFFSET(Comets!$L$2,ROW($AE27),8)))))))))","v":0},{"$f":"IF($AE$1=\"Drillers\",OFFSET(Drillers!$L$2,ROW($AE27),9),IF($AE$1=\"Bulls\",OFFSET(Bulls!$L$2,ROW($AE27),9),IF($AE$1=\"Phantoms\",OFFSET(Phantoms!$L$2,ROW($AE27),9),IF($AE$1=\"Gators\",OFFSET(Gators!$L$2,ROW($AE27),9),IF($AE$1=\"Knights\",OFFSET(Knights!$L$2,ROW($AE27),9),IF($AE$1=\"Hornets\",OFFSET(Hornets!$L$2,ROW($AE27),9),IF($AE$1=\"Wolves\",OFFSET(Wolves!$L$2,ROW($AE27),9),IF($AE$1=\"Comets\",OFFSET(Comets!$L$2,ROW($AE27),9)))))))))","v":0},{"$f":"IF($AE$1=\"Drillers\",OFFSET(Drillers!$L$2,ROW($AE27),10),IF($AE$1=\"Bulls\",OFFSET(Bulls!$L$2,ROW($AE27),10),IF($AE$1=\"Phantoms\",OFFSET(Phantoms!$L$2,ROW($AE27),10),IF($AE$1=\"Gators\",OFFSET(Gators!$L$2,ROW($AE27),10),IF($AE$1=\"Knights\",OFFSET(Knights!$L$2,ROW($AE27),10),IF($AE$1=\"Hornets\",OFFSET(Hornets!$L$2,ROW($AE27),10),IF($AE$1=\"Wolves\",OFFSET(Wolves!$L$2,ROW($AE27),10),IF($AE$1=\"Comets\",OFFSET(Comets!$L$2,ROW($AE27),10)))))))))","v":0},{"$f":"IF($AE$1=\"Drillers\",OFFSET(Drillers!$L$2,ROW($AE27),11),IF($AE$1=\"Bulls\",OFFSET(Bulls!$L$2,ROW($AE27),11),IF($AE$1=\"Phantoms\",OFFSET(Phantoms!$L$2,ROW($AE27),11),IF($AE$1=\"Gators\",OFFSET(Gators!$L$2,ROW($AE27),11),IF($AE$1=\"Knights\",OFFSET(Knights!$L$2,ROW($AE27),11),IF($AE$1=\"Hornets\",OFFSET(Hornets!$L$2,ROW($AE27),11),IF($AE$1=\"Wolves\",OFFSET(Wolves!$L$2,ROW($AE27),11),IF($AE$1=\"Comets\",OFFSET(Comets!$L$2,ROW($AE27),11)))))))))","v":0},{"$f":"IF($AE$1=\"Drillers\",OFFSET(Drillers!$L$2,ROW($AE27),12),IF($AE$1=\"Bulls\",OFFSET(Bulls!$L$2,ROW($AE27),12),IF($AE$1=\"Phantoms\",OFFSET(Phantoms!$L$2,ROW($AE27),12),IF($AE$1=\"Gators\",OFFSET(Gators!$L$2,ROW($AE27),12),IF($AE$1=\"Knights\",OFFSET(Knights!$L$2,ROW($AE27),12),IF($AE$1=\"Hornets\",OFFSET(Hornets!$L$2,ROW($AE27),12),IF($AE$1=\"Wolves\",OFFSET(Wolves!$L$2,ROW($AE27),12),IF($AE$1=\"Comets\",OFFSET(Comets!$L$2,ROW($AE27),12)))))))))","v":0},{"$f":"IF($AE$1=\"Drillers\",OFFSET(Drillers!$L$2,ROW($AE27),13),IF($AE$1=\"Bulls\",OFFSET(Bulls!$L$2,ROW($AE27),13),IF($AE$1=\"Phantoms\",OFFSET(Phantoms!$L$2,ROW($AE27),13),IF($AE$1=\"Gators\",OFFSET(Gators!$L$2,ROW($AE27),13),IF($AE$1=\"Knights\",OFFSET(Knights!$L$2,ROW($AE27),13),IF($AE$1=\"Hornets\",OFFSET(Hornets!$L$2,ROW($AE27),13),IF($AE$1=\"Wolves\",OFFSET(Wolves!$L$2,ROW($AE27),13),IF($AE$1=\"Comets\",OFFSET(Comets!$L$2,ROW($AE27),13)))))))))","v":0},{"$f":"IF($AE$1=\"Drillers\",OFFSET(Drillers!$L$2,ROW($AE27),14),IF($AE$1=\"Bulls\",OFFSET(Bulls!$L$2,ROW($AE27),14),IF($AE$1=\"Phantoms\",OFFSET(Phantoms!$L$2,ROW($AE27),14),IF($AE$1=\"Gators\",OFFSET(Gators!$L$2,ROW($AE27),14),IF($AE$1=\"Knights\",OFFSET(Knights!$L$2,ROW($AE27),14),IF($AE$1=\"Hornets\",OFFSET(Hornets!$L$2,ROW($AE27),14),IF($AE$1=\"Wolves\",OFFSET(Wolves!$L$2,ROW($AE27),14),IF($AE$1=\"Comets\",OFFSET(Comets!$L$2,ROW($AE27),14)))))))))","v":3},{"$f":"IF(AE$1=\"Drillers\",OFFSET(Drillers!$L$2,ROW(AE27),15),IF(AE$1=\"Bulls\",OFFSET(Bulls!$L$2,ROW(AE27),15),IF(AE$1=\"Phantoms\",OFFSET(Phantoms!$L$2,ROW(AE27),15),IF(AE$1=\"Gators\",OFFSET(Gators!$L$2,ROW(AE27),15),IF(AE$1=\"Knights\",OFFSET(Knights!$L$2,ROW(AE27),15),IF(AE$1=\"Hornets\",OFFSET(Hornets!$L$2,ROW(AE27),15),IF(AE$1=\"Wolves\",OFFSET(Wolves!$L$2,ROW(AE27),15),IF(AE$1=\"Comets\",OFFSET(Comets!$L$2,ROW(AE27),15)))))))))","v":0},{"$f":"IF($AE$1=\"Drillers\",OFFSET(Drillers!$L$2,ROW(AE27),16),IF($AE$1=\"Bulls\",OFFSET(Bulls!$L$2,ROW(AE27),16),IF($AE$1=\"Phantoms\",OFFSET(Phantoms!$L$2,ROW(AE27),16),IF($AE$1=\"Gators\",OFFSET(Gators!$L$2,ROW(AE27),16),IF($AE$1=\"Knights\",OFFSET(Knights!$L$2,ROW(AE27),16),IF($AE$1=\"Hornets\",OFFSET(Hornets!$L$2,ROW(AE27),16),IF($AE$1=\"Wolves\",OFFSET(Wolves!$L$2,ROW(AE27),16),IF($AE$1=\"Comets\",OFFSET(Comets!$L$2,ROW(AE27),16)))))))))","v":0}]
[{"$nulls":4},10,{"$f":"IF($F$1=\"Drillers\",OFFSET(Drillers!$L$2,ROW($F28),1),IF($F$1=\"Bulls\",OFFSET(Bulls!$L$2,ROW($F28),1),IF($F$1=\"Phantoms\",OFFSET(Phantoms!$L$2,ROW($F28),1),IF($F$1=\"Gators\",OFFSET(Gators!$L$2,ROW($F28),1),IF($F$1=\"Knights\",OFFSET(Knights!$L$2,ROW($F28),1),IF($F$1=\"Hornets\",OFFSET(Hornets!$L$2,ROW($F28),1),IF($F$1=\"Reds\",OFFSET(Comets!$L$2,ROW($F28),1),IF($F$1=\"Guardians\",OFFSET(Wolves!$L$2,ROW($F28),1)))))))))","v":"Zamora"},{"$f":"IF($F$1=\"Drillers\",OFFSET(Drillers!$L$2,ROW($F28),2),IF($F$1=\"Bulls\",OFFSET(Bulls!$L$2,ROW($F28),2),IF($F$1=\"Phantoms\",OFFSET(Phantoms!$L$2,ROW($F28),2),IF($F$1=\"Gators\",OFFSET(Gators!$L$2,ROW($F28),2),IF($F$1=\"Knights\",OFFSET(Knights!$L$2,ROW($F28),2),IF($F$1=\"Hornets\",OFFSET(Hornets!$L$2,ROW($F28),2),IF($F$1=\"Reds\",OFFSET(Comets!$L$2,ROW($F28),2),IF($F$1=\"Guardians\",OFFSET(Wolves!$L$2,ROW($F28),2)))))))))","v":"Juan"},{"$f":"IF($F$1=\"Drillers\",OFFSET(Drillers!$L$2,ROW($F28),3),IF($F$1=\"Bulls\",OFFSET(Bulls!$L$2,ROW($F28),3),IF($F$1=\"Phantoms\",OFFSET(Phantoms!$L$2,ROW($F28),3),IF($F$1=\"Gators\",OFFSET(Gators!$L$2,ROW($F28),3),IF($F$1=\"Knights\",OFFSET(Knights!$L$2,ROW($F28),3),IF($F$1=\"Hornets\",OFFSET(Hornets!$L$2,ROW($F28),3),IF($F$1=\"Guardians\",OFFSET(Wolves!$L$2,ROW($F28),3),IF($F$1=\"Reds\",OFFSET(Comets!$L$2,ROW($F28),3)))))))))","v":"L"},{"$f":"IF($F$1=\"Drillers\",OFFSET(Drillers!$L$2,ROW($F28),4),IF($F$1=\"Bulls\",OFFSET(Bulls!$L$2,ROW($F28),4),IF($F$1=\"Phantoms\",OFFSET(Phantoms!$L$2,ROW($F28),4),IF($F$1=\"Gators\",OFFSET(Gators!$L$2,ROW($F28),4),IF($F$1=\"Knights\",OFFSET(Knights!$L$2,ROW($F28),4),IF($F$1=\"Hornets\",OFFSET(Hornets!$L$2,ROW($F28),4),IF($F$1=\"Guardians\",OFFSET(Wolves!$L$2,ROW($F28),4),IF($F$1=\"Reds\",OFFSET(Comets!$L$2,ROW($F28),4)))))))))","v":-4},{"$f":"IF($F$1=\"Drillers\",OFFSET(Drillers!$L$2,ROW($F28),5),IF($F$1=\"Bulls\",OFFSET(Bulls!$L$2,ROW($F28),5),IF($F$1=\"Phantoms\",OFFSET(Phantoms!$L$2,ROW($F28),5),IF($F$1=\"Gators\",OFFSET(Gators!$L$2,ROW($F28),5),IF($F$1=\"Knights\",OFFSET(Knights!$L$2,ROW($F28),5),IF($F$1=\"Hornets\",OFFSET(Hornets!$L$2,ROW($F28),5),IF($F$1=\"Guardians\",OFFSET(Wolves!$L$2,ROW($F28),5),IF($F$1=\"Reds\",OFFSET(Comets!$L$2,ROW($F28),5)))))))))","v":-3},{"$f":"IF($F$1=\"Drillers\",OFFSET(Drillers!$L$2,ROW($F28),6),IF($F$1=\"Bulls\",OFFSET(Bulls!$L$2,ROW($F28),6),IF($F$1=\"Phantoms\",OFFSET(Phantoms!$L$2,ROW($F28),6),IF($F$1=\"Gators\",OFFSET(Gators!$L$2,ROW($F28),6),IF($F$1=\"Knights\",OFFSET(Knights!$L$2,ROW($F28),6),IF($F$1=\"Hornets\",OFFSET(Hornets!$L$2,ROW($F28),6),IF($F$1=\"Guardians\",OFFSET(Wolves!$L$2,ROW($F28),6),IF($F$1=\"Reds\",OFFSET(Comets!$L$2,ROW($F28),6)))))))))","v":3},{"$f":"IF($F$1=\"Drillers\",OFFSET(Drillers!$L$2,ROW(F28),7),IF($F$1=\"Bulls\",OFFSET(Bulls!$L$2,ROW(F28),7),IF($F$1=\"Phantoms\",OFFSET(Phantoms!$L$2,ROW(F28),7),IF($F$1=\"Gators\",OFFSET(Gators!$L$2,ROW(F28),7),IF($F$1=\"Knights\",OFFSET(Knights!$L$2,ROW(F28),7),IF($F$1=\"Hornets\",OFFSET(Hornets!$L$2,ROW(F28),7),IF($F$1=\"Guardians\",OFFSET(Wolves!$L$2,ROW(F28),7),IF($F$1=\"Reds\",OFFSET(Comets!$L$2,ROW(F28),7),))))))))","v":0},{"$f":"IF($F$1=\"Drillers\",OFFSET(Drillers!$L$2,ROW(F28),8),IF($F$1=\"Bulls\",OFFSET(Bulls!$L$2,ROW(F28),8),IF($F$1=\"Phantoms\",OFFSET(Phantoms!$L$2,ROW(F28),8),IF($F$1=\"Gators\",OFFSET(Gators!$L$2,ROW(F28),8),IF($F$1=\"Knights\",OFFSET(Knights!$L$2,ROW(F28),8),IF($F$1=\"Hornets\",OFFSET(Hornets!$L$2,ROW(F28),8),IF($F$1=\"Guardians\",OFFSET(Wolves!$L$2,ROW(F28),8),IF($F$1=\"Reds\",OFFSET(Comets!$L$2,ROW(F28),8)))))))))","v":0},{"$f":"IF($F$1=\"Drillers\",OFFSET(Drillers!$L$2,ROW($F28),9),IF($F$1=\"Bulls\",OFFSET(Bulls!$L$2,ROW($F28),9),IF($F$1=\"Phantoms\",OFFSET(Phantoms!$L$2,ROW($F28),9),IF($F$1=\"Gators\",OFFSET(Gators!$L$2,ROW($F28),9),IF($F$1=\"Knights\",OFFSET(Knights!$L$2,ROW($F28),9),IF($F$1=\"Hornets\",OFFSET(Hornets!$L$2,ROW(F28),9),IF($F$1=\"Guardians\",OFFSET(Wolves!$L$2,ROW($F28),9),IF($F$1=\"Reds\",OFFSET(Comets!$L$2,ROW($F28),9)))))))))","v":0},{"$f":"IF($F$1=\"Drillers\",OFFSET(Drillers!$L$2,ROW(F28),10),IF($F$1=\"Bulls\",OFFSET(Bulls!$L$2,ROW(F28),10),IF($F$1=\"Phantoms\",OFFSET(Phantoms!$L$2,ROW(F28),10),IF($F$1=\"Gators\",OFFSET(Gators!$L$2,ROW(F28),10),IF($F$1=\"Knights\",OFFSET(Knights!$L$2,ROW(F28),10),IF($F$1=\"Hornets\",OFFSET(Hornets!$L$2,ROW(F28),10),IF($F$1=\"Guardians\",OFFSET(Wolves!$L$2,ROW(F28),10),IF($F$1=\"Reds\",OFFSET(Comets!$L$2,ROW(F28),10)))))))))","v":0},{"$f":"IF($F$1=\"Drillers\",OFFSET(Drillers!$L$2,ROW(F28),11),IF($F$1=\"Bulls\",OFFSET(Bulls!$L$2,ROW(F28),11),IF($F$1=\"Phantoms\",OFFSET(Phantoms!$L$2,ROW(F28),11),IF($F$1=\"Gators\",OFFSET(Gators!$L$2,ROW(F28),11),IF($F$1=\"Knights\",OFFSET(Knights!$L$2,ROW(F28),11),IF($F$1=\"Hornets\",OFFSET(Hornets!$L$2,ROW(F28),11),IF($F$1=\"Guardians\",OFFSET(Wolves!$L$2,ROW(F28),11),IF($F$1=\"Drillers\",OFFSET(Drillers!$L$2,ROW(F28),11),IF($F$1=\"Reds\",OFFSET(Comets!$L$2,ROW(F28),11))))))))))","v":0},{"$f":"IF($F$1=\"Drillers\",OFFSET(Drillers!$L$2,ROW(F28),12),IF($F$1=\"Bulls\",OFFSET(Bulls!$L$2,ROW(F28),12),IF($F$1=\"Phantoms\",OFFSET(Phantoms!$L$2,ROW(F28),12),IF($F$1=\"Gators\",OFFSET(Gators!$L$2,ROW(F28),12),IF($F$1=\"Knights\",OFFSET(Knights!$L$2,ROW(F28),12),IF($F$1=\"Hornets\",OFFSET(Hornets!$L$2,ROW(F28),12),IF($F$1=\"Guardians\",OFFSET(Wolves!$L$2,ROW(F28),12),IF($F$1=\"Reds\",OFFSET(Comets!$L$2,ROW(F28),12),))))))))","v":0},{"$f":"IF($F$1=\"Drillers\",OFFSET(Drillers!$L$2,ROW(F28),13),IF($F$1=\"Bulls\",OFFSET(Bulls!$L$2,ROW(F28),13),IF($F$1=\"Phantoms\",OFFSET(Phantoms!$L$2,ROW(F28),13),IF($F$1=\"Gators\",OFFSET(Gators!$L$2,ROW(F28),13),IF($F$1=\"Knights\",OFFSET(Knights!$L$2,ROW(F28),13),IF($F$1=\"Hornets\",OFFSET(Hornets!$L$2,ROW(F28),13),IF($F$1=\"Guardians\",OFFSET(Wolves!$L$2,ROW(F28),13),IF($F$1=\"Reds\",OFFSET(Comets!$L$2,ROW(F28),13),))))))))","v":0},{"$f":"IF($F$1=\"Drillers\",OFFSET(Drillers!$L$2,ROW(F28),14),IF($F$1=\"Bulls\",OFFSET(Bulls!$L$2,ROW(F28),14),IF($F$1=\"Phantoms\",OFFSET(Phantoms!$L$2,ROW(F28),14),IF($F$1=\"Gators\",OFFSET(Gators!$L$2,ROW(F28),14),IF($F$1=\"Knights\",OFFSET(Knights!$L$2,ROW(F28),14),IF($F$1=\"Hornets\",OFFSET(Hornets!$L$2,ROW(F28),14),IF($F$1=\"Guardians\",OFFSET(Wolves!$L$2,ROW(F28),14,),IF($F$1=\"Reds\",OFFSET(Comets!$L$2,ROW(F28),14)))))))))","v":4},{"$f":"IF($F$1=\"Drillers\",OFFSET(Drillers!$L$2,ROW(F28),15),IF($F$1=\"Bulls\",OFFSET(Bulls!$L$2,ROW(F28),15),IF($F$1=\"Phantoms\",OFFSET(Phantoms!$L$2,ROW(F28),15),IF($F$1=\"Gators\",OFFSET(Gators!$L$2,ROW(F28),15),IF($F$1=\"Knights\",OFFSET(Knights!$L$2,ROW(F28),15),IF($F$1=\"Hornets\",OFFSET(Hornets!$L$2,ROW(F28),15),IF($F$1=\"Guardians\",OFFSET(Wolves!$L$2,ROW(F28),15),IF($F$1=\"Reds\",OFFSET(Comets!$L$2,ROW(F28),15)))))))))","v":0},{"$f":"IF($F$1=\"Drillers\",OFFSET(Drillers!$L$2,ROW(F28),16),IF($F$1=\"Bulls\",OFFSET(Bulls!$L$2,ROW(F28),16),IF($F$1=\"Phantoms\",OFFSET(Phantoms!$L$2,ROW(F28),16),IF($F$1=\"Gators\",OFFSET(Gators!$L$2,ROW(F28),16),IF($F$1=\"Knights\",OFFSET(Knights!$L$2,ROW(F28),16),IF($F$1=\"Hornets\",OFFSET(Hornets!$L$2,ROW(F28),16),IF($F$1=\"Guardians\",OFFSET(Wolves!$L$2,ROW(F28),16),IF($F$1=\"Reds\",OFFSET(Comets!$L$2,ROW(F28),16)))))))))","v":0},{"$nulls":8},10,{"$f":"IF($AE$1=\"Drillers\",OFFSET(Drillers!$L$2,ROW($AE28),1),IF($AE$1=\"Bulls\",OFFSET(Bulls!$L$2,ROW($AE28),1),IF($AE$1=\"Phantoms\",OFFSET(Phantoms!$L$2,ROW($AE28),1),IF($AE$1=\"Gators\",OFFSET(Gators!$L$2,ROW($AE28),1),IF($AE$1=\"Knights\",OFFSET(Knights!$L$2,ROW($AE28),1),IF($AE$1=\"Hornets\",OFFSET(Hornets!$L$2,ROW($AE28),1),IF($AE$1=\"Wolves\",OFFSET(Wolves!$L$2,ROW($AE28),1),IF(AE$1=\"Comets\",OFFSET(Comets!$L$2,ROW($AE28),1)))))))))","v":"Stanford"},{"$f":"IF($AE$1=\"Drillers\",OFFSET(Drillers!$L$2,ROW($AF28),2),IF($AE$1=\"Bulls\",OFFSET(Bulls!$L$2,ROW($AF28),2),IF($AE$1=\"Phantoms\",OFFSET(Phantoms!$L$2,ROW($AF28),2),IF($AE$1=\"Gators\",OFFSET(Gators!$L$2,ROW($AF28),2),IF($AE$1=\"Knights\",OFFSET(Knights!$L$2,ROW($AF28),2),IF($AE$1=\"Hornets\",OFFSET(Hornets!$L$2,ROW($AF28),2),IF($AE$1=\"Wolves\",OFFSET(Wolves!$L$2,ROW($AF28),2),IF($AE$1=\"Comets\",OFFSET(Comets!$L$2,ROW($AF28),2)))))))))","v":"Edgar"},{"$f":"IF($AE$1=\"Drillers\",OFFSET(Drillers!$L$2,ROW($AE28),3),IF($AE$1=\"Bulls\",OFFSET(Bulls!$L$2,ROW($AE28),3),IF($AE$1=\"Phantoms\",OFFSET(Phantoms!$L$2,ROW($AE28),3),IF($AE$1=\"Gators\",OFFSET(Gators!$L$2,ROW($AE28),3),IF($AE$1=\"Knights\",OFFSET(Knights!$L$2,ROW($AE28),3),IF($AE$1=\"Hornets\",OFFSET(Hornets!$L$2,ROW($AE28),3),IF($AE$1=\"Wolves\",OFFSET(Wolves!$L$2,ROW($AE28),3),IF($AE$1=\"Comets\",OFFSET(Comets!$L$2,ROW($AE28),3)))))))))","v":"R"},{"$f":"IF($AE$1=\"Drillers\",OFFSET(Drillers!$L$2,ROW($AE28),4),IF($AE$1=\"Bulls\",OFFSET(Bulls!$L$2,ROW($AE28),4),IF($AE$1=\"Phantoms\",OFFSET(Phantoms!$L$2,ROW($AE28),4),IF($AE$1=\"Gators\",OFFSET(Gators!$L$2,ROW($AE28),4),IF($AE$1=\"Knights\",OFFSET(Knights!$L$2,ROW($AE28),4),IF($AE$1=\"Hornets\",OFFSET(Hornets!$L$2,ROW($AE28),4),IF($AE$1=\"Wolves\",OFFSET(Wolves!$L$2,ROW($AE28),4),IF($AE$1=\"Comets\",OFFSET(Comets!$L$2,ROW($AE28),4)))))))))","v":-1},{"$f":"IF($AE$1=\"Drillers\",OFFSET(Drillers!$L$2,ROW($AE28),5),IF($AE$1=\"Bulls\",OFFSET(Bulls!$L$2,ROW($AE28),5),IF($AE$1=\"Phantoms\",OFFSET(Phantoms!$L$2,ROW($AE28),5),IF($AE$1=\"Gators\",OFFSET(Gators!$L$2,ROW($AE28),5),IF($AE$1=\"Knights\",OFFSET(Knights!$L$2,ROW($AE28),5),IF($AE$1=\"Hornets\",OFFSET(Hornets!$L$2,ROW($AE28),5),IF($AE$1=\"Wolves\",OFFSET(Wolves!$L$2,ROW($AE28),5),IF($AE$1=\"Comets\",OFFSET(Comets!$L$2,ROW($AE28),5)))))))))","v":-2},{"$f":"IF($AE$1=\"Drillers\",OFFSET(Drillers!$L$2,ROW($AE28),6),IF($AE$1=\"Bulls\",OFFSET(Bulls!$L$2,ROW($AE28),6),IF($AE$1=\"Phantoms\",OFFSET(Phantoms!$L$2,ROW($AE28),6),IF($AE$1=\"Gators\",OFFSET(Gators!$L$2,ROW($AE28),6),IF($AE$1=\"Knights\",OFFSET(Knights!$L$2,ROW($AE28),6),IF($AE$1=\"Hornets\",OFFSET(Hornets!$L$2,ROW($AE28),6),IF($AE$1=\"Wolves\",OFFSET(Wolves!$L$2,ROW($AE28),6),IF($AE$1=\"Comets\",OFFSET(Comets!$L$2,ROW($AE28),6)))))))))","v":1},{"$f":"IF($AE$1=\"Drillers\",OFFSET(Drillers!$L$2,ROW($AE28),7),IF($AE$1=\"Bulls\",OFFSET(Bulls!$L$2,ROW($AE28),7),IF($AE$1=\"Phantoms\",OFFSET(Phantoms!$L$2,ROW($AE28),7),IF($AE$1=\"Gators\",OFFSET(Gators!$L$2,ROW($AE28),7),IF($AE$1=\"Knights\",OFFSET(Knights!$L$2,ROW($AE28),7),IF($AE$1=\"Hornets\",OFFSET(Hornets!$L$2,ROW($AE28),7),IF($AE$1=\"Wolves\",OFFSET(Wolves!$L$2,ROW($AE28),7),IF($AE$1=\"Comets\",OFFSET(Comets!$L$2,ROW($AE28),7)))))))))","v":0},{"$f":"IF($AE$1=\"Drillers\",OFFSET(Drillers!$L$2,ROW($AE28),8),IF($AE$1=\"Bulls\",OFFSET(Bulls!$L$2,ROW($AE28),8),IF($AE$1=\"Phantoms\",OFFSET(Phantoms!$L$2,ROW($AE28),8),IF($AE$1=\"Gators\",OFFSET(Gators!$L$2,ROW($AE28),8),IF($AE$1=\"Knights\",OFFSET(Knights!$L$2,ROW($AE28),8),IF($AE$1=\"Hornets\",OFFSET(Hornets!$L$2,ROW($AE28),8),IF($AE$1=\"Wolves\",OFFSET(Wolves!$L$2,ROW($AE28),8),IF($AE$1=\"Comets\",OFFSET(Comets!$L$2,ROW($AE28),8)))))))))","v":0},{"$f":"IF($AE$1=\"Drillers\",OFFSET(Drillers!$L$2,ROW($AE28),9),IF($AE$1=\"Bulls\",OFFSET(Bulls!$L$2,ROW($AE28),9),IF($AE$1=\"Phantoms\",OFFSET(Phantoms!$L$2,ROW($AE28),9),IF($AE$1=\"Gators\",OFFSET(Gators!$L$2,ROW($AE28),9),IF($AE$1=\"Knights\",OFFSET(Knights!$L$2,ROW($AE28),9),IF($AE$1=\"Hornets\",OFFSET(Hornets!$L$2,ROW($AE28),9),IF($AE$1=\"Wolves\",OFFSET(Wolves!$L$2,ROW($AE28),9),IF($AE$1=\"Comets\",OFFSET(Comets!$L$2,ROW($AE28),9)))))))))","v":0},{"$f":"IF($AE$1=\"Drillers\",OFFSET(Drillers!$L$2,ROW($AE28),10),IF($AE$1=\"Bulls\",OFFSET(Bulls!$L$2,ROW($AE28),10),IF($AE$1=\"Phantoms\",OFFSET(Phantoms!$L$2,ROW($AE28),10),IF($AE$1=\"Gators\",OFFSET(Gators!$L$2,ROW($AE28),10),IF($AE$1=\"Knights\",OFFSET(Knights!$L$2,ROW($AE28),10),IF($AE$1=\"Hornets\",OFFSET(Hornets!$L$2,ROW($AE28),10),IF($AE$1=\"Wolves\",OFFSET(Wolves!$L$2,ROW($AE28),10),IF($AE$1=\"Comets\",OFFSET(Comets!$L$2,ROW($AE28),10)))))))))","v":0},{"$f":"IF($AE$1=\"Drillers\",OFFSET(Drillers!$L$2,ROW($AE28),11),IF($AE$1=\"Bulls\",OFFSET(Bulls!$L$2,ROW($AE28),11),IF($AE$1=\"Phantoms\",OFFSET(Phantoms!$L$2,ROW($AE28),11),IF($AE$1=\"Gators\",OFFSET(Gators!$L$2,ROW($AE28),11),IF($AE$1=\"Knights\",OFFSET(Knights!$L$2,ROW($AE28),11),IF($AE$1=\"Hornets\",OFFSET(Hornets!$L$2,ROW($AE28),11),IF($AE$1=\"Wolves\",OFFSET(Wolves!$L$2,ROW($AE28),11),IF($AE$1=\"Comets\",OFFSET(Comets!$L$2,ROW($AE28),11)))))))))","v":0},{"$f":"IF($AE$1=\"Drillers\",OFFSET(Drillers!$L$2,ROW($AE28),12),IF($AE$1=\"Bulls\",OFFSET(Bulls!$L$2,ROW($AE28),12),IF($AE$1=\"Phantoms\",OFFSET(Phantoms!$L$2,ROW($AE28),12),IF($AE$1=\"Gators\",OFFSET(Gators!$L$2,ROW($AE28),12),IF($AE$1=\"Knights\",OFFSET(Knights!$L$2,ROW($AE28),12),IF($AE$1=\"Hornets\",OFFSET(Hornets!$L$2,ROW($AE28),12),IF($AE$1=\"Wolves\",OFFSET(Wolves!$L$2,ROW($AE28),12),IF($AE$1=\"Comets\",OFFSET(Comets!$L$2,ROW($AE28),12)))))))))","v":0},{"$f":"IF($AE$1=\"Drillers\",OFFSET(Drillers!$L$2,ROW($AE28),13),IF($AE$1=\"Bulls\",OFFSET(Bulls!$L$2,ROW($AE28),13),IF($AE$1=\"Phantoms\",OFFSET(Phantoms!$L$2,ROW($AE28),13),IF($AE$1=\"Gators\",OFFSET(Gators!$L$2,ROW($AE28),13),IF($AE$1=\"Knights\",OFFSET(Knights!$L$2,ROW($AE28),13),IF($AE$1=\"Hornets\",OFFSET(Hornets!$L$2,ROW($AE28),13),IF($AE$1=\"Wolves\",OFFSET(Wolves!$L$2,ROW($AE28),13),IF($AE$1=\"Comets\",OFFSET(Comets!$L$2,ROW($AE28),13)))))))))","v":0},{"$f":"IF($AE$1=\"Drillers\",OFFSET(Drillers!$L$2,ROW($AE28),14),IF($AE$1=\"Bulls\",OFFSET(Bulls!$L$2,ROW($AE28),14),IF($AE$1=\"Phantoms\",OFFSET(Phantoms!$L$2,ROW($AE28),14),IF($AE$1=\"Gators\",OFFSET(Gators!$L$2,ROW($AE28),14),IF($AE$1=\"Knights\",OFFSET(Knights!$L$2,ROW($AE28),14),IF($AE$1=\"Hornets\",OFFSET(Hornets!$L$2,ROW($AE28),14),IF($AE$1=\"Wolves\",OFFSET(Wolves!$L$2,ROW($AE28),14),IF($AE$1=\"Comets\",OFFSET(Comets!$L$2,ROW($AE28),14)))))))))","v":2},{"$f":"IF(AE$1=\"Drillers\",OFFSET(Drillers!$L$2,ROW(AE28),15),IF(AE$1=\"Bulls\",OFFSET(Bulls!$L$2,ROW(AE28),15),IF(AE$1=\"Phantoms\",OFFSET(Phantoms!$L$2,ROW(AE28),15),IF(AE$1=\"Gators\",OFFSET(Gators!$L$2,ROW(AE28),15),IF(AE$1=\"Knights\",OFFSET(Knights!$L$2,ROW(AE28),15),IF(AE$1=\"Hornets\",OFFSET(Hornets!$L$2,ROW(AE28),15),IF(AE$1=\"Wolves\",OFFSET(Wolves!$L$2,ROW(AE28),15),IF(AE$1=\"Comets\",OFFSET(Comets!$L$2,ROW(AE28),15)))))))))","v":0},{"$f":"IF($AE$1=\"Drillers\",OFFSET(Drillers!$L$2,ROW(AE28),16),IF($AE$1=\"Bulls\",OFFSET(Bulls!$L$2,ROW(AE28),16),IF($AE$1=\"Phantoms\",OFFSET(Phantoms!$L$2,ROW(AE28),16),IF($AE$1=\"Gators\",OFFSET(Gators!$L$2,ROW(AE28),16),IF($AE$1=\"Knights\",OFFSET(Knights!$L$2,ROW(AE28),16),IF($AE$1=\"Hornets\",OFFSET(Hornets!$L$2,ROW(AE28),16),IF($AE$1=\"Wolves\",OFFSET(Wolves!$L$2,ROW(AE28),16),IF($AE$1=\"Comets\",OFFSET(Comets!$L$2,ROW(AE28),16)))))))))","v":0}]
[]
[{"$nulls":8},"VIS",{"$nulls":25},"HOM"]

{"sheet":"Stats","index":3,"n_rows":5,"n_cols":10,"rows_kept":5}
["Roll","Visitors","CF","Roll","Home","CF",null,null,"Vis","Hom"]
[{"$nulls":7},"Pitcher",{"$f":"COUNTIF(C2:C130,\"Pitcher\")","v":0},{"$f":"COUNTIF($F$2:$F$130,\"Pitcher\")","v":0}]
[{"$nulls":7},"Batter",{"$f":"COUNTIF(C2:C125,\"Batter\")","v":0},{"$f":"COUNTIF($F$2:$F$130,\"Pitcher\")","v":0}]
[{"$nulls":7},"<6",{"$f":"COUNTIF($A$2:$A$125,\"<6\")","v":0},{"$f":"COUNTIF($D$2:$D$125,\"<6\")","v":0}]
[{"$nulls":7},">5",{"$f":"COUNTIF($A$2:$A$125,\">5\")","v":0},{"$f":"COUNTIF($D$2:$D$125,\">5\")","v":0}]

{"sheet":"Sheet5","index":4,"n_rows":59,"n_cols":67,"rows_kept":59,"merged":[[1,51,3,72]]}
[{"$f":"RAND()","v":0.12849741073280097},9,{"$nulls":24},"Last","First","TM","TYPE","GMS","LHP","RHP","S","F","ST","RRG","RFG",{"$nulls":4},1,"Poise",null,"H","S"]
[0.7902711073299467,1,{"$nulls":24},"McGreggor","Rob","Bulls",5,"S",{"$nulls":6},"S",{"$nulls":5},1,null,0,-1,{"$nulls":3},{"$f":"B2","v":1},{"$f":"VLOOKUP(Sheet5!$AY$2,Sheet4!$R$2:$AO$29,2,FALSE)","v":"Batter bunts ball right back to the pitcher.  Pitcher fields the ball cleanly and has choice of play on any runner or batter.  For corresponding offensive player play out on SAC BUNT runner or SAC BUNT HITTER based on the pitcher's DEFENSE."}]
[0.2321896093765038,3,{"$nulls":24},"Correa","James","Phantoms",4,10,"-2",-2,-1,null,-1,57,73,{"$nulls":5},2,null,0,-1]
[0.10241222357286917,8,{"$nulls":24},"Deacon","Jamie","Phantoms",4,9,"-2","-2","-1",null,"-1",79,95,{"$nulls":5},3,null,1,-1]
[0.873927930107264,2,{"$nulls":41},4,null,0,0]
[0.201478080981895,7,{"$nulls":41},5,null,0,0]
[0.7219568805952322,4,{"$nulls":41},6,null,0,-1,{"$nulls":18},1,"S2/RH/SBR"]
[0.9694210319915942,6,{"$nulls":41},7,null,0,-1,{"$nulls":18},2,"S3/R3/SBH"]
[0.6674896488449559,5,{"$nulls":41},8,null,0,0,{"$nulls":18},3,"DP23/R2"]
[0.7090412351194294,10,{"$nulls":41},9,null,1,-1,{"$nulls":18},4,"DP1/R1"]
[{"$nulls":43},10,null,0,-1,{"$nulls":4},1,2,3,4,5,6,7,8,9,10]
[{"$f":"RAND()","v":0.25411394142029464},9,{"$nulls":48},1,1,2,3,4,5,6,7,8,9,"B"]
[0.15415359524455718,2,{"$nulls":40},2,"Poise",null,"H","S",{"$nulls":3},2,"B",9,8,7,6,5,4,3,2,1]
[0.2098892649121058,3,{"$nulls":41},1,null,1,-1,{"$nulls":3},3,5,4,3,2,1,6,7,8,9,"B"]
[0.6299317080598072,8,{"$nulls":41},2,null,0,0,{"$nulls":3},4,6,7,8,9,"B",1,2,3,4,5]
[0.846438105742032,7,{"$nulls":41},3,null,0,-1,{"$nulls":3},5,8,7,"B",6,9,3,2,1,5,4]
[0.4321756244468029,4,{"$nulls":41},4,null,0,0,{"$nulls":3},6,1,2,3,4,5,6,7,8,9,"B"]
[0.8638755904445611,10,{"$nulls":41},5,null,1,-1,{"$nulls":3},7,"B",9,8,7,6,5,4,3,2,1]
[0.7508070426407703,1,{"$nulls":41},6,null,0,0,{"$nulls":3},8,5,4,3,2,1,6,7,8,9,"B"]
[0.7072079097815434,6,{"$nulls":41},7,null,0,-1,{"$nulls":3},9,6,7,8,9,"B",1,2,3,4,5]
[0.7354826018464794,5,{"$nulls":41},8,null,0,0,{"$nulls":3},10,8,7,"B",6,9,3,2,1,5,4]
[{"$nulls":43},9,null,1,-1]
[{"$nulls":43},10,null,0,-1]
[{"$nulls":50},"D20"]
[{"$nulls":42},3,"Poise",null,"H","S",{"$nulls":3},"D1","D14","R"]
[{"$nulls":43},1,null,0,-1,{"$nulls":3},"D15","D17","HBP"]
[{"$nulls":43},2,null,1,0,{"$nulls":3},"D18","D20","WP or PB (runners must be on base)-- otherwise, HBP."]
[{"$nulls":43},3,null,0,-1]
[{"$nulls":43},4,null,1,0]
[{"$nulls":43},5,null,0,0]
[{"$nulls":43},6,null,1,-1]
[{"$nulls":43},7,null,0,-1]
[{"$nulls":43},8,null,0,0]
[{"$nulls":43},9,null,0,-1]
[{"$nulls":43},10,null,1,0]
[]
[{"$nulls":42},4,"Poise",null,"H","S"]
[{"$nulls":43},1,null,1,-1]
[{"$nulls":43},2,null,0,0]
[{"$nulls":43},3,null,0,0]
[{"$nulls":43},4,null,1,-1]
[{"$nulls":43},5,null,1,0]
[{"$nulls":43},6,null,0,0]
[{"$nulls":43},7,null,1,-1]
[{"$nulls":43},8,null,1,0]
[{"$nulls":43},9,null,0,0]
[{"$nulls":43},10,null,1,-1]
[]
[{"$nulls":42},5,"Poise",null,"H","S",{"$nulls":4},"Pregame scratches: Each team rolls a D10.  A D7 or above means no check on durability/rest chart.  On a D6 or lower, the team will have to roll, as per usual."]
[{"$nulls":43},1,null,0,-1]
[{"$nulls":43},2,null,1,0]
[{"$nulls":43},3,null,0,-1]
[{"$nulls":43},4,null,1,0]
[{"$nulls":43},5,null,1,0]
[{"$nulls":43},6,null,0,0]
[{"$nulls":43},7,null,1,-1]
[{"$nulls":43},8,null,1,0]
[{"$nulls":43},9,null,0,0]
[{"$nulls":43},10,null,1,0]

{"sheet":"Bulls","index":5,"n_rows":30,"n_cols":32,"rows_kept":30,"merged":[[0,2,0,4],[1,6,1,7],[2,2,5,2],[2,3,5,3],[2,4,5,4],[6,6,6,7],[7,2,10,2],[7,3,10,3],[7,4,10,4],[11,6,11,7],[12,2,15,2],[12,3,15,3],[12,4,15,4],[16,6,16,7],[17,2,20,2],[17,3,20,3],[17,4,20,4],[21,6,21,7],[22,2,25,2],[22,3,25,3],[22,4,25,4]]}
["Bulls",{"$nulls":11},"Last","First","B",null,"vsL","vsR","Bu","S","J","F","A","2P",null,"2D","ST","GR","P"]
[]
[{"$nulls":11},"1","Moody","Paul","R","CF","3","3","2","4","4",4,4,"LF",null,2,null,null,3]
[{"$nulls":11},"2","Ramey","Leroy","R","LF","3","3","1","4","4",3,4,"RF",null,2,null,null,4]
[{"$nulls":11},"3","Bryant ","Dave","R","RF","4","3","1","2","2",3,2,"LF","CF",2,null,null,5]
[{"$nulls":11},"4","Carmona","Pancho","R","1B","3","2","1",2,"1",5,2,"3B",null,2,null,null,5]
[{"$nulls":11},"5","Ventura","Juan","R","DH","3","2","2","2","2",2,2,"1B",null,1,null,null,4]
[{"$nulls":11},"6","Phelps","Carl","B","3B","2","3","1","3","3",4,3,"SS",null,2,null,null,5]
[{"$nulls":11},"7","McKenzie","Craig","L","C","2","3","2","2","1",3,1,"SS",null,2,null,null,3]
[{"$nulls":11},"8","Lane ","Chris","L","2B","2","3","2","4","2",3,3,"SS",null,2,null,null,2]
[{"$nulls":11},"9","Bartlett","Robert","L","SS","1","2","4","4","4",5,4,"2B",null,3,null,null,1]
[{"$nulls":11},"10","Scruby","Bill","R","1B","3","3","2","2","2",3,2,"3B",null,2,null,null,4]
[{"$nulls":11},"11","Fairchild","Ken","L","LF","2","3","3","3","4",2,2,"1B",null,1,null,null,2]
[{"$nulls":11},"12","Arispe","Jaime","R","OF","2","1","3","3","1",3,2,"2B",null,2,null,null,3]
[{"$nulls":11},"13","Lidstrom","Ken","L","CF","2","2","2","5","3",4,4,"LF",null,3,null,null,3]
[{"$nulls":11},"14","Rosson","Bob","R","C","3","2","1","2","1",4,2,"RF",null,2,null,null,3]
[{"$nulls":11},"15","Valencia ","Octavio","L","C","2","3","2","2","2",3,2,"1B",null,2,null,null,4]
[]
[{"$nulls":14},"T","VsL","VsR","ST",-1,"-2","-3","-4","-5","-6","-7","P","ST","GR","D","A","E","H"]
[]
[{"$nulls":11},1,"Edwards","Daryl","L",-3,-2,"5",{"$nulls":5},0,0,2,null,null,4,3,2,4]
[{"$nulls":11},2,"Lameira","Gomez","R",-3,-4,"4",{"$nulls":5},0,null,2,null,null,2,2,3,1]
[{"$nulls":11},3,"Horsford","Curt","R",-2,-3,"4",{"$nulls":5},0,0,3,null,null,2,2,2,2]
[{"$nulls":11},4,"Huerta","Raul","R",-1,-3,4,{"$nulls":4},0,0,0,2,null,null,2,3,4,1]
[{"$nulls":11},5,"MacGregor","Rob","R",-2,-3,"4",null,null,0,0,0,0,0,1,null,null,4,2,3,1]
[{"$nulls":11},6,"Ledesma","Pete","R",-3,-5,"1",{"$nulls":4},0,0,0,5,null,null,5,3,1,2]
[{"$nulls":11},7,"Ortiz","Ernesto","L",-5,-3,"2",{"$nulls":4},0,0,0,2,null,null,3,2,2,4]
[{"$nulls":11},8,"Knight","Robert","R",-2,-3,"3",{"$nulls":4},0,0,0,3,null,null,4,3,1,2]
[{"$nulls":11},9,"Salas","Robin","L",-2,-4,"2",{"$nulls":4},0,0,0,2,null,null,2,3,2,3]
[{"$nulls":11},10,"Morin","Enrique","R",-3,-4,"1",{"$nulls":4},0,0,0,4,null,null,"4","4","1","2"]

{"sheet":"Phantoms","index":6,"n_rows":30,"n_cols":42,"rows_kept":30,"merged":[[1,6,1,7],[2,2,5,2],[2,3,5,3],[2,4,5,4],[6,6,6,7],[7,2,10,2],[7,3,10,3],[7,4,10,4],[11,6,11,7],[12,2,15,2],[12,3,15,3],[12,4,15,4],[16,6,16,7],[17,2,20,2],[17,3,20,3],[17,4,20,4],[21,6,21,7],[22,2,25,2],[22,3,25,3],[22,4,25,4]]}
[{"$nulls":12},"Last","First","B","POS","vsL","vsR","Bu","S","J","F","A","2P",null,"2D","ST","GR","P",{"$nulls":11},24,"Tucker"]
[{"$nulls":40},28,"Millar"]
[{"$nulls":11},1,"Rollins","Billy","L","CF",4,5,5,5,5,5,2,"LF",null,4,null,null,1,{"$nulls":11},29,"Tucker"]
[{"$nulls":11},2,"Stewart","Craig","L","RF",3,3,3,4,3,2,4,"LF","CF",1,null,null,4,{"$nulls":11},30,"Marquez"]
[{"$nulls":11},3,"McClure","Milliard","R","SS",5,4,2,3,2,4,5,"3B",null,3,null,null,1,{"$nulls":11},33,"Tucker"]
[{"$nulls":11},4,"Glen","Joe","R","1B",5,3,1,2,1,2,1,"3B",null,1,null,null,4,{"$nulls":11},33,"Gabriel"]
[{"$nulls":11},5,"Millar","Neil","R","LF",4,3,3,3,2,4,4,"RF",null,2,null,null,4,{"$nulls":11},46,"McClure"]
[{"$nulls":11},6,"Tucker","Leroy","B","C",3,4,2,3,4,4,4,"1B",null,3,null,null,3,{"$nulls":11},46,"Garrett"]
[{"$nulls":11},7,"Walker","Donovan","L","2B",3,4,2,4,4,4,4,"SS",null,2,null,null,1,{"$nulls":11},48,"McClure"]
[{"$nulls":11},8,"Hatfield","Anthony","R","3B",3,2,3,3,3,5,4,"2B",null,3,null,null,2]
[{"$nulls":11},9,"Davis","Reese","L","DH",2,2,2,3,1,4,3,"CF",null,3,null,null,1]
[{"$nulls":11},10,"Hicks","Jack","R","1B",2,2,2,2,1,4,3,"LF",null,2,null,null,4]
[{"$nulls":11},11,"Lariego","Scott","R","2B",2,1,2,5,5,5,4,"SS",null,4,null,null,2]
[{"$nulls":11},12,"Garrett","Jasper","L","3B",4,3,2,4,3,3,1,"SS","3B",2,null,null,1]
[{"$nulls":11},13,"Franco","Roberto","R","DH",3,2,2,2,2,4,2,"1B",null,3,null,null,3]
[{"$nulls":11},14,"Trejo","Ricardo","L","C",3,3,1,3,2,2,2,"3B",null,1,null,null,2]
[{"$nulls":11},15,"Marquez","Pedro","R","C",2,1,3,3,2,4,4,"LF",null,1,null,null,1]
[]
[{"$nulls":14},"T","VsL","VsR","ST","-1","-2","-3","-4","-5","-6","-7","P","ST","GR","D","A","E","A"]
[]
[{"$nulls":11},1,"Brooks","Preston","R",-3,-5,5,{"$nulls":7},5,null,null,3,4,4,2]
[{"$nulls":11},2,"Ellis","Adrian","L",-5,-4,4,{"$nulls":7},3,null,null,4,2,4,4]
[{"$nulls":11},3,"Foster","Joe","R",-4,-5,4,{"$nulls":7},3,null,null,3,2,4,1]
[{"$nulls":11},4,"Correa","Lorenzo","R",-3,-5,5,{"$nulls":7},2,null,null,4,4,3,1]
[{"$nulls":11},5,"Ibanez","Antonio","R",-3,-4,5,{"$nulls":7},1,null,null,2,3,5,2]
[{"$nulls":11},6,"Garza","Enrique","R",-4,-5,1,{"$nulls":7},5,null,null,4,4,1,3]
[{"$nulls":11},7,"Washington","Freddy","R",-4,-5,1,{"$nulls":7},3,null,null,5,2,3,2]
[{"$nulls":11},8,"Deacon","Jamie","R",-4,-5,1,{"$nulls":7},5,null,null,2,2,4,3]
[{"$nulls":11},9,"Howell","Keith","R",-3,-4,1,{"$nulls":7},4,null,null,3,2,2,3]
[{"$nulls":11},10,"MacDonald","Matt","L",-4,-2,1,{"$nulls":7},4,null,null,2,1,2,4]

{"sheet":"Gators","index":7,"n_rows":30,"n_cols":49,"rows_kept":30,"merged":[[1,6,1,7],[2,2,5,2],[2,3,5,3],[2,4,5,4],[6,6,6,7],[7,2,10,2],[7,3,10,3],[7,4,10,4],[11,6,11,7],[12,2,15,2],[12,3,15,3],[12,4,15,4],[16,6,16,7],[17,2,20,2],[17,3,20,3],[17,4,20,4],[21,6,21,7],[22,2,25,2],[22,3,25,3],[22,4,25,4]]}
[{"$nulls":12},"Last","First",null,"POS","vsL","vsR","B","S","J","F","A","2P",null,"2D","ST","GR","P"]
[]
[{"$nulls":11},1,"Sharkey","Bill","R","RF",4,3,4,4,4,3,5,"LF",null,2,null,null,1,{"$nulls":17},20,"Sharkey","Bill"]
[{"$nulls":11},2,"Lucas","Peter","B","2B",5,3,4,4,4,5,3,"SS",null,3,null,null,3,{"$nulls":17},20,"Lucas","Peter"]
[{"$nulls":11},3,"Kemp","Jay","L","SS",4,5,2,3,2,5,1,"3B",null,3,null,null,4,{"$nulls":17},36,"Moran"]
[{"$nulls":11},4,"Holley","Howard","L","LF",3,4,1,3,2,4,3,"RF",null,2,null,null,4,{"$nulls":17},41,"Moran"]
[{"$nulls":11},5,"Moran","Octavio","R","C",3,2,2,2,2,5,3,"3B","1B",2,null,null,3,{"$nulls":17},51,"Holly"]
[{"$nulls":11},6,"Clark","Randy","R","1B",3,3,2,2,2,5,2,"3B",null,1,null,null,3,{"$nulls":17},54,"Kemp"]
[{"$nulls":11},7,"Gomez","Augusto","B","3B",3,3,2,3,2,5,3,"SS",null,2,null,null,3,{"$nulls":17},71,"Holly"]
[{"$nulls":11},8,"Metcalf","Jon","R","DH",4,2,4,4,3,4,2,"LF",null,3,null,null,2]
[{"$nulls":11},9,"Lowery","Shane","R","CF",3,2,5,5,5,4,2,"LF","RF",3,null,null,2]
[{"$nulls":11},10,"MacAldonich","Chris","R","CF",3,3,3,4,3,4,4,"LF","RF",2,null,null,1]
[{"$nulls":11},11,"Ornelas","Colton","R","LF",2,2,2,5,3,5,2,"OF",null,3,null,null,1]
[{"$nulls":11},12,"Santos","Ramon","R","C",3,2,2,2,2,2,2,"1B",null,1,null,null,3]
[{"$nulls":11},13,"Gonzalez","Jose","R","SS",3,2,2,3,2,4,2,"2B",null,2,null,null,2]
[{"$nulls":11},14,"Cruz","Orlando","R","SS",3,2,4,4,2,3,4,"2B","3B",2,null,null,1]
[{"$nulls":11},15,"Aldridge","Joe","B","1B",1,2,2,2,1,3,1,"C",null,1,null,null,3]
[]
[{"$nulls":14},"T","VsL","VsR","ST","-1","-2","-3","-4","-5","-6","-7","P","ST","GR","D","A","E","A"]
[]
[{"$nulls":11},1,"Bowerman","Nate","L",-5,-3,"5",{"$nulls":6},0,5,null,null,3,3,5,4]
[{"$nulls":11},2,"Francis","Mark","R",-4,-3,"5",{"$nulls":7},2,null,null,2,2,2,1]
[{"$nulls":11},3,"Hoover","Stanley","L",-3,-4,"4",{"$nulls":7},3,null,null,4,3,4,4]
[{"$nulls":11},4,"Rivas","Antonio","R",-2,-3,4,{"$nulls":4},0,0,0,2,null,null,1,2,3,2]
[{"$nulls":11},5,"Serrano","Jose","R",-2,-2,5,{"$nulls":4},0,0,0,5,null,null,2,1,3,2]
[{"$nulls":11},6,"Garcim","Tony","L",-4,-3,1,{"$nulls":4},0,0,0,5,null,null,4,2,2,5]
[{"$nulls":11},7,"Kelley","John","R",-3,-4,1,{"$nulls":4},0,0,0,4,null,null,4,2,5,1]
[{"$nulls":11},8,"McAughy","Shane","R",-4,-3,1,{"$nulls":4},0,0,0,3,null,null,3,4,4,2]
[{"$nulls":11},9,"Marino","Francisco","R",-2,-2,4,{"$nulls":3},0,0,0,0,3,null,null,4,4,2,2]
[{"$nulls":11},10,"Zamora","Juan","L",-4,-3,3,{"$nulls":3},0,0,0,0,4,null,null,5,3,3,3]

{"sheet":"Knights","index":8,"n_rows":30,"n_cols":42,"rows_kept":30,"merged":[[1,6,1,7],[2,2,5,2],[2,3,5,3],[2,4,5,4],[6,6,6,7],[7,2,10,2],[7,3,10,3],[7,4,10,4],[11,6,11,7],[12,2,15,2],[12,3,15,3],[12,4,15,4],[16,6,16,7],[17,2,20,2],[17,3,20,3],[17,4,20,4],[21,6,21,7],[22,2,25,2],[22,3,25,3],[22,4,25,4]]}
[{"$nulls":12},"Last","First","B",null,"vsL","vsR","Bu","S","J","F","A","2P",null,"2D","ST","GR","P",{"$nulls":11},25,"None"]
[{"$nulls":40},26,"Gabriel"]
[{"$nulls":11},1,"Alcova","Tommy","R","2B",3,3,4,5,2,5,2,"SS",null,2,null,null,3,{"$nulls":9},1,null,26,"Good"]
[{"$nulls":11},2,"Gabriel","George","R","RF",4,3,2,3,1,2,5,"LF","CF",1,null,null,3,{"$nulls":9},2,null,27,"Thomas"]
[{"$nulls":11},3,"Callahan","Richard","R","1B",3,4,1,2,2,2,2,"3B",null,1,null,null,5,{"$nulls":9},3,null,45,"Gabriel"]
[{"$nulls":11},4,"Garland","Joe","L","LF",4,5,1,2,2,3,2,"RF",null,2,null,null,5,{"$nulls":9},4,null,45,"Garland"]
[{"$nulls":11},5,"Valenzuela","Ruben","R","C",5,3,1,2,1,3,2,"1B",null,1,null,null,4,{"$nulls":9},5,null,49,"Torres"]
[{"$nulls":11},6,"Torres","Alberto","R","3B",3,2,3,3,2,2,2,"C",null,1,null,null,4,{"$nulls":9},6,null,51,"Garland"]
[{"$nulls":11},7,"Feliz","Jose","B","C",3,4,2,3,2,3,2,"1B",null,2,null,null,3,{"$nulls":9},7,null,51,"Torres"]
[{"$nulls":11},8,"Roe","John","R","SS",3,4,2,3,4,5,2,"3B",null,3,null,null,2,{"$nulls":9},8,null,65,"Roe"]
[{"$nulls":11},9,"Good","Lyle","R","CF",3,2,5,4,3,5,4,"LF","RF",3,null,null,1,{"$nulls":9},9]
[{"$nulls":11},10,"Figueroa","Martin","R","CF",3,3,4,3,3,2,1,"LF","RF",1,null,null,2,{"$nulls":9},10]
[{"$nulls":11},11,"Tucker","David","B","CF",1,3,5,5,5,2,2,"1B",null,1,null,null,1]
[{"$nulls":11},12,"Chaney","Ed","L","DH",2,3,2,3,2,2,2,"1B",null,1,null,null,3]
[{"$nulls":11},13,"Navarro","Felix","B","2B",4,3,4,5,1,1,1,"SS",null,1,null,null,1]
[{"$nulls":11},14,"Diaz","Alfonzo","B","SS",1,2,2,4,2,2,2,"2B",null,1,null,null,3]
[{"$nulls":11},15,"Thomas","Toby","R","3B",3,3,2,4,4,2,2,"2B",null,1,null,null,1]
[]
[{"$nulls":14},"T","VsL","VsR","ST","-1","-2","-3","-4","-5","-6","-7","P","ST","GR","D","A","E","A"]
[]
[{"$nulls":11},1,"Henderson","Hank","R",-4,-5,"5",{"$nulls":6},0,5,null,null,2,2,4,2]
[{"$nulls":11},2,"Olivares","Enrique","R",-3,-5,"5",{"$nulls":6},0,3,null,null,1,2,2,2]
[{"$nulls":11},3,"Young","Morgan","L",-4,-3,"4",{"$nulls":6},0,3,null,null,5,2,3,4]
[{"$nulls":11},4,"Yates","Rudy","R",-3,-4,"5",{"$nulls":6},0,1,null,null,2,3,1,2]
[{"$nulls":11},5,"Castle","Chris","L",-4,-2,"5",{"$nulls":5},0,0,4,null,null,3,2,4,5]
[{"$nulls":11},6,"Roberson","Cory","L",-4,-3,"1",{"$nulls":5},0,0,2,null,null,2,2,2,4]
[{"$nulls":11},7,"Maddox","Ken","R",-3,-4,"3",{"$nulls":5},0,0,3,null,null,2,3,2,3]
[{"$nulls":11},8,"Rodriguez","Lucio","R",-3,-3,1,{"$nulls":5},0,0,2,null,null,2,2,3,2]
[{"$nulls":11},9,"Bowen","Paul","L",-3,-2,"3",null,null,0,0,0,0,0,2,null,null,3,1,3,5]
[{"$nulls":11},10,"Peralta","Angel","L",-5,-2,"1",null,null,0,0,0,0,0,4,null,null,2,1,3,3]

{"sheet":"Drillers","index":9,"n_rows":30,"n_cols":47,"rows_kept":30,"merged":[[1,6,1,7],[2,2,5,2],[2,3,5,3],[2,4,5,4],[6,6,6,7],[7,2,10,2],[7,3,10,3],[7,4,10,4],[11,6,11,7],[12,2,15,2],[12,3,15,3],[12,4,15,4],[16,6,16,7],[17,2,20,2],[17,3,20,3],[17,4,20,4],[21,6,21,7],[22,2,25,2],[22,3,25,3],[22,4,25,4]]}
[{"$nulls":12},"Last","First","B","POS","vsL","vsR","B","S","J","F","A","2P",null,"2D","ST","GR","P",{"$nulls":11},25,"None",null,1,{"$f":"VLOOKUP($AR1,$L$3:$AB$17,2,FALSE)","v":"Perez"},{"$f":"VLOOKUP($AR1,$L$3:$AB$17,4,FALSE)","v":"R"},{"$f":"VLOOKUP($AR1,$L$3:$AB$17,5,FALSE)","v":"DH"}]
[{"$nulls":40},26,"None",null,2,{"$f":"VLOOKUP($AR2,$L$3:$AB$17,2,FALSE)","v":"Nelson"},{"$f":"VLOOKUP($AR2,$L$3:$AB$17,4,FALSE)","v":"R"},{"$f":"VLOOKUP($AR2,$L$3:$AB$17,5,FALSE)","v":"LF"}]
[{"$nulls":11},1,"Perez","Sergio","R","DH",4,3,3,4,5,2,1,"RF","CF",1,null,null,1,{"$nulls":11},27,"Reid",null,3,"Macpherson","R","2B"]
[{"$nulls":11},2,"Nelson","Michael","R","LF",3,3,2,4,3,4,4,"CF","RF",3,null,null,3,{"$nulls":11},41,"Morales",null,4,"Hagerty","L","1B"]
[{"$nulls":11},3,"Macpherson","Bob","R","2B",5,3,1,3,2,3,3,"SS",null,2,null,null,4,{"$nulls":11},53,"Haggerty",null,5,"Morales","R","C"]
[{"$nulls":11},4,"Hagerty","Mark","L","1B",4,5,1,1,1,5,2,"3B",null,1,null,null,5,{"$nulls":11},53,"Nelson",null,6,"Reid","B","3B"]
[{"$nulls":11},5,"Morales","Rico","R","C",4,3,1,2,1,3,2,"1B",null,2,null,null,5,{"$nulls":11},67,"Reid",null,7,"Schultz","L","CF"]
[{"$nulls":11},6,"Reid","Martin","B","3B",3,4,1,3,2,3,2,"1B",null,2,null,null,5,{"$nulls":11},69,"Nelson",null,8,"Melendez","B","SS"]
[{"$nulls":11},7,"Schultz","Dave","L","CF",2,4,4,4,2,4,2,"OF",null,3,null,null,2,{"$nulls":14},12,"Litte","R","RF"]
[{"$nulls":11},8,"Melendez","Vincent","B","SS",2,3,2,3,1,4,3,"INF",null,3,null,null,3,{"$nulls":14},10,"Juarez","B","DH"]
[{"$nulls":11},9,"Miranda","Raul","L","RF",3,4,3,3,4,4,2,"CF","LF",3,null,null,2,{"$nulls":14},11,"Ramos","B","C"]
[{"$nulls":11},10,"Juarez","Jose","B","DH",4,3,1,2,2,3,2,"3B","1B",1,null,null,3,{"$nulls":14},9,"Miranda","L","RF"]
[{"$nulls":11},11,"Ramos","Jorge","B","C",1,2,2,2,2,2,3,"1B",null,1,null,null,1,{"$nulls":14},13,"Ward","R","2B"]
[{"$nulls":11},12,"Litte","Scott","R","RF",3,2,3,4,2,3,2,"1B",null,1,null,null,3,{"$nulls":14},14,"Rosen","R","2B"]
[{"$nulls":11},13,"Ward","Drew","R","2B",1,4,2,3,3,5,2,"SS",null,3,null,null,2,{"$nulls":14},15,"Glendon ","R","1B"]
[{"$nulls":11},14,"Rosen","Rich","R","2B",2,3,1,3,3,5,1,"SS",null,3,null,null,2]
[{"$nulls":11},15,"Glendon ","James","R","1B",2,1,1,1,1,4,1,"INF",null,1,null,null,1]
[]
[{"$nulls":14},"T","VsL","VsR","ST","-1","-2","-3","-4","-5","-6","-7","P","ST","GR","D","A","E","A"]
[]
[{"$nulls":11},1,"Alvarez","Manuel","L",-3,-5,5,{"$nulls":6},0,3,null,null,3,2,4,3]
[{"$nulls":11},2,"Martinez","Hector","R",-3,-5,5,{"$nulls":6},0,3,null,null,1,2,5,2]
[{"$nulls":11},3,"Brown","Ray","R",-3,-4,5,{"$nulls":6},0,4,null,null,2,1,3,3]
[{"$nulls":11},4,"Montez","Juan","R",-3,-4,5,{"$nulls":6},0,2,null,null,5,3,2,3]
[{"$nulls":11},5,"Moore","Milliard","L",-4,-3,4,{"$nulls":7},2,null,null,2,1,3,4]
[{"$nulls":11},6,"Henry","Bill","L",-5,-4,1,{"$nulls":6},0,5,null,null,2,2,2,4]
[{"$nulls":11},7,"Jones","Mike","L",-4,-3,1,{"$nulls":6},0,2,null,null,3,1,3,4]
[{"$nulls":11},8,"Armstrong","George","L",-2,-3,1,{"$nulls":6},0,5,null,null,2,2,4,4]
[{"$nulls":11},9,"Hodges","Chris","R",-2,-3,1,{"$nulls":6},0,1,null,null,1,1,1,2]
[{"$nulls":11},10,"Uchmaya","Jiro","R",-2,-3,2,{"$nulls":6},0,4,null,null,2,2,3,1]

{"sheet":"Hornets","index":10,"n_rows":30,"n_cols":47,"rows_kept":30,"merged":[[1,6,1,7],[2,2,5,2],[2,3,5,3],[2,4,5,4],[6,6,6,7],[7,2,10,2],[7,3,10,3],[7,4,10,4],[11,6,11,7],[12,2,15,2],[12,3,15,3],[12,4,15,4],[16,6,16,7],[17,2,20,2],[17,3,20,3],[17,4,20,4],[21,6,21,7],[22,2,25,2],[22,3,25,3],[22,4,25,4]]}
[{"$nulls":12},"Last","First","B",null,"vsL","vsR","Bu","S","J","F","A","2P",null,"2D","ST","GR",{"$nulls":12},22,"Hernandez","Edgar",2,{"$f":"VLOOKUP($AR$1,$L$3:$P$17,2,FALSE)","v":"Johnstone"},{"$f":"VLOOKUP($AR1,$L$3:$P$17,4,FALSE)","v":"L"},{"$f":"VLOOKUP($AR1,$L$3:$P$17,5,FALSE)","v":"DH"}]
[{"$nulls":28},"P",{"$nulls":11},23,"Johnston","Dennis",3,{"$f":"VLOOKUP(AR2,$L$3:$P$17,2,FALSE)","v":"O'Sheehan"},{"$f":"VLOOKUP($AR2,$L$3:$P$17,4,FALSE)","v":"R"},{"$f":"VLOOKUP($AR2,$L$3:$P$17,5,FALSE)","v":"2B"}]
[{"$nulls":11},1,"Monteso","Luis","R","SS",3,4,3,5,4,3,3,"2B",null,2,null,null,3,{"$nulls":11},24,"Hernandez","Edgar",5,"Shelton","B","1B"]
[{"$nulls":11},2,"Johnstone","Dennis","L","DH",2,3,3,4,4,2,2,"RF",null,1,null,null,1,{"$nulls":11},24,"Villarreal","Tony",4,"Rhodes","R","3B"]
[{"$nulls":11},3,"O'Sheehan","Bill","R","2B",4,3,1,3,5,4,3,"SS",null,3,null,null,2,{"$nulls":11},54,"Holland",null,15,"Garcia","L","CF"]
[{"$nulls":11},4,"Rhodes","John","R","3B",3,4,1,1,2,2,2,"1B",null,1,null,null,5,{"$nulls":11},65,"Holland",null,14,"Stanley","R","SS"]
[{"$nulls":11},5,"Shelton","Bill","B","1B",2,1,1,2,2,3,2,"3B",null,1,null,null,5,{"$nulls":11},73,"O'Sheehan",null,7,"Rosas","L","LF"]
[{"$nulls":11},6,"Callaway","Daniel","B","CF",4,3,5,4,4,5,4,"LF","RF",3,null,null,3,{"$nulls":11},73,"Villarreal",null,8,"Villarreal","R","LF"]
[{"$nulls":11},7,"Rosas","Orlando","L","LF",4,3,3,4,3,4,3,"CF",null,2,null,null,2,{"$nulls":14},11,"Castillo","R","C"]
[{"$nulls":11},8,"Villarreal","Tony","R","LF",2,3,2,4,3,4,2,"RF",null,3,null,null,1,{"$nulls":14},10,"Lopez"]
[{"$nulls":11},9,"Hernandez","Edgar","R","C",3,2,1,2,2,2,2,"3B",null,1,null,null,3,{"$nulls":14},9,"Hernandez"]
[{"$nulls":11},10,"Lopez","Pedro","L","C",2,2,5,3,2,2,2,"INF",null,1,null,null,1,{"$nulls":14},12,"Medina"]
[{"$nulls":11},11,"Castillo","Ivan","R","C",5,3,1,2,2,4,4,"1B",null,2,null,null,2,{"$nulls":14},13,"Holland"]
[{"$nulls":11},12,"Medina","Octavio","L","1B",3,3,2,3,3,5,2,"3B",null,2,null,null,1,{"$nulls":14},1,"Monteso"]
[{"$nulls":11},13,"Holland","Chris","B","SS",2,3,3,3,2,3,2,"INF",null,1,null,null,3,{"$nulls":14},6,"Callaway"]
[{"$nulls":11},14,"Stanley","Todd","R","SS",3,2,2,3,2,2,2,"RF",null,1,null,null,2]
[{"$nulls":11},15,"Garcia","Jose","L","CF",2,3,5,5,5,4,1,"LF","RF",{"$nulls":3},1]
[]
[{"$nulls":14},"T","VsL","VsR","ST","-1","-2","-3","-4","-5","-6","-7","P","ST","GR","D","A","E","H"]
[]
[{"$nulls":11},1,"Joseph","Dennis","R",-4,-5,5,{"$nulls":6},0,3,null,null,3,1,2,1]
[{"$nulls":11},2,"Robinson","Johnny","L",-4,-3,5,{"$nulls":7},2,null,null,2,2,3,4]
[{"$nulls":11},3,"Bradford","Robert","L",-5,-3,5,{"$nulls":6}," ",3,null,null,5,2,1,4]
[{"$nulls":11},4,"Molina","Jesus","R",-3,-3,5,{"$nulls":7},3,null,null,1,3,4,2]
[{"$nulls":11},5,"Philips","Julian","L",-4,-3,5,{"$nulls":6},0,2,null,null,3,2,1,3]
[{"$nulls":11},6,"Samuels","Keith","L",-5,-4,1,{"$nulls":4},0,0,0,4,null,null,2,2,3,4]
[{"$nulls":11},7,"Berry","Vince","R",-2,-4,1,{"$nulls":3},0,{"$nulls":3},4,null,null,1,3,4,2,{"$nulls":5},0,0,0,0]
[{"$nulls":11},8,"Little","Derek","L",-4,-2,1,{"$nulls":3},0,{"$nulls":3},3,null,null,5,4,5,5,{"$nulls":5},0,0,0,0]
[{"$nulls":11},9,"Pierson","Gary","R",-2,-3,2,{"$nulls":7},3,null,null,2,2,4,2,{"$nulls":5},0,0,0,0]
[{"$nulls":11},10,"Stanford","Edgar","R",-1,-2,1,{"$nulls":3},0,{"$nulls":3},2,null,null,2,2,2,2,{"$nulls":5},0,0,0,0]

{"sheet":"Wolves","index":11,"n_rows":30,"n_cols":32,"rows_kept":30,"merged":[[1,6,1,7],[2,2,5,2],[2,3,5,3],[2,4,5,4],[6,6,6,7],[7,2,10,2],[7,3,10,3],[7,4,10,4],[11,6,11,7],[12,2,15,2],[12,3,15,3],[12,4,15,4],[16,6,16,7],[17,2,20,2],[17,3,20,3],[17,4,20,4],[21,6,21,7],[22,2,25,2],[22,3,25,3],[22,4,25,4]]}
[{"$nulls":12},"Last","First","B","POS","vsL","vsR","B","S","J","F","A","2P",null,"2D","ST","GR","P"]
[]
[{"$nulls":11},1,"Last","First","R","RF",3,2,1,3,3,2,4,"LF","CF",1,null,null,2]
[{"$nulls":11},2]
[{"$nulls":11},3]
[{"$nulls":11},4]
[{"$nulls":11},5]
[{"$nulls":11},6]
[{"$nulls":11},7]
[{"$nulls":11},8]
[{"$nulls":11},9]
[{"$nulls":11},10]
[{"$nulls":11},11]
[{"$nulls":11},12]
[{"$nulls":11},13]
[{"$nulls":11},14]
[{"$nulls":11},15]
[]
[{"$nulls":14},"T","VsL","VsR","ST","-1","-2","-3","-4","-5","-6","-7","P","ST","GR","D","A","E","H"]
[]
[{"$nulls":11},1,"Name","Name","L",-3,-2,4,"   "," "," "," "," ",null,0,3,null,null,2,1,2]
[{"$nulls":11},2]
[{"$nulls":11},3]
[{"$nulls":11},4]
[{"$nulls":11},5]
[{"$nulls":11},6]
[{"$nulls":11},7]
[{"$nulls":11},8]
[{"$nulls":11},9]
[{"$nulls":11},10]

{"sheet":"Comets","index":12,"n_rows":30,"n_cols":41,"rows_kept":30,"merged":[[1,6,1,7],[2,2,5,2],[2,3,5,3],[2,4,5,4],[6,6,6,7],[7,2,10,2],[7,3,10,3],[7,4,10,4],[11,6,11,7],[12,2,15,2],[12,3,15,3],[12,4,15,4],[16,6,16,7],[17,2,20,2],[17,3,20,3],[17,4,20,4],[21,6,21,7],[22,2,25,2],[22,3,25,3],[22,4,25,4]]}
[{"$nulls":12},"Last","First","B",null,"vsL","vsR","Bu","S","J","F","A","2P",null,"2D","ST","GR","P"]
[]
[{"$nulls":11},1,"Last","First","R","RF",3,2,1,3,3,2,4,"LF","CF",1,null,null,2]
[{"$nulls":11},2]
[{"$nulls":11},3]
[{"$nulls":11},4]
[{"$nulls":11},5]
[{"$nulls":11},6]
[{"$nulls":11},7]
[{"$nulls":11},8]
[{"$nulls":11},9]
[{"$nulls":11},10]
[{"$nulls":11},11]
[{"$nulls":11},12]
[{"$nulls":11},13]
[{"$nulls":11},14]
[{"$nulls":11},15]
[]
[{"$nulls":14},"T","VsL","VsR","ST","-1","-2","-3","-4","-5","-6","-7","P","ST","GR","D","A","E","H"]
[]
[{"$nulls":11},1,"Name","Name","L",-3,-2,4,{"$nulls":4},0,0,0,1,null,null,1,3,3]
[{"$nulls":11},2]
[{"$nulls":11},3]
[{"$nulls":11},4]
[{"$nulls":11},5]
[{"$nulls":11},6]
[{"$nulls":11},7,{"$nulls":25},0,0,0,0]
[{"$nulls":11},8,{"$nulls":25},0,0,0,0]
[{"$nulls":11},9,{"$nulls":25},0,0,0,0]
[{"$nulls":11},10,{"$nulls":25},0,0,0,0]

{"sheet":"Schedule 60","index":13,"n_rows":80,"n_cols":7,"rows_kept":80}
[]
[{"$nulls":3},"Baltimore Bulls","at","Pittsburgh Phantoms",1]
[{"$nulls":3},"Allentown Gators","at","Carson City Knights",4]
[{"$nulls":3},"Harrisburg Hornets","at","Danville Drillers",7]
[]
[{"$nulls":3},"Harrisburg Hornets","at","Carson City Knights",10]
[{"$nulls":3},"Baltimore Bulls","at","Danville Drillers",13]
[{"$nulls":3},"Pittsburgh Phantoms","at","Allentown Gators",16]
[]
[{"$nulls":3},"Allentown Gators","at","Baltimore Bulls",19]
[{"$nulls":3},"Pittsburgh Phantoms","at","Harrisburg Hornets",22]
[{"$nulls":3},"Danville Drillers","at","Carson City Knights",25]
[]
[{"$nulls":3},"Pittsburgh Phantoms","at","Danville Drillers",28]
[{"$nulls":3},"Carson City Knights","at","Baltimore Bulls",31]
[{"$nulls":3},"Allentown Gators","at","Harrisburg Hornets",34]
[]
[{"$nulls":3},"Baltimore Bulls","at","Harrisburg Hornets",37]
[{"$nulls":3},"Danville Drillers","at","Allentown Gators",40]
[{"$nulls":3},"Carson City Knights","at","Pittsburgh Phantoms",43]
[]
[{"$nulls":3},"Pittsburgh Phantoms","at","Baltimore Bulls",46]
[{"$nulls":3},"Carson City Knights","at","Allentown Gators",49]
[{"$nulls":3},"Harrisburg Hornets","at","Danville Drillers",52]
[]
[{"$nulls":3},"Baltimore Bulls","at","Allentown Gators",55]
[{"$nulls":3},"Harrisburg Hornets","at","Pittsburgh Phantoms",58]
[{"$nulls":3},"Carson City Knights","at","Danville Drillers",61]
[]
[{"$nulls":3},"Carson City Knights","at","Harrisburg Hornets",64]
[{"$nulls":3},"Danville Drillers","at","Baltimore Bulls",67]
[{"$nulls":3},"Allentown Gators","at","Pittsburgh Phantoms",70]
[]
[{"$nulls":3},"Harrisburg Hornets","at","Baltimore Bulls",73]
[{"$nulls":3},"Allentown Gators","at","Danville Drillers",76]
[{"$nulls":3},"Pittsburgh Phantoms","at","Carson City Knights",79]
[]
[{"$nulls":3},"Danville Drillers","at","Pittsburgh Phantoms",82]
[{"$nulls":3},"Baltimore Bulls","at","Carson City Knights",85]
[{"$nulls":3},"Harrisburg Hornets","at","Allentown Gators",88]
[]
[{"$nulls":3},"Carson City Knights","at","Harrisburg Hornets",91]
[{"$nulls":3},"Danville Drillers","at","Baltimore Bulls",94]
[{"$nulls":3},"Allentown Gators","at","Pittsburgh Phantoms",97]
[]
[{"$nulls":3},"Harrisburg Hornets","at","Baltimore Bulls",100]
[{"$nulls":3},"Allentown Gators","at","Danville Drillers",103]
[{"$nulls":3},"Pittsburgh Phantoms","at","Carson City Knights",106]
[]
[{"$nulls":3},"Danville Drillers","at","Pittsburgh Phantoms",109]
[{"$nulls":3},"Baltimore Bulls","at","Carson City Knights",112]
[{"$nulls":3},"Harrisburg Hornets","at","Allentown Gators",115]
[]
[{"$nulls":3},"Baltimore Bulls","at","Allentown Gators",118]
[{"$nulls":3},"Harrisburg Hornets","at","Pittsburgh Phantoms",121]
[{"$nulls":3},"Carson City Knights","at","Danville Drillers",124]
[]
[{"$nulls":3},"Pittsburgh Phantoms","at","Baltimore Bulls",127]
[{"$nulls":3},"Carson City Knights","at","Allentown Gators",130]
[{"$nulls":3},"Harrisburg Hornets","at","Danville Drillers",133]
[]
[{"$nulls":3},"Allentown Gators","at","Baltimore Bulls",136]
[{"$nulls":3},"Pittsburgh Phantoms","at","Harrisburg Hornets",139]
[{"$nulls":3},"Danville Drillers","at","Carson City Knights",142]
[]
[{"$nulls":3},"Baltimore Bulls","at","Pittsburgh Phantoms",145]
[{"$nulls":3},"Allentown Gators","at","Carson City Knights",148]
[{"$nulls":3},"Harrisburg Hornets","at","Danville Drillers",151]
[]
[{"$nulls":3},"Harrisburg Hornets","at","Carson City Knights"]
[{"$nulls":3},"Baltimore Bulls","at","Danville Drillers"]
[{"$nulls":3},"Pittsburgh Phantoms","at","Allentown Gators"]
[]
[{"$nulls":3},"Baltimore Bulls","at","Harrisburg Hornets"]
[{"$nulls":3},"Danville Drillers","at","Allentown Gators"]
[{"$nulls":3},"Carson City Knights","at","Pittsburgh Phantoms"]
[]
[{"$nulls":3},"Pittsburgh Phantoms","at","Danville Drillers"]
[{"$nulls":3},"Carson City Knights","at","Baltimore Bulls"]
[{"$nulls":3},"Allentown Gators","at","Harrisburg Hornets"]

{"sheet":"Sheet2","index":14,"n_rows":76,"n_cols":36,"rows_kept":76}
[{"$nulls":19},1,{"$nulls":3},2,{"$nulls":3},3,{"$nulls":3},4,{"$nulls":3},5]
[null,null,"ARM","2HR"]
[null,null,1,2,null,1,3,null,1,4,null,1,5,null,1,6]
[null,null,2,3,null,2,4,null,2,5,null,2,6,null,2,7]
[null,null,3,4,null,3,5,null,3,6,null,3,7,null,3,8]
[null,null,4,5,null,4,6,null,4,7,null,4,8,null,4,9]
[null,null,5,6,null,5,7,null,5,8,null,5,9,null,5,10]
[]
[null,null,1,4,null,1,5,null,1,6,null,1,7,null,1,8]
[null,null,2,5,null,2,6,null,2,7,null,2,8,null,2,9]
[null,null,3,6,null,3,7,null,3,8,null,3,9,null,3,10]
[null,null,4,7,null,4,8,null,4,9,null,4,10,null,4,"OUT"]
[null,null,5,8,null,5,9,null,5,10,null,5,"OUT",null,5,"OUT"]
[]
[null,null,1,5,null,1,6,null,1,7,null,1,8,null,1,9]
[null,null,2,6,null,2,7,null,2,8,null,2,9,null,2,10]
[null,null,3,7,null,3,8,null,3,9,null,3,10,null,3,"OUT"]
[null,null,4,8,null,4,9,null,4,10,null,4,"OUT",null,4,"OUT"]
[null,null,5,9,null,5,10,null,5,"OUT",null,5,"OUT",null,5,"OUT"]
[]
[null,null,1,3,null,1,4,null,1,5,null,1,6,null,1,7]
[null,null,2,4,null,2,5,null,2,6,null,2,7,null,2,8]
[null,null,3,5,null,3,6,null,3,7,null,3,8,null,3,9]
[null,null,4,6,null,4,7,null,4,8,null,4,9,null,4,10]
[null,null,5,7,null,5,8,null,5,9,null,5,10,null,5,"OUT"]
[]
[]
[]
[{"$nulls":17},"5 Speed","TYPE"]
[{"$nulls":18},1,2,3,4]
[{"$nulls":17},"ARM"]
[{"$nulls":17},1,2,4,5,3]
[{"$nulls":17},2,3,5,6,4]
[{"$nulls":17},3,4,6,7,5]
[{"$nulls":17},4,5,7,8,6]
[{"$nulls":17},5,6,8,9,7]
[]
[{"$nulls":17},"4 Speed","TYPE"]
[]
[{"$nulls":17},"ARM"]
[{"$nulls":18},1,2,3,4]
[{"$nulls":17},1,3,5,6,4]
[{"$nulls":17},2,4,6,7,5]
[{"$nulls":17},3,5,7,8,6]
[{"$nulls":17},4,6,8,9,7]
[{"$nulls":17},5,7,9,10,8]
[]
[{"$nulls":17},"3 Speed","TYPE"]
[]
[{"$nulls":17},"ARM",1,2,3,4]
[]
[{"$nulls":17},1,4,6,7,5]
[{"$nulls":17},2,5,7,8,6]
[{"$nulls":17},3,6,8,9,7]
[{"$nulls":17},4,7,9,10,8]
[{"$nulls":17},5,8,10,"OUT",9]
[]
[{"$nulls":17},"2 Speed","TYPE"]
[]
[{"$nulls":17},"ARM",1,2,3,4]
[]
[{"$nulls":17},1,5,7,8,6]
[{"$nulls":17},2,6,8,9,7]
[{"$nulls":17},3,7,9,10,8]
[{"$nulls":17},4,8,10,"OUT",9]
[{"$nulls":17},5,9,"OUT","OUT",10]
[]
[{"$nulls":17},"1 Speed","TYPE"]
[]
[{"$nulls":17},"ARM",1,2,3,4]
[]
[{"$nulls":17},1,6,8,9,7]
[{"$nulls":17},2,7,9,10,8]
[{"$nulls":17},3,8,10,"OUT",9]
[{"$nulls":17},4,9,"OUT","OUT",10]
[{"$nulls":17},5,10,"OUT","OUT","OUT"]

{"sheet":"Sheet4","index":15,"n_rows":26,"n_cols":31,"rows_kept":26}
[{"$f":"RAND()","v":0.8691718182729822},1,null,8,{"v":0.11267605633802817,"d":"11.27%"},1,{"$nulls":7},"1-5","6-10"]
[0.8270068817579324,4,null,5,{"v":0.07042253521126761,"d":"7.04%"},2,null,59,52,null,23,{"v":0.31846153846153846,"d":"31.8%"},null,108,110,null,null,1,"Batter bunts ball right back to the pitcher.  Pitcher fields the ball cleanly and has choice of play on any runner or batter.  For corresponding offensive player play out on SAC BUNT runner or SAC BUNT HITTER based on the pitcher's DEFENSE."]
[0.3573740616757529,5,null,7,{"v":0.09859154929577464,"d":"9.86%"},3,{"$nulls":4},15,{"v":0.20512820512820512,"d":"20.5%"},{"$nulls":5},2,"Batter bunts ball to 3rd.  3B charges the ball, barehands it and tried to make the play at first.  If 3B's DEFENSE+ROLL+BATTER'S SPEED+BUNT is less than 11 batter is out and all runners advance 1 base."]
[0.010874497348477452,2,null,7,{"v":0.09859154929577464,"d":"9.86%"},4,{"$nulls":4},25,{"v":0.33794871794871795,"d":"33.8%"},{"$nulls":5},3,"Bater bunts ball slowly down the thirdbase line.  The catcher makes the play, barehands it and tries to make the play to first.  If C's DEFENSE+ROLL+BATTER'S SPEED+BUNT is less than 13 batter is out and all runners advance 1 base."]
[0.5122322986080379,9,null,8,{"v":0.11267605633802817,"d":"11.27%"},5,{"$nulls":4},23,{"v":0.31794871794871793,"d":"31.8%"},{"$nulls":5},4,"Batter bunts ball down third base line.  The 3B fields the ball cleanly and has a choice of play on any runner or batter.  For corresponding offensive player play out on SAC BUNT RUNNER or SAC BUNT HITTER base on 3B's DEFENSE."]
[0.24448421325139935,7,null,8,{"v":0.11267605633802817,"d":"11.27%"},6,{"$nulls":4},22,{"v":0.30153846153846153,"d":"30.2%"},{"$nulls":5},5,"Batter catches the defense off guard and lays down a bunt.  If the batter's BUNT+ROLL is greater than 10 all runners including the batter are safe.  If outcome is 10 or less batter is out but all runners are safe, advancing 1 base."]
[0.8476406979867707,3,null,6,{"v":0.08450704225352113,"d":"8.45%"},7,{"$nulls":4},27,{"v":0.3728205128205128,"d":"37.3%"},{"$nulls":5},6,"Batter bunts ball down the firstbase line.  The 1B fields the ball cleanly and tried to make the play on the batter with the 2B covering firstbase.  Using the 1B's FIELDING raing on the batter's SAC BUNT HITTER chart for outcome, all runners advance 1 base."]
[0.7482141697723135,6,null,6,{"v":0.08450704225352113,"d":"8.45%"},8,{"$nulls":4},26,{"v":0.3548717948717949,"d":"35.5%"},{"$nulls":5},7,"Batter bunts down the firstbase line.  The iB fields the ball cleanly and has choice of play on any runner or batter.  For correstpongin offensive player play out on SAC BUNT RUNNER or SAC BUNT HITTER based on the 1B's FIELDING."]
[0.8712312092063415,8,null,7,{"v":0.09859154929577464,"d":"9.86%"},9,{"$nulls":4},19,{"v":0.2671794871794872,"d":"26.7%"},{"$nulls":5},8,"Batter bunts ball to first.  The 1B charges the ball, barehands it and tried to make the play to first with the pitcher covering.  If 1B's DEFENSE+ROLL+BATTER'S SPEED+BUNT is less than 15 batter is out and all runners advance 1 base."]
[0.04050274875294335,10,null,9,{"v":0.1267605633802817,"d":"12.68%"},10,{"$nulls":4},19,{"v":0.25743589743589745,"d":"25.7%"},{"$nulls":5},9,"Batter bunts down the firstbase line.  The 1B fields the ball cleanly and has choice of play on any runner or batter.  For corresponding offensive player play out on SAC BUNT RUNNER or SAC BUNT HITTER based on the 1B's DEFENSE."]
[{"$nulls":10},19,{"v":0.26666666666666666,"d":"26.7%"},{"$nulls":5},10,"Batter bunts ball to thrid.  The 3B charges the ball, barehands it and tries to make the play to first.  If 3B's DEFENSE+ROLL+BATTER'S SPEED+BUNT is less than 15 batter is out and all runners advance 1 base."]
[{"$nulls":3},71]
[{"$nulls":10},218,{"$nulls":10},1,2,3,4,5,6,7,8,9,10]
[{"$nulls":20},1,2,2,2,2,1,1,1,1,1,1]
[{"$nulls":20},2,2,2,1,1,1,1,1,1,1,1]
[null,1,2,3,4,5,6,7,8,9,10,{"$nulls":9},3,2,2,1,1,1,1,1,1,1,0]
[1,"None","None","2B -5/CF -3",{"$nulls":16},4,2,2,1,1,1,1,1,0,0,0]
[2,"None","None",{"$nulls":17},5,2,1,1,1,1,0,0,0,0,0]
[3,"C -3/P -3","P -1/LF -4"]
[4,"1B -1/2B -2","1B -3/CF -2"]
[5,"SS -1/3B -4","2B -4/RF -5"]
[6,"RF -2/CF -3",{"$nulls":23},4,{"$f":"INDEX(U14:AE18,MATCH(Z22,U14:U18,0),9)","v":0}]
[7,"LF -4/DH -5"]
[8,"C -1/DH -2"]
[9,"None"]
[10,"None"]